uima-dev mailing list archives

Site index · List index
Message view « Date » · « Thread »
Top « Date » · « Thread »
From Apache Jenkins Server <jenk...@builds.apache.org>
Subject Build failed in Jenkins: UIMA-AS #237
Date Sat, 15 Jun 2013 01:18:28 GMT
See <https://builds.apache.org/job/UIMA-AS/237/>

------------------------------------------
Started by upstream project "UIMA-SDK" build number 350
originally caused by: 
 Started by an SCM change
Building remotely on ubuntu1 in workspace <https://builds.apache.org/job/UIMA-AS/ws/>
Updating https://svn.apache.org/repos/asf/uima/uima-as/trunk
At revision 1493293
WARNING: clock of the subversion server appears to be out of sync. This can result in inconsistent
check out behavior.
no change for https://svn.apache.org/repos/asf/uima/uima-as/trunk since the previous build
Parsing POMs
[trunk] $ /home/hudson/tools/java/latest1.5/bin/java -cp /home/jenkins/jenkins-slave/maven3-agent.jar:/home/hudson/tools/maven/apache-maven-3.0.3/boot/plexus-classworlds-2.4.jar
org.jvnet.hudson.maven3.agent.Maven3Main /home/hudson/tools/maven/apache-maven-3.0.3 /home/jenkins/jenkins-slave/slave.jar
/home/jenkins/jenkins-slave/maven3-interceptor.jar 51959
<===[JENKINS REMOTING CAPACITY]===>channel started
   log4j:WARN No appenders could be found for logger (org.apache.commons.beanutils.converters.BooleanConverter).
log4j:WARN Please initialize the log4j system properly.
Executing Maven:  -B -f <https://builds.apache.org/job/UIMA-AS/ws/trunk/pom.xml> -Dmaven.repo.local=<https://builds.apache.org/job/UIMA-AS/ws/.repository>
clean install -Pextended-test
[INFO] Scanning for projects...
[WARNING] 
[WARNING] Some problems were encountered while building the effective model for org.apache.uima:uima-as:pom:2.4.1-SNAPSHOT
[WARNING] 'profiles.profile[build eclipse plugins].plugins.plugin.(groupId:artifactId)' must
be unique but found duplicate declaration of plugin org.apache.maven.plugins:maven-antrun-plugin
@ org.apache.uima:parent-pom:5-SNAPSHOT, <https://builds.apache.org/job/UIMA-AS/ws/.repository/org/apache/uima/parent-pom/5-SNAPSHOT/parent-pom-5-SNAPSHOT.pom,>
line 1390, column 19
[WARNING] 
[WARNING] It is highly recommended to fix these problems because they threaten the stability
of your build.
[WARNING] 
[INFO] [WARNING] For this reason, future Maven versions might no longer support building such
malformed projects.
[WARNING] 
------------------------------------------------------------------------
[INFO] Reactor Build Order:
[INFO] 
[INFO] Apache UIMA-AS: uima-as-parent
[INFO] Apache UIMA-AS: uimaj-as-core
[INFO] Apache UIMA-AS: uimaj-as-jms
[INFO] Apache UIMA-AS: uimaj-as-activemq
[INFO] Apache UIMA-AS Eclipse Plugin: uimaj-ep-runtime-deployeditor
[INFO] Apache UIMA-AS Eclipse Plugin: uimaj-ep-deployeditor
[INFO] Apache UIMA AS: uimaj-as-osgi-runtime
[INFO] Apache UIMA-AS: uimaj-as-camel
[INFO] Apache UIMA Eclipse: uimaj-eclipse-feature-deployeditor
[INFO] Apache UIMA-AS Aggregate: aggregate-uima-as-eclipse-plugins
[INFO] Apache UIMA-AS: uima-as-docbooks
[INFO] Apache UIMA-AS Aggregate: aggregate-uima-as
[INFO] Apache UIMA-AS: uima-as
[INFO]                                                                         
[INFO] ------------------------------------------------------------------------
[INFO] Building Apache UIMA-AS: uima-as-parent 2.4.1-SNAPSHOT
[INFO] ------------------------------------------------------------------------
[INFO] [INFO] Deleting <https://builds.apache.org/job/UIMA-AS/ws/trunk/uima-as-parent/target>

[INFO] --- maven-clean-plugin:2.5:clean (default-clean) @ uima-as-parent ---
[INFO] 
[INFO] --- build-helper-maven-plugin:1.7:parse-version (parse-project-version) @ uima-as-parent
---
[INFO] 
[INFO] --- uima-build-helper-maven-plugin:4:parse-date-time (set buildYear and buildMonth)
@ uima-as-parent ---
[INFO] 
[INFO] --- maven-remote-resources-plugin:1.4:process (default) @ uima-as-parent ---
[INFO] 
[INFO] --- maven-site-plugin:3.2:attach-descriptor (attach-descriptor) @ uima-as-parent ---
[INFO] [INFO] Installing <https://builds.apache.org/job/UIMA-AS/ws/trunk/uima-as-parent/pom.xml>
to <https://builds.apache.org/job/UIMA-AS/ws/.repository/org/apache/uima/uima-as-parent/2.4.1-SNAPSHOT/uima-as-parent-2.4.1-SNAPSHOT.pom>

[INFO] --- maven-install-plugin:2.3.1:install (default-install) @ uima-as-parent ---
[INFO]                                                                         
[INFO] ------------------------------------------------------------------------
[INFO] Building Apache UIMA-AS: uimaj-as-core 2.4.1-SNAPSHOT
[INFO] ------------------------------------------------------------------------
[INFO] Deleting <https://builds.apache.org/job/UIMA-AS/ws/trunk/uimaj-as-core/target>
[INFO] 
[INFO] --- maven-clean-plugin:2.5:clean (default-clean) @ uimaj-as-core ---
[INFO] 
[INFO] --- build-helper-maven-plugin:1.5:parse-version (parse-project-version) @ uimaj-as-core
---
[INFO] 
[INFO] --- uima-build-helper-maven-plugin:4:parse-date-time (set buildYear and buildMonth)
@ uimaj-as-core ---
[INFO] 
[INFO] --- maven-resources-plugin:2.6:copy-resources (setVersions) @ uimaj-as-core ---
[INFO] Using 'UTF-8' encoding to copy filtered resources.
[INFO] Copying 1 resource
[INFO] [INFO] Source directory: <https://builds.apache.org/job/UIMA-AS/ws/trunk/uimaj-as-core/target/generated-sources/releaseVersion>
added.

[INFO] --- build-helper-maven-plugin:1.5:add-source (addVersionSrc) @ uimaj-as-core ---
[INFO] 
[INFO] --- xmlbeans-maven-plugin:2.3.3:xmlbeans (default) @ uimaj-as-core ---
[INFO] 
[INFO] --- maven-remote-resources-plugin:1.4:process (default) @ uimaj-as-core ---
[INFO] Using 'UTF-8' encoding to copy filtered resources.
[INFO] [INFO] Copying 1 resource
[INFO] Copying 172 resources

[INFO] --- maven-resources-plugin:2.6:resources (default-resources) @ uimaj-as-core ---
[INFO] Copying 3 resources
[INFO] 
[INFO] --- maven-compiler-plugin:2.5.1:compile (default-compile) @ uimaj-as-core ---
[INFO] Compiling 210 source files to <https://builds.apache.org/job/UIMA-AS/ws/trunk/uimaj-as-core/target/classes>
[INFO] -------------------------------------------------------------
[ERROR] COMPILATION ERROR : 
[INFO] -------------------------------------------------------------
[ERROR] <https://builds.apache.org/job/UIMA-AS/ws/trunk/uimaj-as-core/src/main/java/org/apache/uima/aae/handler/input/ProcessResponseHandler.java>:[416,17]
deserializeCAS(org.apache.uima.cas.CAS,java.io.InputStream) in org.apache.uima.cas.impl.Serialization
cannot be applied to (org.apache.uima.cas.CAS,java.io.ByteArrayInputStream,org.apache.uima.cas.impl.TypeSystemImpl,org.apache.uima.cas.impl.BinaryCasSerDes6.ReuseInfo,org.apache.uima.cas.impl.AllowPreexistingFS)
[ERROR] <https://builds.apache.org/job/UIMA-AS/ws/trunk/uimaj-as-core/src/main/java/org/apache/uima/aae/handler/input/ProcessRequestHandler_impl.java>:[228,33]
deserializeCAS(org.apache.uima.cas.CAS,java.io.InputStream) in org.apache.uima.cas.impl.Serialization
cannot be applied to (org.apache.uima.cas.CAS,java.io.ByteArrayInputStream,org.apache.uima.cas.impl.TypeSystemImpl,<nulltype>)
[INFO] 2 errors 
[INFO] -------------------------------------------------------------
[INFO] ------------------------------------------------------------------------
[INFO] Reactor Summary:
[INFO] 
[INFO] Apache UIMA-AS: uima-as-parent .................... SUCCESS [22.798s]
[INFO] Apache UIMA-AS: uimaj-as-core ..................... FAILURE [6.588s]
[INFO] Apache UIMA-AS: uimaj-as-jms ...................... SKIPPED
[INFO] Apache UIMA-AS: uimaj-as-activemq ................. SKIPPED
[INFO] Apache UIMA-AS Eclipse Plugin: uimaj-ep-runtime-deployeditor  SKIPPED
[INFO] Apache UIMA-AS Eclipse Plugin: uimaj-ep-deployeditor  SKIPPED
[INFO] Apache UIMA AS: uimaj-as-osgi-runtime ............. SKIPPED
[INFO] Apache UIMA-AS: uimaj-as-camel .................... SKIPPED
[INFO] Apache UIMA Eclipse: uimaj-eclipse-feature-deployeditor  SKIPPED
[INFO] Apache UIMA-AS Aggregate: aggregate-uima-as-eclipse-plugins  SKIPPED
[INFO] Apache UIMA-AS: uima-as-docbooks .................. SKIPPED
[INFO] Apache UIMA-AS Aggregate: aggregate-uima-as ....... SKIPPED
[INFO] Apache UIMA-AS: uima-as ........................... SKIPPED
[INFO] ------------------------------------------------------------------------
[INFO] BUILD FAILURE
[INFO] ------------------------------------------------------------------------
[INFO] Total time: 32.957s
[INFO] Finished at: Sat Jun 15 01:18:18 UTC 2013
[INFO] Final Memory: 23M/211M
[INFO] ------------------------------------------------------------------------
[JENKINS] Archiving <https://builds.apache.org/job/UIMA-AS/ws/trunk/uima-as-docbooks/pom.xml>
to /home/hudson/hudson/jobs/UIMA-AS/modules/org.apache.uima$uima-as-docbooks/builds/2013-06-15_01-17-31/archive/org.apache.uima/uima-as-docbooks/2.4.1-SNAPSHOT/uima-as-docbooks-2.4.1-SNAPSHOT.pom
[JENKINS] Archiving <https://builds.apache.org/job/UIMA-AS/ws/trunk/uimaj-ep-runtime-deployeditor/pom.xml>
to /home/hudson/hudson/jobs/UIMA-AS/modules/org.apache.uima$uimaj-ep-runtime-deployeditor/builds/2013-06-15_01-17-31/archive/org.apache.uima/uimaj-ep-runtime-deployeditor/2.4.1-SNAPSHOT/uimaj-ep-runtime-deployeditor-2.4.1-SNAPSHOT.pom
[JENKINS] Archiving <https://builds.apache.org/job/UIMA-AS/ws/trunk/aggregate-uima-as-eclipse-plugins/pom.xml>
to /home/hudson/hudson/jobs/UIMA-AS/modules/org.apache.uima$aggregate-uima-as-eclipse-plugins/builds/2013-06-15_01-17-31/archive/org.apache.uima/aggregate-uima-as-eclipse-plugins/2.4.1-SNAPSHOT/aggregate-uima-as-eclipse-plugins-2.4.1-SNAPSHOT.pom
[JENKINS] Archiving <https://builds.apache.org/job/UIMA-AS/ws/trunk/uimaj-as-jms/pom.xml>
to /home/hudson/hudson/jobs/UIMA-AS/modules/org.apache.uima$uimaj-as-jms/builds/2013-06-15_01-17-31/archive/org.apache.uima/uimaj-as-jms/2.4.1-SNAPSHOT/uimaj-as-jms-2.4.1-SNAPSHOT.pom
[JENKINS] Archiving <https://builds.apache.org/job/UIMA-AS/ws/trunk/uimaj-as-osgi-runtime/pom.xml>
to /home/hudson/hudson/jobs/UIMA-AS/modules/org.apache.uima$uimaj-as-osgi-runtime/builds/2013-06-15_01-17-31/archive/org.apache.uima/uimaj-as-osgi-runtime/2.4.1-SNAPSHOT/uimaj-as-osgi-runtime-2.4.1-SNAPSHOT.pom
[JENKINS] Archiving <https://builds.apache.org/job/UIMA-AS/ws/trunk/aggregate-uima-as/pom.xml>
to /home/hudson/hudson/jobs/UIMA-AS/modules/org.apache.uima$aggregate-uima-as/builds/2013-06-15_01-17-30/archive/org.apache.uima/aggregate-uima-as/2.4.1-SNAPSHOT/aggregate-uima-as-2.4.1-SNAPSHOT.pom
[JENKINS] Archiving <https://builds.apache.org/job/UIMA-AS/ws/trunk/uimaj-as-activemq/pom.xml>
to /home/hudson/hudson/jobs/UIMA-AS/modules/org.apache.uima$uimaj-as-activemq/builds/2013-06-15_01-17-30/archive/org.apache.uima/uimaj-as-activemq/2.4.1-SNAPSHOT/uimaj-as-activemq-2.4.1-SNAPSHOT.pom
[JENKINS] Archiving <https://builds.apache.org/job/UIMA-AS/ws/trunk/uima-as-parent/pom.xml>
to /home/hudson/hudson/jobs/UIMA-AS/modules/org.apache.uima$uima-as-parent/builds/2013-06-15_01-17-30/archive/org.apache.uima/uima-as-parent/2.4.1-SNAPSHOT/uima-as-parent-2.4.1-SNAPSHOT.pom
[JENKINS] Archiving <https://builds.apache.org/job/UIMA-AS/ws/trunk/uimaj-as-core/pom.xml>
to /home/hudson/hudson/jobs/UIMA-AS/modules/org.apache.uima$uimaj-as-core/builds/2013-06-15_01-17-31/archive/org.apache.uima/uimaj-as-core/2.4.1-SNAPSHOT/uimaj-as-core-2.4.1-SNAPSHOT.pom
[JENKINS] Archiving <https://builds.apache.org/job/UIMA-AS/ws/trunk/uimaj-eclipse-feature-deployeditor/pom.xml>
to /home/hudson/hudson/jobs/UIMA-AS/modules/org.apache.uima$uimaj-eclipse-feature-deployeditor/builds/2013-06-15_01-17-31/archive/org.apache.uima/uimaj-eclipse-feature-deployeditor/2.4.0/uimaj-eclipse-feature-deployeditor-2.4.0.pom
[JENKINS] Archiving <https://builds.apache.org/job/UIMA-AS/ws/trunk/uimaj-ep-deployeditor/pom.xml>
to /home/hudson/hudson/jobs/UIMA-AS/modules/org.apache.uima$uimaj-ep-deployeditor/builds/2013-06-15_01-17-31/archive/org.apache.uima/uimaj-ep-deployeditor/2.4.1-SNAPSHOT/uimaj-ep-deployeditor-2.4.1-SNAPSHOT.pom
[JENKINS] Archiving <https://builds.apache.org/job/UIMA-AS/ws/trunk/uimaj-as-camel/pom.xml>
to /home/hudson/hudson/jobs/UIMA-AS/modules/org.apache.uima$uimaj-as-camel/builds/2013-06-15_01-17-31/archive/org.apache.uima/uimaj-as-camel/2.4.1-SNAPSHOT/uimaj-as-camel-2.4.1-SNAPSHOT.pom
[JENKINS] Archiving <https://builds.apache.org/job/UIMA-AS/ws/trunk/pom.xml> to /home/hudson/hudson/jobs/UIMA-AS/modules/org.apache.uima$uima-as/builds/2013-06-15_01-17-30/archive/org.apache.uima/uima-as/2.4.1-SNAPSHOT/uima-as-2.4.1-SNAPSHOT.pom
Waiting for Jenkins to finish collecting data
mavenExecutionResult exceptions not empty
message : Failed to execute goal org.apache.maven.plugins:maven-compiler-plugin:2.5.1:compile
(default-compile) on project uimaj-as-core: Compilation failure
cause : Compilation failure
Stack trace : 
org.apache.maven.lifecycle.LifecycleExecutionException: Failed to execute goal org.apache.maven.plugins:maven-compiler-plugin:2.5.1:compile
(default-compile) on project uimaj-as-core: Compilation failure
	at org.apache.maven.lifecycle.internal.MojoExecutor.execute(MojoExecutor.java:213)
	at org.apache.maven.lifecycle.internal.MojoExecutor.execute(MojoExecutor.java:153)
	at org.apache.maven.lifecycle.internal.MojoExecutor.execute(MojoExecutor.java:145)
	at org.apache.maven.lifecycle.internal.LifecycleModuleBuilder.buildProject(LifecycleModuleBuilder.java:84)
	at org.apache.maven.lifecycle.internal.LifecycleModuleBuilder.buildProject(LifecycleModuleBuilder.java:59)
	at org.apache.maven.lifecycle.internal.LifecycleStarter.singleThreadedBuild(LifecycleStarter.java:183)
	at org.apache.maven.lifecycle.internal.LifecycleStarter.execute(LifecycleStarter.java:161)
	at org.apache.maven.DefaultMaven.doExecute(DefaultMaven.java:319)
	at org.apache.maven.DefaultMaven.execute(DefaultMaven.java:156)
	at org.jvnet.hudson.maven3.launcher.Maven3Launcher.main(Maven3Launcher.java:79)
	at sun.reflect.NativeMethodAccessorImpl.invoke0(Native Method)
	at sun.reflect.NativeMethodAccessorImpl.invoke(NativeMethodAccessorImpl.java:39)
	at sun.reflect.DelegatingMethodAccessorImpl.invoke(DelegatingMethodAccessorImpl.java:25)
	at java.lang.reflect.Method.invoke(Method.java:592)
	at org.codehaus.plexus.classworlds.launcher.Launcher.launchStandard(Launcher.java:329)
	at org.codehaus.plexus.classworlds.launcher.Launcher.launch(Launcher.java:239)
	at org.jvnet.hudson.maven3.agent.Maven3Main.launch(Maven3Main.java:158)
	at hudson.maven.Maven3Builder.call(Maven3Builder.java:100)
	at hudson.maven.Maven3Builder.call(Maven3Builder.java:66)
	at hudson.remoting.UserRequest.perform(UserRequest.java:118)
	at hudson.remoting.UserRequest.perform(UserRequest.java:48)
	at hudson.remoting.Request$2.run(Request.java:326)
	at hudson.remoting.InterceptingExecutorService$1.call(InterceptingExecutorService.java:72)
	at java.util.concurrent.FutureTask$Sync.innerRun(FutureTask.java:269)
	at java.util.concurrent.FutureTask.run(FutureTask.java:123)
	at java.util.concurrent.ThreadPoolExecutor$Worker.runTask(ThreadPoolExecutor.java:651)
	at java.util.concurrent.ThreadPoolExecutor$Worker.run(ThreadPoolExecutor.java:676)
	at java.lang.Thread.run(Thread.java:595)
Caused by: org.apache.maven.plugin.CompilationFailureException: Compilation failure
	at org.apache.maven.plugin.AbstractCompilerMojo.execute(AbstractCompilerMojo.java:729)
	at org.apache.maven.plugin.CompilerMojo.execute(CompilerMojo.java:128)
	at org.apache.maven.plugin.DefaultBuildPluginManager.executeMojo(DefaultBuildPluginManager.java:101)
	at org.apache.maven.lifecycle.internal.MojoExecutor.execute(MojoExecutor.java:209)
	... 27 more
Sending e-mails to: dev@uima.apache.org
channel stopped

Mime
View raw message