uima-dev mailing list archives

Site index · List index
Message view « Date » · « Thread »
Top « Date » · « Thread »
From Apache Jenkins Server <jenk...@builds.apache.org>
Subject Build failed in Jenkins: UIMA-Ruta #140
Date Fri, 28 Jun 2013 17:21:17 GMT
See <https://builds.apache.org/job/UIMA-Ruta/140/>

------------------------------------------
[...truncated 35329 lines...]

[INFO] --- maven-compiler-plugin:2.3.2:testCompile (default-testCompile) @ ruta-ep-caseditor
---
[INFO] 
[INFO] --- maven-surefire-plugin:2.9:test (default-test) @ ruta-ep-caseditor ---[INFO] Surefire
report directory: F:\hudson\hudson-slave\workspace\UIMA-Ruta\trunk\ruta-ep-caseditor\target\surefire-reports


-------------------------------------------------------
 T E S T S
-------------------------------------------------------

Results :

Tests run: 0, Failures: 0, Errors: 0, Skipped: 0

[JENKINS] Recording test results
[INFO] 
[INFO] --- maven-resources-plugin:2.5:copy-resources (copy customized bin LICENSE file) @
ruta-ep-caseditor ---
[debug] execute contextualize
[INFO] Using 'UTF-8' encoding to copy filtered resources.
[INFO] Copying 1 resource
[INFO] [INFO] Building jar: F:\hudson\hudson-slave\workspace\UIMA-Ruta\trunk\ruta-ep-caseditor\target\org.apache.uima.ruta.caseditor_2.0.2.SNAPSHOT.jar

[INFO] --- maven-jar-plugin:2.3.1:jar (default-jar) @ ruta-ep-caseditor ---
[INFO] 
[INFO] --- maven-site-plugin:3.0:attach-descriptor (attach-descriptor) @ ruta-ep-caseditor
---
[INFO] [INFO] Installing F:\hudson\hudson-slave\workspace\UIMA-Ruta\trunk\ruta-ep-caseditor\target\org.apache.uima.ruta.caseditor_2.0.2.SNAPSHOT.jar
to f:\hudson\hudson-slave\maven-repositories\1\org\apache\uima\ruta-ep-caseditor\2.0.2-SNAPSHOT\ruta-ep-caseditor-2.0.2-SNAPSHOT.jar

[INFO] --- maven-install-plugin:2.3.1:install (default-install) @ ruta-ep-caseditor ---
[INFO] Installing F:\hudson\hudson-slave\workspace\UIMA-Ruta\trunk\ruta-ep-caseditor\pom.xml
to f:\hudson\hudson-slave\maven-repositories\1\org\apache\uima\ruta-ep-caseditor\2.0.2-SNAPSHOT\ruta-ep-caseditor-2.0.2-SNAPSHOT.pom
[INFO] 
[INFO] --- maven-pmd-plugin:2.7.1:pmd (default-cli) @ ruta-ep-caseditor ---
[WARNING] Unable to locate Source XRef to link to - DISABLED
[PMD] Finding all files that match the pattern pmd.xml
[PMD] Parsing 1 files in F:\hudson\hudson-slave\workspace\UIMA-Ruta\trunk\ruta-ep-caseditor\target
[PMD] Successfully parsed file F:\hudson\hudson-slave\workspace\UIMA-Ruta\trunk\ruta-ep-caseditor\target\pmd.xml
of module Apache UIMA Ruta Eclipse: ruta-ep-caseditor with 5 warnings.
[PMD] Computing warning deltas based on reference build #139
[INFO] 
[INFO] --- maven-pmd-plugin:2.7.1:cpd (default-cli) @ ruta-ep-caseditor ---
[WARNING] Unable to locate Source XRef to link to - DISABLED
[DRY] Finding all files that match the pattern cpd.xml
[DRY] Parsing 1 files in F:\hudson\hudson-slave\workspace\UIMA-Ruta\trunk\ruta-ep-caseditor\target
[DRY] Successfully parsed file F:\hudson\hudson-slave\workspace\UIMA-Ruta\trunk\ruta-ep-caseditor\target\cpd.xml
of module Apache UIMA Ruta Eclipse: ruta-ep-caseditor with 0 warnings.
[DRY] Computing warning deltas based on reference build #139
[INFO] 
[INFO] --- findbugs-maven-plugin:2.5.2:findbugs (default-cli) @ ruta-ep-caseditor ---
[INFO] Fork Value is true
     [java] The following classes needed for analysis were missing:
     [java]   com.ibm.icu.text.MessageFormat
     [java]   com.ibm.icu.text.Bidi
     [java]   org.eclipse.core.internal.runtime.auth.AuthorizationHandler
     [java] Warnings generated: 6
     [java] Missing classes: 3
[INFO] Done FindBugs Analysis....
[FINDBUGS] Finding all files that match the pattern findbugsXml.xml
[FINDBUGS] Parsing 1 files in F:\hudson\hudson-slave\workspace\UIMA-Ruta\trunk\ruta-ep-caseditor\target
[FINDBUGS] Successfully parsed file F:\hudson\hudson-slave\workspace\UIMA-Ruta\trunk\ruta-ep-caseditor\target\findbugsXml.xml
of module Apache UIMA Ruta Eclipse: ruta-ep-caseditor with 6 warnings.
[FINDBUGS] Computing warning deltas based on reference build #139
[INFO] 
[INFO] --- build-helper-maven-plugin:1.7:parse-version (parse-project-version) @ ruta-ep-caseditor
---
[INFO] 
[INFO] --- uima-build-helper-maven-plugin:4:parse-date-time (set buildYear and buildMonth)
@ ruta-ep-caseditor ---
[INFO] 
[INFO] --- maven-remote-resources-plugin:1.2.1:process (default) @ ruta-ep-caseditor ---
[debug] execute contextualize
[INFO] [INFO] Using 'UTF-8' encoding to copy filtered resources.

[INFO] --- maven-resources-plugin:2.5:resources (default-resources) @ ruta-ep-caseditor ---
[INFO] Copying 2 resources
[INFO] skip non existing resourceDirectory F:\hudson\hudson-slave\workspace\UIMA-Ruta\trunk\ruta-ep-caseditor\src\main\resources
[INFO] Copying 0 resource
[INFO] Copying 3 resources
[INFO] Copying 3 resources
[INFO] 
[INFO] --- maven-compiler-plugin:2.3.2:compile (default-compile) @ ruta-ep-caseditor ---
[INFO] Nothing to compile - all classes are up to date
[INFO] 
[INFO] --- maven-bundle-plugin:2.3.4:manifest (uima-bundle) @ ruta-ep-caseditor ---
[INFO] 
[INFO] --- cobertura-maven-plugin:2.5.2:instrument (default-cli) @ ruta-ep-caseditor ---
[INFO] Cobertura 1.9.4.1 - GNU GPL License (NO WARRANTY) - See COPYRIGHT file
Instrumenting 30 files to F:\hudson\hudson-slave\workspace\UIMA-Ruta\trunk\ruta-ep-caseditor\target\generated-classes\cobertura
Cobertura: Saved information on 30 classes.
Instrument time: 193ms

[INFO] Instrumentation was successful.
[INFO] NOT adding cobertura ser file to attached artifacts list.
[INFO] 
[INFO] --- maven-resources-plugin:2.5:testResources (default-testResources) @ ruta-ep-caseditor
---
[debug] execute contextualize
[INFO] Using 'UTF-8' encoding to copy filtered resources.
[INFO] skip non existing resourceDirectory F:\hudson\hudson-slave\workspace\UIMA-Ruta\trunk\ruta-ep-caseditor\src\test\resources
[INFO] Copying 3 resources
[INFO] Copying 3 resources
[INFO] 
[INFO] --- maven-compiler-plugin:2.3.2:testCompile (default-testCompile) @ ruta-ep-caseditor
---[INFO] No sources to compile

[INFO] 
[INFO] --- maven-surefire-plugin:2.9:test (default-test) @ ruta-ep-caseditor ---
[INFO] Surefire report directory: F:\hudson\hudson-slave\workspace\UIMA-Ruta\trunk\ruta-ep-caseditor\target\surefire-reports

-------------------------------------------------------
 T E S T S
-------------------------------------------------------

Results :

Tests run: 0, Failures: 0, Errors: 0, Skipped: 0

[JENKINS] Recording test results
[INFO] 
[INFO] --- cobertura-maven-plugin:2.5.2:cobertura (default-cli) @ ruta-ep-caseditor ---
[INFO] Cobertura 1.9.4.1 - GNU GPL License (NO WARRANTY) - See COPYRIGHT file
Cobertura: Loaded information on 30 classes.
Report time: 452ms

[INFO] Cobertura Report generation was successful.
[INFO]                                                                         
Downloading: http://repo1.maven.org/maven2/org/eclipse/m2e/lifecycle-mapping/1.0.0/lifecycle-mapping-1.0.0.pom
[INFO] ------------------------------------------------------------------------
[INFO] Building Apache UIMA Ruta Eclipse: ruta-ep-addons 2.0.2-SNAPSHOT
[INFO] ------------------------------------------------------------------------
[WARNING] The POM for org.eclipse.m2e:lifecycle-mapping:jar:1.0.0 is missing, no dependency
information available
[WARNING] Failed to retrieve plugin descriptor for org.eclipse.m2e:lifecycle-mapping:1.0.0:
Plugin org.eclipse.m2e:lifecycle-mapping:1.0.0 or one of its dependencies could not be resolved:
Failed to read artifact descriptor for org.eclipse.m2e:lifecycle-mapping:jar:1.0.0
Downloading: http://repo1.maven.org/maven2/org/eclipse/m2e/lifecycle-mapping/1.0.0/lifecycle-mapping-1.0.0.pom
[WARNING] The POM for org.eclipse.m2e:lifecycle-mapping:jar:1.0.0 is missing, no dependency
information available
[WARNING] Failed to retrieve plugin descriptor for org.eclipse.m2e:lifecycle-mapping:1.0.0:
Plugin org.eclipse.m2e:lifecycle-mapping:1.0.0 or one of its dependencies could not be resolved:
Failed to read artifact descriptor for org.eclipse.m2e:lifecycle-mapping:jar:1.0.0
Downloading: http://repo1.maven.org/maven2/org/eclipse/m2e/lifecycle-mapping/1.0.0/lifecycle-mapping-1.0.0.pom
[WARNING] The POM for org.eclipse.m2e:lifecycle-mapping:jar:1.0.0 is missing, no dependency
information available
[WARNING] Failed to retrieve plugin descriptor for org.eclipse.m2e:lifecycle-mapping:1.0.0:
Plugin org.eclipse.m2e:lifecycle-mapping:1.0.0 or one of its dependencies could not be resolved:
Failed to read artifact descriptor for org.eclipse.m2e:lifecycle-mapping:jar:1.0.0
Downloading: http://repo1.maven.org/maven2/org/eclipse/m2e/lifecycle-mapping/1.0.0/lifecycle-mapping-1.0.0.pom
[WARNING] The POM for org.eclipse.m2e:lifecycle-mapping:jar:1.0.0 is missing, no dependency
information available
[WARNING] Failed to retrieve plugin descriptor for org.eclipse.m2e:lifecycle-mapping:1.0.0:
Plugin org.eclipse.m2e:lifecycle-mapping:1.0.0 or one of its dependencies could not be resolved:
Failed to read artifact descriptor for org.eclipse.m2e:lifecycle-mapping:jar:1.0.0
[INFO] 
[INFO] --- maven-clean-plugin:2.4.1:clean (default-clean) @ ruta-ep-addons ---
[TASKS] Scanning folder 'F:\hudson\hudson-slave\workspace\UIMA-Ruta\trunk\ruta-ep-addons'
for files matching the pattern '**/*.java' - excludes: 
[TASKS] Found 185 files to scan for tasks
Found 46 open tasks.
[TASKS] Computing warning deltas based on reference build #137
[INFO] 
[INFO] --- build-helper-maven-plugin:1.7:parse-version (parse-project-version) @ ruta-ep-addons
---
[INFO] 
[INFO] --- uima-build-helper-maven-plugin:4:parse-date-time (set buildYear and buildMonth)
@ ruta-ep-addons ---
[INFO] 
[INFO] --- maven-remote-resources-plugin:1.2.1:process (default) @ ruta-ep-addons ---
[INFO] 
[INFO] --- maven-resources-plugin:2.5:resources (default-resources) @ ruta-ep-addons ---
[debug] execute contextualize
[INFO] Using 'UTF-8' encoding to copy filtered resources.
[INFO] Copying 86 resources
[INFO] skip non existing resourceDirectory F:\hudson\hudson-slave\workspace\UIMA-Ruta\trunk\ruta-ep-addons\src\main\resources
[INFO] Copying 0 resource
[INFO] Copying 3 resources
[INFO] 
[INFO] --- maven-compiler-plugin:2.3.2:compile (default-compile) @ ruta-ep-addons ---
[INFO] Compiling 185 source files to F:\hudson\hudson-slave\workspace\UIMA-Ruta\trunk\ruta-ep-addons\target\classes
[INFO] -------------------------------------------------------------
[ERROR] COMPILATION ERROR : 
[INFO] -------------------------------------------------------------
[ERROR] \hudson\hudson-slave\workspace\UIMA-Ruta\trunk\ruta-ep-addons\src\main\java\org\apache\uima\ruta\check\AnnotationCheckComposite.java:[565,15]
setAnnotationMode(org.apache.uima.cas.Type) has protected access in org.apache.uima.caseditor.editor.AnnotationEditor
[INFO] 1 error
[INFO] -------------------------------------------------------------
[INFO] ------------------------------------------------------------------------
[INFO] Reactor Summary:
[INFO] 
[INFO] Apache UIMA Ruta: ruta-parent ..................... SUCCESS [7.325s]
[INFO] Apache UIMA Ruta: ruta-core ....................... SUCCESS [3:26.795s]
[INFO] Apache UIMA Ruta Eclipse: ruta-ep-engine .......... SUCCESS [5:53.028s]
[INFO] Apache UIMA Ruta Eclipse: ruta-ep-ide ............. SUCCESS [3:02.589s]
[INFO] Apache UIMA Ruta Eclipse: ruta-ep-caseditor ....... SUCCESS [23.928s]
[INFO] Apache UIMA Ruta Eclipse: ruta-ep-addons .......... FAILURE [9.762s]
[INFO] Apache UIMA Ruta Eclipse: ruta-ep-textruler ....... SKIPPED
[INFO] Apache UIMA Ruta Documentation .................... SKIPPED
[INFO] Apache UIMA Ruta Eclipse: ruta-eclipse-feature .... SKIPPED
[INFO] Apache UIMA Ruta: ruta-ep-example-extensions ...... SKIPPED
[INFO] Apache UIMA Ruta: ruta ............................ SKIPPED
[INFO] ------------------------------------------------------------------------
[INFO] BUILD FAILURE
[INFO] ------------------------------------------------------------------------
[INFO] Total time: 13:16.162s
[INFO] Finished at: Fri Jun 28 18:21:04 BST 2013
[INFO] Final Memory: 97M/415M
[INFO] ------------------------------------------------------------------------
[JENKINS] Archiving F:\hudson\hudson-slave\workspace\UIMA-Ruta\trunk\ruta-docbook\pom.xml
to /home/hudson/hudson/jobs/UIMA-Ruta/modules/org.apache.uima$ruta-docbook/builds/2013-06-28_17-07-48/archive/org.apache.uima/ruta-docbook/2.0.2-SNAPSHOT/ruta-docbook-2.0.2-SNAPSHOT.pom
[JENKINS] Archiving <https://builds.apache.org/job/UIMA-Ruta/ws/trunk\pom.xml> to /home/hudson/hudson/jobs/UIMA-Ruta/modules/org.apache.uima$ruta/builds/2013-06-28_17-07-48/archive/org.apache.uima/ruta/2.0.2-SNAPSHOT/ruta-2.0.2-SNAPSHOT.pom
[JENKINS] Archiving F:\hudson\hudson-slave\workspace\UIMA-Ruta\trunk\ruta-ep-ide\pom.xml to
/home/hudson/hudson/jobs/UIMA-Ruta/modules/org.apache.uima$ruta-ep-ide/builds/2013-06-28_17-07-48/archive/org.apache.uima/ruta-ep-ide/2.0.2-SNAPSHOT/ruta-ep-ide-2.0.2-SNAPSHOT.pom
[JENKINS] Archiving F:\hudson\hudson-slave\workspace\UIMA-Ruta\trunk\ruta-ep-ide\target\org.apache.uima.ruta.ide_2.0.2.SNAPSHOT.jar
to /home/hudson/hudson/jobs/UIMA-Ruta/modules/org.apache.uima$ruta-ep-ide/builds/2013-06-28_17-07-48/archive/org.apache.uima/ruta-ep-ide/2.0.2-SNAPSHOT/ruta-ep-ide-2.0.2-SNAPSHOT.jar
[JENKINS] Archiving F:\hudson\hudson-slave\workspace\UIMA-Ruta\trunk\example-projects\ruta-ep-example-extensions\pom.xml
to /home/hudson/hudson/jobs/UIMA-Ruta/modules/org.apache.uima$ruta-ep-example-extensions/builds/2013-06-28_17-07-48/archive/org.apache.uima/ruta-ep-example-extensions/2.0.2-SNAPSHOT/ruta-ep-example-extensions-2.0.2-SNAPSHOT.pom
[JENKINS] Archiving F:\hudson\hudson-slave\workspace\UIMA-Ruta\trunk\ruta-parent\pom.xml to
/home/hudson/hudson/jobs/UIMA-Ruta/modules/org.apache.uima$ruta-parent/builds/2013-06-28_17-07-48/archive/org.apache.uima/ruta-parent/2.0.2-SNAPSHOT/ruta-parent-2.0.2-SNAPSHOT.pom
[JENKINS] Archiving F:\hudson\hudson-slave\workspace\UIMA-Ruta\trunk\ruta-ep-engine\pom.xml
to /home/hudson/hudson/jobs/UIMA-Ruta/modules/org.apache.uima$ruta-ep-engine/builds/2013-06-28_17-07-48/archive/org.apache.uima/ruta-ep-engine/2.0.2-SNAPSHOT/ruta-ep-engine-2.0.2-SNAPSHOT.pom
[JENKINS] Archiving F:\hudson\hudson-slave\workspace\UIMA-Ruta\trunk\ruta-ep-engine\target\org.apache.uima.ruta.engine_2.0.2.SNAPSHOT.jar
to /home/hudson/hudson/jobs/UIMA-Ruta/modules/org.apache.uima$ruta-ep-engine/builds/2013-06-28_17-07-48/archive/org.apache.uima/ruta-ep-engine/2.0.2-SNAPSHOT/ruta-ep-engine-2.0.2-SNAPSHOT.jar
[JENKINS] Archiving F:\hudson\hudson-slave\workspace\UIMA-Ruta\trunk\ruta-ep-addons\pom.xml
to /home/hudson/hudson/jobs/UIMA-Ruta/modules/org.apache.uima$ruta-ep-addons/builds/2013-06-28_17-07-48/archive/org.apache.uima/ruta-ep-addons/2.0.2-SNAPSHOT/ruta-ep-addons-2.0.2-SNAPSHOT.pom
[JENKINS] Archiving F:\hudson\hudson-slave\workspace\UIMA-Ruta\trunk\ruta-ep-caseditor\pom.xml
to /home/hudson/hudson/jobs/UIMA-Ruta/modules/org.apache.uima$ruta-ep-caseditor/builds/2013-06-28_17-07-48/archive/org.apache.uima/ruta-ep-caseditor/2.0.2-SNAPSHOT/ruta-ep-caseditor-2.0.2-SNAPSHOT.pom
[JENKINS] Archiving F:\hudson\hudson-slave\workspace\UIMA-Ruta\trunk\ruta-ep-caseditor\target\org.apache.uima.ruta.caseditor_2.0.2.SNAPSHOT.jar
to /home/hudson/hudson/jobs/UIMA-Ruta/modules/org.apache.uima$ruta-ep-caseditor/builds/2013-06-28_17-07-48/archive/org.apache.uima/ruta-ep-caseditor/2.0.2-SNAPSHOT/ruta-ep-caseditor-2.0.2-SNAPSHOT.jar
[JENKINS] Archiving F:\hudson\hudson-slave\workspace\UIMA-Ruta\trunk\ruta-ep-textruler\pom.xml
to /home/hudson/hudson/jobs/UIMA-Ruta/modules/org.apache.uima$ruta-ep-textruler/builds/2013-06-28_17-07-48/archive/org.apache.uima/ruta-ep-textruler/2.0.2-SNAPSHOT/ruta-ep-textruler-2.0.2-SNAPSHOT.pom
[JENKINS] Archiving F:\hudson\hudson-slave\workspace\UIMA-Ruta\trunk\ruta-core\pom.xml to
/home/hudson/hudson/jobs/UIMA-Ruta/modules/org.apache.uima$ruta-core/builds/2013-06-28_17-07-48/archive/org.apache.uima/ruta-core/2.0.2-SNAPSHOT/ruta-core-2.0.2-SNAPSHOT.pom
[JENKINS] Archiving F:\hudson\hudson-slave\workspace\UIMA-Ruta\trunk\ruta-core\target\ruta-core-2.0.2-SNAPSHOT.jar
to /home/hudson/hudson/jobs/UIMA-Ruta/modules/org.apache.uima$ruta-core/builds/2013-06-28_17-07-48/archive/org.apache.uima/ruta-core/2.0.2-SNAPSHOT/ruta-core-2.0.2-SNAPSHOT.jar
[JENKINS] Archiving F:\hudson\hudson-slave\workspace\UIMA-Ruta\trunk\ruta-eclipse-feature\pom.xml
to /home/hudson/hudson/jobs/UIMA-Ruta/modules/org.apache.uima$ruta-eclipse-feature/builds/2013-06-28_17-07-48/archive/org.apache.uima/ruta-eclipse-feature/2.0.2-SNAPSHOT/ruta-eclipse-feature-2.0.2-SNAPSHOT.pom
Waiting for Jenkins to finish collecting data
mavenExecutionResult exceptions not empty
message : Failed to execute goal org.apache.maven.plugins:maven-compiler-plugin:2.3.2:compile
(default-compile) on project ruta-ep-addons: Compilation failure
\hudson\hudson-slave\workspace\UIMA-Ruta\trunk\ruta-ep-addons\src\main\java\org\apache\uima\ruta\check\AnnotationCheckComposite.java:[565,15]
setAnnotationMode(org.apache.uima.cas.Type) has protected access in org.apache.uima.caseditor.editor.AnnotationEditor

cause : Compilation failure
\hudson\hudson-slave\workspace\UIMA-Ruta\trunk\ruta-ep-addons\src\main\java\org\apache\uima\ruta\check\AnnotationCheckComposite.java:[565,15]
setAnnotationMode(org.apache.uima.cas.Type) has protected access in org.apache.uima.caseditor.editor.AnnotationEditor

Stack trace : 
org.apache.maven.lifecycle.LifecycleExecutionException: Failed to execute goal org.apache.maven.plugins:maven-compiler-plugin:2.3.2:compile
(default-compile) on project ruta-ep-addons: Compilation failure
\hudson\hudson-slave\workspace\UIMA-Ruta\trunk\ruta-ep-addons\src\main\java\org\apache\uima\ruta\check\AnnotationCheckComposite.java:[565,15]
setAnnotationMode(org.apache.uima.cas.Type) has protected access in org.apache.uima.caseditor.editor.AnnotationEditor

	at org.apache.maven.lifecycle.internal.MojoExecutor.execute(MojoExecutor.java:213)
	at org.apache.maven.lifecycle.internal.MojoExecutor.execute(MojoExecutor.java:153)
	at org.apache.maven.lifecycle.internal.MojoExecutor.execute(MojoExecutor.java:145)
	at org.apache.maven.lifecycle.internal.LifecycleModuleBuilder.buildProject(LifecycleModuleBuilder.java:84)
	at org.apache.maven.lifecycle.internal.LifecycleModuleBuilder.buildProject(LifecycleModuleBuilder.java:59)
	at org.apache.maven.lifecycle.internal.LifecycleStarter.singleThreadedBuild(LifecycleStarter.java:183)
	at org.apache.maven.lifecycle.internal.LifecycleStarter.execute(LifecycleStarter.java:161)
	at org.apache.maven.DefaultMaven.doExecute(DefaultMaven.java:319)
	at org.apache.maven.DefaultMaven.execute(DefaultMaven.java:156)
	at org.jvnet.hudson.maven3.launcher.Maven3Launcher.main(Maven3Launcher.java:79)
	at sun.reflect.NativeMethodAccessorImpl.invoke0(Native Method)
	at sun.reflect.NativeMethodAccessorImpl.invoke(NativeMethodAccessorImpl.java:39)
	at sun.reflect.DelegatingMethodAccessorImpl.invoke(DelegatingMethodAccessorImpl.java:25)
	at java.lang.reflect.Method.invoke(Method.java:597)
	at org.codehaus.plexus.classworlds.launcher.Launcher.launchStandard(Launcher.java:329)
	at org.codehaus.plexus.classworlds.launcher.Launcher.launch(Launcher.java:239)
	at org.jvnet.hudson.maven3.agent.Maven3Main.launch(Maven3Main.java:158)
	at hudson.maven.Maven3Builder.call(Maven3Builder.java:100)
	at hudson.maven.Maven3Builder.call(Maven3Builder.java:66)
	at hudson.remoting.UserRequest.perform(UserRequest.java:118)
	at hudson.remoting.UserRequest.perform(UserRequest.java:48)
	at hudson.remoting.Request$2.run(Request.java:326)
	at hudson.remoting.InterceptingExecutorService$1.call(InterceptingExecutorService.java:72)
	at java.util.concurrent.FutureTask$Sync.innerRun(FutureTask.java:303)
	at java.util.concurrent.FutureTask.run(FutureTask.java:138)
	at java.util.concurrent.ThreadPoolExecutor$Worker.runTask(ThreadPoolExecutor.java:886)
	at java.util.concurrent.ThreadPoolExecutor$Worker.run(ThreadPoolExecutor.java:908)
	at java.lang.Thread.run(Thread.java:662)
Caused by: org.apache.maven.plugin.CompilationFailureException: Compilation failure
\hudson\hudson-slave\workspace\UIMA-Ruta\trunk\ruta-ep-addons\src\main\java\org\apache\uima\ruta\check\AnnotationCheckComposite.java:[565,15]
setAnnotationMode(org.apache.uima.cas.Type) has protected access in org.apache.uima.caseditor.editor.AnnotationEditor

	at org.apache.maven.plugin.AbstractCompilerMojo.execute(AbstractCompilerMojo.java:656)
	at org.apache.maven.plugin.CompilerMojo.execute(CompilerMojo.java:128)
	at org.apache.maven.plugin.DefaultBuildPluginManager.executeMojo(DefaultBuildPluginManager.java:107)
	at org.apache.maven.lifecycle.internal.MojoExecutor.execute(MojoExecutor.java:209)
	... 27 more
Sending e-mails to: dev@uima.apache.org
channel stopped
[WARNINGS] Skipping publisher since build result is FAILURE
Skipping Cobertura coverage report as build was not UNSTABLE or better ...

Mime
View raw message