uima-dev mailing list archives

Site index · List index
Message view « Date » · « Thread »
Top « Date » · « Thread »
From Apache Jenkins Server <jenk...@builds.apache.org>
Subject Build failed in Jenkins: UIMA-AS #233
Date Fri, 14 Jun 2013 17:26:25 GMT
See <https://builds.apache.org/job/UIMA-AS/233/changes>

Changes:

[cwiklik] UIMA-2751 removed unnecessary use of initsemaphore

[cwiklik] UIMA-2776 change session expiration default to 60 Minutes

[cwiklik] UIMA-2668 undo the last change as it did not fix npe

[cwiklik] UIMA-2492 fixed out of bounds exception in code producing unique name for performance
metrics

------------------------------------------
[...truncated 66 lines...]
Downloading: http://repository.apache.org/snapshots/org/apache/uima/uimaj-core/2.4.1-SNAPSHOT/uimaj-core-2.4.1-20130613.200445-75.pom
Downloaded: http://repository.apache.org/snapshots/org/apache/uima/uimaj-core/2.4.1-SNAPSHOT/uimaj-core-2.4.1-20130613.200445-75.pom
(8 KB at 54.2 KB/sec)
Downloading: http://repository.apache.org/snapshots/org/apache/uima/uimaj-parent/2.4.1-SNAPSHOT/maven-metadata.xml
Downloaded: http://repository.apache.org/snapshots/org/apache/uima/uimaj-parent/2.4.1-SNAPSHOT/maven-metadata.xml
(606 B at 1.9 KB/sec)
Downloading: http://repository.apache.org/snapshots/org/apache/uima/uimaj-parent/2.4.1-SNAPSHOT/uimaj-parent-2.4.1-20130613.200452-74.pom
Downloaded: http://repository.apache.org/snapshots/org/apache/uima/uimaj-parent/2.4.1-SNAPSHOT/uimaj-parent-2.4.1-20130613.200452-74.pom
(5 KB at 14.0 KB/sec)
Downloading: http://repository.apache.org/snapshots/org/apache/uima/uimaj-core/2.4.1-SNAPSHOT/uimaj-core-2.4.1-20130613.200445-75.jar
Downloaded: http://repository.apache.org/snapshots/org/apache/uima/uimaj-core/2.4.1-SNAPSHOT/uimaj-core-2.4.1-20130613.200445-75.jar
(1389 KB at 846.3 KB/sec)
[INFO] Deleting <https://builds.apache.org/job/UIMA-AS/ws/trunk/uimaj-as-core/target>
[INFO] 
[INFO] --- maven-clean-plugin:2.5:clean (default-clean) @ uimaj-as-core ---
[INFO] 
[INFO] --- build-helper-maven-plugin:1.5:parse-version (parse-project-version) @ uimaj-as-core
---
[INFO] 
[INFO] --- uima-build-helper-maven-plugin:4:parse-date-time (set buildYear and buildMonth)
@ uimaj-as-core ---
[INFO] [INFO] Using 'UTF-8' encoding to copy filtered resources.

[INFO] --- maven-resources-plugin:2.6:copy-resources (setVersions) @ uimaj-as-core ---
[INFO] Copying 1 resource
[INFO] [INFO] Source directory: <https://builds.apache.org/job/UIMA-AS/ws/trunk/uimaj-as-core/target/generated-sources/releaseVersion>
added.

[INFO] --- build-helper-maven-plugin:1.5:add-source (addVersionSrc) @ uimaj-as-core ---
[INFO] 
[INFO] --- xmlbeans-maven-plugin:2.3.3:xmlbeans (default) @ uimaj-as-core ---
[INFO] 
[INFO] --- maven-remote-resources-plugin:1.4:process (default) @ uimaj-as-core ---
[INFO] [INFO] Using 'UTF-8' encoding to copy filtered resources.
[INFO] Copying 1 resource

[INFO] --- maven-resources-plugin:2.6:resources (default-resources) @ uimaj-as-core ---
[INFO] Copying 172 resources
[INFO] Copying 3 resources
[INFO] 
[INFO] --- maven-compiler-plugin:2.5.1:compile (default-compile) @ uimaj-as-core ---
[INFO] Compiling 210 source files to <https://builds.apache.org/job/UIMA-AS/ws/trunk/uimaj-as-core/target/classes>
[INFO] Using 'UTF-8' encoding to copy filtered resources.
[INFO] [INFO] Copying 0 resource
[INFO] Copying 3 resources

[INFO] --- maven-resources-plugin:2.6:testResources (default-testResources) @ uimaj-as-core
---
[INFO] [INFO] Nothing to compile - all classes are up to date

[INFO] --- maven-compiler-plugin:2.5.1:testCompile (default-testCompile) @ uimaj-as-core ---
[INFO] 
[INFO] --- maven-surefire-plugin:2.12.4:test (default-test) @ uimaj-as-core ---
[JENKINS] Recording test results
[INFO] 
[INFO] --- maven-jar-plugin:2.3.2:jar (default-jar) @ uimaj-as-core ---
[INFO] Building jar: <https://builds.apache.org/job/UIMA-AS/ws/trunk/uimaj-as-core/target/uimaj-as-core.jar>
[INFO] 
[INFO] --- maven-site-plugin:3.2:attach-descriptor (attach-descriptor) @ uimaj-as-core ---
[INFO] [INFO] Installing <https://builds.apache.org/job/UIMA-AS/ws/trunk/uimaj-as-core/target/uimaj-as-core.jar>
to <https://builds.apache.org/job/UIMA-AS/ws/.repository/org/apache/uima/uimaj-as-core/2.4.1-SNAPSHOT/uimaj-as-core-2.4.1-SNAPSHOT.jar>
[INFO] Installing <https://builds.apache.org/job/UIMA-AS/ws/trunk/uimaj-as-core/pom.xml>
to <https://builds.apache.org/job/UIMA-AS/ws/.repository/org/apache/uima/uimaj-as-core/2.4.1-SNAPSHOT/uimaj-as-core-2.4.1-SNAPSHOT.pom>

[INFO] --- maven-install-plugin:2.3.1:install (default-install) @ uimaj-as-core ---
[INFO]                                                                         
[INFO] ------------------------------------------------------------------------
[INFO] Building Apache UIMA-AS: uimaj-as-jms 2.4.1-SNAPSHOT
[INFO] ------------------------------------------------------------------------
[INFO] Deleting <https://builds.apache.org/job/UIMA-AS/ws/trunk/uimaj-as-jms/target>
[INFO] 
[INFO] --- maven-clean-plugin:2.5:clean (default-clean) @ uimaj-as-jms ---
[INFO] 
[INFO] --- build-helper-maven-plugin:1.7:parse-version (parse-project-version) @ uimaj-as-jms
---
[INFO] 
[INFO] --- uima-build-helper-maven-plugin:4:parse-date-time (set buildYear and buildMonth)
@ uimaj-as-jms ---
[INFO] 
[INFO] --- maven-remote-resources-plugin:1.4:process (default) @ uimaj-as-jms ---
[INFO] [INFO] Using 'UTF-8' encoding to copy filtered resources.
[INFO] Copying 1 resource
[INFO] Copying 3 resources

[INFO] --- maven-resources-plugin:2.6:resources (default-resources) @ uimaj-as-jms ---
[INFO] 
[INFO] --- maven-compiler-plugin:2.5.1:compile (default-compile) @ uimaj-as-jms ---
[INFO] Compiling 12 source files to <https://builds.apache.org/job/UIMA-AS/ws/trunk/uimaj-as-jms/target/classes>
[INFO] [INFO] Using 'UTF-8' encoding to copy filtered resources.
[INFO] Copying 0 resource
[INFO] Copying 3 resources

[INFO] --- maven-resources-plugin:2.6:testResources (default-testResources) @ uimaj-as-jms
---
[INFO] [INFO] Nothing to compile - all classes are up to date

[INFO] --- maven-compiler-plugin:2.5.1:testCompile (default-testCompile) @ uimaj-as-jms ---
[INFO] 
[INFO] --- maven-surefire-plugin:2.12.4:test (default-test) @ uimaj-as-jms ---
[JENKINS] Recording test results
[INFO] 
[INFO] --- maven-jar-plugin:2.3.2:jar (default-jar) @ uimaj-as-jms ---
[INFO] Building jar: <https://builds.apache.org/job/UIMA-AS/ws/trunk/uimaj-as-jms/target/uimaj-as-jms.jar>
[INFO] 
[INFO] --- maven-site-plugin:3.2:attach-descriptor (attach-descriptor) @ uimaj-as-jms ---
[INFO] [INFO] Installing <https://builds.apache.org/job/UIMA-AS/ws/trunk/uimaj-as-jms/target/uimaj-as-jms.jar>
to <https://builds.apache.org/job/UIMA-AS/ws/.repository/org/apache/uima/uimaj-as-jms/2.4.1-SNAPSHOT/uimaj-as-jms-2.4.1-SNAPSHOT.jar>
[INFO] Installing <https://builds.apache.org/job/UIMA-AS/ws/trunk/uimaj-as-jms/pom.xml>
to <https://builds.apache.org/job/UIMA-AS/ws/.repository/org/apache/uima/uimaj-as-jms/2.4.1-SNAPSHOT/uimaj-as-jms-2.4.1-SNAPSHOT.pom>

[INFO] --- maven-install-plugin:2.3.1:install (default-install) @ uimaj-as-jms ---
[INFO]                                                                         
[INFO] ------------------------------------------------------------------------
[INFO] Building Apache UIMA-AS: uimaj-as-activemq 2.4.1-SNAPSHOT
[INFO] ------------------------------------------------------------------------
Downloading: http://repository.apache.org/snapshots/org/apache/uima/uimaj-examples/2.4.1-SNAPSHOT/maven-metadata.xml
Downloaded: http://repository.apache.org/snapshots/org/apache/uima/uimaj-examples/2.4.1-SNAPSHOT/maven-metadata.xml
(782 B at 3.2 KB/sec)
Downloading: http://repository.apache.org/snapshots/org/apache/uima/uimaj-examples/2.4.1-SNAPSHOT/uimaj-examples-2.4.1-20130613.200452-74.pom
Downloaded: http://repository.apache.org/snapshots/org/apache/uima/uimaj-examples/2.4.1-SNAPSHOT/uimaj-examples-2.4.1-20130613.200452-74.pom
(5 KB at 28.9 KB/sec)
Downloading: http://repository.apache.org/snapshots/org/apache/uima/uimaj-document-annotation/2.4.1-SNAPSHOT/maven-metadata.xml
Downloaded: http://repository.apache.org/snapshots/org/apache/uima/uimaj-document-annotation/2.4.1-SNAPSHOT/maven-metadata.xml
(793 B at 3.2 KB/sec)
Downloading: http://repository.apache.org/snapshots/org/apache/uima/uimaj-document-annotation/2.4.1-SNAPSHOT/uimaj-document-annotation-2.4.1-20130613.200446-75.pom
Downloaded: http://repository.apache.org/snapshots/org/apache/uima/uimaj-document-annotation/2.4.1-SNAPSHOT/uimaj-document-annotation-2.4.1-20130613.200446-75.pom
(4 KB at 28.3 KB/sec)
Downloading: http://repository.apache.org/snapshots/org/apache/uima/uimaj-tools/2.4.1-SNAPSHOT/maven-metadata.xml
Downloaded: http://repository.apache.org/snapshots/org/apache/uima/uimaj-tools/2.4.1-SNAPSHOT/maven-metadata.xml
(779 B at 2.7 KB/sec)
Downloading: http://repository.apache.org/snapshots/org/apache/uima/uimaj-tools/2.4.1-SNAPSHOT/uimaj-tools-2.4.1-20130613.200453-74.pom
Downloaded: http://repository.apache.org/snapshots/org/apache/uima/uimaj-tools/2.4.1-SNAPSHOT/uimaj-tools-2.4.1-20130613.200453-74.pom
(5 KB at 38.0 KB/sec)
Downloading: http://repository.apache.org/snapshots/org/apache/uima/uimaj-test-util/2.4.1-SNAPSHOT/maven-metadata.xml
Downloaded: http://repository.apache.org/snapshots/org/apache/uima/uimaj-test-util/2.4.1-SNAPSHOT/maven-metadata.xml
(783 B at 3.5 KB/sec)
Downloading: http://repository.apache.org/snapshots/org/apache/uima/uimaj-test-util/2.4.1-SNAPSHOT/uimaj-test-util-2.4.1-20130613.200453-74.pom
Downloaded: http://repository.apache.org/snapshots/org/apache/uima/uimaj-test-util/2.4.1-SNAPSHOT/uimaj-test-util-2.4.1-20130613.200453-74.pom
(3 KB at 17.8 KB/sec)
Downloading: http://repository.apache.org/snapshots/org/apache/uima/uimaj-examples/2.4.1-SNAPSHOT/uimaj-examples-2.4.1-20130613.200452-74.jar
Downloading: http://repository.apache.org/snapshots/org/apache/uima/uimaj-document-annotation/2.4.1-SNAPSHOT/uimaj-document-annotation-2.4.1-20130613.200446-75.jar
Downloading: http://repository.apache.org/snapshots/org/apache/uima/uimaj-tools/2.4.1-SNAPSHOT/uimaj-tools-2.4.1-20130613.200453-74.jar
Downloading: http://repository.apache.org/snapshots/org/apache/uima/uimaj-test-util/2.4.1-SNAPSHOT/uimaj-test-util-2.4.1-20130613.200453-74.jar
Downloaded: http://repository.apache.org/snapshots/org/apache/uima/uimaj-document-annotation/2.4.1-SNAPSHOT/uimaj-document-annotation-2.4.1-20130613.200446-75.jar
(12 KB at 81.0 KB/sec)
Downloaded: http://repository.apache.org/snapshots/org/apache/uima/uimaj-test-util/2.4.1-SNAPSHOT/uimaj-test-util-2.4.1-20130613.200453-74.jar
(23 KB at 126.3 KB/sec)
Downloaded: http://repository.apache.org/snapshots/org/apache/uima/uimaj-examples/2.4.1-SNAPSHOT/uimaj-examples-2.4.1-20130613.200452-74.jar
(158 KB at 547.0 KB/sec)
Downloaded: http://repository.apache.org/snapshots/org/apache/uima/uimaj-tools/2.4.1-SNAPSHOT/uimaj-tools-2.4.1-20130613.200453-74.jar
(514 KB at 1119.6 KB/sec)
[INFO] [INFO] Deleting <https://builds.apache.org/job/UIMA-AS/ws/trunk/uimaj-as-activemq/target>

[INFO] --- maven-clean-plugin:2.5:clean (default-clean) @ uimaj-as-activemq ---
[INFO] 
[INFO] --- build-helper-maven-plugin:1.7:parse-version (parse-project-version) @ uimaj-as-activemq
---
[INFO] 
[INFO] --- uima-build-helper-maven-plugin:4:parse-date-time (set buildYear and buildMonth)
@ uimaj-as-activemq ---
[INFO] 
[INFO] --- maven-remote-resources-plugin:1.4:process (default) @ uimaj-as-activemq ---
Downloading: http://repo1.maven.org/eclipse/net/sf/josql/josql/1.5/josql-1.5.pom
Downloading: http://repo1.maven.org/maven2/net/sf/josql/josql/1.5/josql-1.5.pom
Downloading: http://repo1.maven.org/eclipse/net/sf/josql/gentlyweb-utils/1.5/gentlyweb-utils-1.5.pom
Downloading: http://repo1.maven.org/maven2/net/sf/josql/gentlyweb-utils/1.5/gentlyweb-utils-1.5.pom
[INFO] Using 'UTF-8' encoding to copy filtered resources.
[INFO] [INFO] Copying 0 resource
[INFO] Copying 3 resources

[INFO] --- maven-resources-plugin:2.6:resources (default-resources) @ uimaj-as-activemq ---
[INFO] 
[INFO] --- maven-compiler-plugin:2.5.1:compile (default-compile) @ uimaj-as-activemq ---
[INFO] Compiling 22 source files to <https://builds.apache.org/job/UIMA-AS/ws/trunk/uimaj-as-activemq/target/classes>
[INFO] -------------------------------------------------------------
[ERROR] COMPILATION ERROR : 
[INFO] -------------------------------------------------------------
[ERROR] <https://builds.apache.org/job/UIMA-AS/ws/trunk/uimaj-as-activemq/src/main/java/org/apache/uima/adapter/jms/activemq/JmsOutputChannel.java>:[1972,40]
cannot find symbol
symbol  : variable MINUTES
location: class java.util.concurrent.TimeUnit
[INFO] 1 error
[INFO] -------------------------------------------------------------
[INFO] ------------------------------------------------------------------------
[INFO] Reactor Summary:
[INFO] 
[INFO] Apache UIMA-AS: uima-as-parent .................... SUCCESS [24.697s]
[INFO] Apache UIMA-AS: uimaj-as-core ..................... SUCCESS [15.571s]
[INFO] Apache UIMA-AS: uimaj-as-jms ...................... SUCCESS [3.332s]
[INFO] Apache UIMA-AS: uimaj-as-activemq ................. FAILURE [7.533s]
[INFO] Apache UIMA-AS Eclipse Plugin: uimaj-ep-runtime-deployeditor  SKIPPED
[INFO] Apache UIMA-AS Eclipse Plugin: uimaj-ep-deployeditor  SKIPPED
[INFO] Apache UIMA AS: uimaj-as-osgi-runtime ............. SKIPPED
[INFO] Apache UIMA-AS: uimaj-as-camel .................... SKIPPED
[INFO] Apache UIMA Eclipse: uimaj-eclipse-feature-deployeditor  SKIPPED
[INFO] Apache UIMA-AS Aggregate: aggregate-uima-as-eclipse-plugins  SKIPPED
[INFO] Apache UIMA-AS: uima-as-docbooks .................. SKIPPED
[INFO] Apache UIMA-AS Aggregate: aggregate-uima-as ....... SKIPPED
[INFO] Apache UIMA-AS: uima-as ........................... SKIPPED
[INFO] ------------------------------------------------------------------------
[INFO] BUILD FAILURE
[INFO] ------------------------------------------------------------------------
[INFO] Total time: 55.717s
[INFO] Finished at: Fri Jun 14 17:26:00 UTC 2013
[INFO] Final Memory: 26M/179M
[INFO] ------------------------------------------------------------------------
[JENKINS] Archiving <https://builds.apache.org/job/UIMA-AS/ws/trunk/uima-as-docbooks/pom.xml>
to /home/hudson/hudson/jobs/UIMA-AS/modules/org.apache.uima$uima-as-docbooks/builds/2013-06-14_17-24-47/archive/org.apache.uima/uima-as-docbooks/2.4.1-SNAPSHOT/uima-as-docbooks-2.4.1-SNAPSHOT.pom
[JENKINS] Archiving <https://builds.apache.org/job/UIMA-AS/ws/trunk/uimaj-ep-runtime-deployeditor/pom.xml>
to /home/hudson/hudson/jobs/UIMA-AS/modules/org.apache.uima$uimaj-ep-runtime-deployeditor/builds/2013-06-14_17-24-46/archive/org.apache.uima/uimaj-ep-runtime-deployeditor/2.4.1-SNAPSHOT/uimaj-ep-runtime-deployeditor-2.4.1-SNAPSHOT.pom
[JENKINS] Archiving <https://builds.apache.org/job/UIMA-AS/ws/trunk/aggregate-uima-as-eclipse-plugins/pom.xml>
to /home/hudson/hudson/jobs/UIMA-AS/modules/org.apache.uima$aggregate-uima-as-eclipse-plugins/builds/2013-06-14_17-24-45/archive/org.apache.uima/aggregate-uima-as-eclipse-plugins/2.4.1-SNAPSHOT/aggregate-uima-as-eclipse-plugins-2.4.1-SNAPSHOT.pom
[JENKINS] Archiving <https://builds.apache.org/job/UIMA-AS/ws/trunk/uimaj-as-jms/pom.xml>
to /home/hudson/hudson/jobs/UIMA-AS/modules/org.apache.uima$uimaj-as-jms/builds/2013-06-14_17-24-45/archive/org.apache.uima/uimaj-as-jms/2.4.1-SNAPSHOT/uimaj-as-jms-2.4.1-SNAPSHOT.pom
[JENKINS] Archiving <https://builds.apache.org/job/UIMA-AS/ws/trunk/uimaj-as-jms/target/uimaj-as-jms.jar>
to /home/hudson/hudson/jobs/UIMA-AS/modules/org.apache.uima$uimaj-as-jms/builds/2013-06-14_17-24-45/archive/org.apache.uima/uimaj-as-jms/2.4.1-SNAPSHOT/uimaj-as-jms-2.4.1-SNAPSHOT.jar
[JENKINS] Archiving <https://builds.apache.org/job/UIMA-AS/ws/trunk/uimaj-as-osgi-runtime/pom.xml>
to /home/hudson/hudson/jobs/UIMA-AS/modules/org.apache.uima$uimaj-as-osgi-runtime/builds/2013-06-14_17-24-46/archive/org.apache.uima/uimaj-as-osgi-runtime/2.4.1-SNAPSHOT/uimaj-as-osgi-runtime-2.4.1-SNAPSHOT.pom
[JENKINS] Archiving <https://builds.apache.org/job/UIMA-AS/ws/trunk/aggregate-uima-as/pom.xml>
to /home/hudson/hudson/jobs/UIMA-AS/modules/org.apache.uima$aggregate-uima-as/builds/2013-06-14_17-24-45/archive/org.apache.uima/aggregate-uima-as/2.4.1-SNAPSHOT/aggregate-uima-as-2.4.1-SNAPSHOT.pom
[JENKINS] Archiving <https://builds.apache.org/job/UIMA-AS/ws/trunk/uimaj-as-activemq/pom.xml>
to /home/hudson/hudson/jobs/UIMA-AS/modules/org.apache.uima$uimaj-as-activemq/builds/2013-06-14_17-24-45/archive/org.apache.uima/uimaj-as-activemq/2.4.1-SNAPSHOT/uimaj-as-activemq-2.4.1-SNAPSHOT.pom
[JENKINS] Archiving <https://builds.apache.org/job/UIMA-AS/ws/trunk/uima-as-parent/pom.xml>
to /home/hudson/hudson/jobs/UIMA-AS/modules/org.apache.uima$uima-as-parent/builds/2013-06-14_17-24-44/archive/org.apache.uima/uima-as-parent/2.4.1-SNAPSHOT/uima-as-parent-2.4.1-SNAPSHOT.pom
[JENKINS] Archiving <https://builds.apache.org/job/UIMA-AS/ws/trunk/uimaj-as-core/pom.xml>
to /home/hudson/hudson/jobs/UIMA-AS/modules/org.apache.uima$uimaj-as-core/builds/2013-06-14_17-24-45/archive/org.apache.uima/uimaj-as-core/2.4.1-SNAPSHOT/uimaj-as-core-2.4.1-SNAPSHOT.pom
[JENKINS] Archiving <https://builds.apache.org/job/UIMA-AS/ws/trunk/uimaj-as-core/target/uimaj-as-core.jar>
to /home/hudson/hudson/jobs/UIMA-AS/modules/org.apache.uima$uimaj-as-core/builds/2013-06-14_17-24-45/archive/org.apache.uima/uimaj-as-core/2.4.1-SNAPSHOT/uimaj-as-core-2.4.1-SNAPSHOT.jar
[JENKINS] Archiving <https://builds.apache.org/job/UIMA-AS/ws/trunk/uimaj-eclipse-feature-deployeditor/pom.xml>
to /home/hudson/hudson/jobs/UIMA-AS/modules/org.apache.uima$uimaj-eclipse-feature-deployeditor/builds/2013-06-14_17-24-46/archive/org.apache.uima/uimaj-eclipse-feature-deployeditor/2.4.0/uimaj-eclipse-feature-deployeditor-2.4.0.pom
[JENKINS] Archiving <https://builds.apache.org/job/UIMA-AS/ws/trunk/uimaj-ep-deployeditor/pom.xml>
to /home/hudson/hudson/jobs/UIMA-AS/modules/org.apache.uima$uimaj-ep-deployeditor/builds/2013-06-14_17-24-46/archive/org.apache.uima/uimaj-ep-deployeditor/2.4.1-SNAPSHOT/uimaj-ep-deployeditor-2.4.1-SNAPSHOT.pom
[JENKINS] Archiving <https://builds.apache.org/job/UIMA-AS/ws/trunk/uimaj-as-camel/pom.xml>
to /home/hudson/hudson/jobs/UIMA-AS/modules/org.apache.uima$uimaj-as-camel/builds/2013-06-14_17-24-46/archive/org.apache.uima/uimaj-as-camel/2.4.1-SNAPSHOT/uimaj-as-camel-2.4.1-SNAPSHOT.pom
[JENKINS] Archiving <https://builds.apache.org/job/UIMA-AS/ws/trunk/pom.xml> to /home/hudson/hudson/jobs/UIMA-AS/modules/org.apache.uima$uima-as/builds/2013-06-14_17-24-44/archive/org.apache.uima/uima-as/2.4.1-SNAPSHOT/uima-as-2.4.1-SNAPSHOT.pom
Waiting for Jenkins to finish collecting data
mavenExecutionResult exceptions not empty
message : Failed to execute goal org.apache.maven.plugins:maven-compiler-plugin:2.5.1:compile
(default-compile) on project uimaj-as-activemq: Compilation failure
<https://builds.apache.org/job/UIMA-AS/ws/trunk/uimaj-as-activemq/src/main/java/org/apache/uima/adapter/jms/activemq/JmsOutputChannel.java>:[1972,40]
cannot find symbol
symbol  : variable MINUTES
location: class java.util.concurrent.TimeUnit

cause : Compilation failure
<https://builds.apache.org/job/UIMA-AS/ws/trunk/uimaj-as-activemq/src/main/java/org/apache/uima/adapter/jms/activemq/JmsOutputChannel.java>:[1972,40]
cannot find symbol
symbol  : variable MINUTES
location: class java.util.concurrent.TimeUnit

Stack trace : 
org.apache.maven.lifecycle.LifecycleExecutionException: Failed to execute goal org.apache.maven.plugins:maven-compiler-plugin:2.5.1:compile
(default-compile) on project uimaj-as-activemq: Compilation failure
<https://builds.apache.org/job/UIMA-AS/ws/trunk/uimaj-as-activemq/src/main/java/org/apache/uima/adapter/jms/activemq/JmsOutputChannel.java>:[1972,40]
cannot find symbol
symbol  : variable MINUTES
location: class java.util.concurrent.TimeUnit

	at org.apache.maven.lifecycle.internal.MojoExecutor.execute(MojoExecutor.java:213)
	at org.apache.maven.lifecycle.internal.MojoExecutor.execute(MojoExecutor.java:153)
	at org.apache.maven.lifecycle.internal.MojoExecutor.execute(MojoExecutor.java:145)
	at org.apache.maven.lifecycle.internal.LifecycleModuleBuilder.buildProject(LifecycleModuleBuilder.java:84)
	at org.apache.maven.lifecycle.internal.LifecycleModuleBuilder.buildProject(LifecycleModuleBuilder.java:59)
	at org.apache.maven.lifecycle.internal.LifecycleStarter.singleThreadedBuild(LifecycleStarter.java:183)
	at org.apache.maven.lifecycle.internal.LifecycleStarter.execute(LifecycleStarter.java:161)
	at org.apache.maven.DefaultMaven.doExecute(DefaultMaven.java:319)
	at org.apache.maven.DefaultMaven.execute(DefaultMaven.java:156)
	at org.jvnet.hudson.maven3.launcher.Maven3Launcher.main(Maven3Launcher.java:79)
	at sun.reflect.NativeMethodAccessorImpl.invoke0(Native Method)
	at sun.reflect.NativeMethodAccessorImpl.invoke(NativeMethodAccessorImpl.java:39)
	at sun.reflect.DelegatingMethodAccessorImpl.invoke(DelegatingMethodAccessorImpl.java:25)
	at java.lang.reflect.Method.invoke(Method.java:592)
	at org.codehaus.plexus.classworlds.launcher.Launcher.launchStandard(Launcher.java:329)
	at org.codehaus.plexus.classworlds.launcher.Launcher.launch(Launcher.java:239)
	at org.jvnet.hudson.maven3.agent.Maven3Main.launch(Maven3Main.java:158)
	at hudson.maven.Maven3Builder.call(Maven3Builder.java:100)
	at hudson.maven.Maven3Builder.call(Maven3Builder.java:66)
	at hudson.remoting.UserRequest.perform(UserRequest.java:118)
	at hudson.remoting.UserRequest.perform(UserRequest.java:48)
	at hudson.remoting.Request$2.run(Request.java:326)
	at hudson.remoting.InterceptingExecutorService$1.call(InterceptingExecutorService.java:72)
	at java.util.concurrent.FutureTask$Sync.innerRun(FutureTask.java:269)
	at java.util.concurrent.FutureTask.run(FutureTask.java:123)
	at java.util.concurrent.ThreadPoolExecutor$Worker.runTask(ThreadPoolExecutor.java:651)
	at java.util.concurrent.ThreadPoolExecutor$Worker.run(ThreadPoolExecutor.java:676)
	at java.lang.Thread.run(Thread.java:595)
Caused by: org.apache.maven.plugin.CompilationFailureException: Compilation failure
<https://builds.apache.org/job/UIMA-AS/ws/trunk/uimaj-as-activemq/src/main/java/org/apache/uima/adapter/jms/activemq/JmsOutputChannel.java>:[1972,40]
cannot find symbol
symbol  : variable MINUTES
location: class java.util.concurrent.TimeUnit

	at org.apache.maven.plugin.AbstractCompilerMojo.execute(AbstractCompilerMojo.java:729)
	at org.apache.maven.plugin.CompilerMojo.execute(CompilerMojo.java:128)
	at org.apache.maven.plugin.DefaultBuildPluginManager.executeMojo(DefaultBuildPluginManager.java:101)
	at org.apache.maven.lifecycle.internal.MojoExecutor.execute(MojoExecutor.java:209)
	... 27 more
Sending e-mails to: dev@uima.apache.org
channel stopped

Mime
View raw message