uima-dev mailing list archives

Site index · List index
Message view « Date » · « Thread »
Top « Date » · « Thread »
From Apache Jenkins Server <jenk...@builds.apache.org>
Subject Build failed in Jenkins: UIMA-Ruta #138
Date Thu, 27 Jun 2013 14:13:24 GMT
See <https://builds.apache.org/job/UIMA-Ruta/138/changes>

Changes:

[pkluegl] no jira -  deactivate ruta search strategies for cas editor type system if property
is set in project of xmiCAS

------------------------------------------
[...truncated 2927 lines...]
     [java]   org.hibernate.validator.method.MethodConstraintViolationException
     [java]   javax.validation.bootstrap.GenericBootstrap
     [java]   javax.validation.ValidatorContext
     [java]   javax.validation.MessageInterpolator$Context
     [java]   org.aspectj.lang.reflect.AjType
     [java]   org.jruby.RubyArray
     [java]   org.aspectj.weaver.patterns.TypePattern
     [java]   net.sf.ehcache.Ehcache
     [java]   org.aspectj.lang.reflect.PerClauseKind
     [java]   net.sf.ehcache.Element
     [java]   net.sf.ehcache.store.MemoryStoreEvictionPolicy
     [java]   org.jruby.runtime.ThreadContext
     [java]   javax.el.ELContext
     [java]   javax.el.ELException
     [java]   net.sf.ehcache.constructs.blocking.UpdatingSelfPopulatingCache
     [java]   org.apache.log4j.Logger
     [java]   org.aspectj.weaver.bcel.BcelWorld
     [java]   org.aspectj.weaver.reflect.ReflectionWorld$ReflectionWorldException
     [java]   javax.ejb.EJBException
     [java]   org.aspectj.weaver.ast.HasAnnotation
     [java]   edu.emory.mathcs.backport.java.util.concurrent.ThreadPoolExecutor$AbortPolicy
     [java]   org.joda.time.ReadablePartial
     [java]   org.aspectj.bridge.IMessage$Kind
     [java]   org.apache.log4j.xml.DOMConfigurator
     [java]   org.aspectj.weaver.ast.Not
     [java]   org.aspectj.lang.reflect.PerClause
     [java]   javax.validation.Configuration
     [java]   org.hibernate.validator.method.MethodValidator
     [java]   org.jruby.ast.Colon2Node
     [java]   net.sf.ehcache.event.RegisteredEventListeners
     [java]   net.sf.ehcache.Cache
     [java]   org.apache.commons.pool.ObjectPool
     [java]   javax.ejb.PostActivate
     [java]   org.aspectj.weaver.reflect.ReflectionWorld
     [java]   org.hibernate.validator.messageinterpolation.ResourceBundleMessageInterpolator
     [java]   org.aspectj.weaver.ICrossReferenceHandler
     [java]   org.jruby.exceptions.RaiseException
     [java]   org.jruby.Ruby
     [java]   org.joda.time.format.ISODateTimeFormat
     [java]   javax.ejb.EJB
     [java]   org.aspectj.weaver.ast.Or
     [java]   org.joda.time.DateTimeZone
     [java]   net.sf.cglib.proxy.Factory
     [java]   bsh.XThis
     [java]   edu.emory.mathcs.backport.java.util.concurrent.SynchronousQueue
     [java]   org.aspectj.lang.annotation.DeclareParents
     [java]   javax.ejb.EJBHome
     [java]   java.util.concurrent.ForkJoinPool$ForkJoinWorkerThreadFactory
     [java]   javax.ejb.SessionContext
     [java]   joptsimple.OptionSet
     [java]   org.apache.log.Hierarchy
     [java]   edu.emory.mathcs.backport.java.util.concurrent.ThreadPoolExecutor
     [java]   org.aspectj.weaver.World
     [java]   org.joda.time.DateMidnight
     [java]   org.apache.log4j.PropertyConfigurator
     [java]   org.aspectj.lang.annotation.Aspect
     [java]   edu.emory.mathcs.backport.java.util.concurrent.BlockingQueue
     [java]   javax.validation.ConstraintValidator
     [java]   edu.emory.mathcs.backport.java.util.concurrent.TimeUnit
     [java]   javax.ejb.EJBLocalObject
     [java]   org.apache.avalon.framework.logger.Logger
     [java]   org.jruby.runtime.builtin.IRubyObject
     [java]   org.aspectj.weaver.patterns.ExposedState
     [java]   org.apache.log4j.Category
     [java]   net.sf.cglib.transform.impl.UndeclaredThrowableStrategy
     [java]   org.joda.time.Chronology
     [java]   org.aspectj.weaver.tools.PointcutParser
     [java]   org.jruby.exceptions.JumpException
     [java]   org.aspectj.weaver.tools.FuzzyBoolean
     [java]   com.jamonapi.Monitor
     [java]   org.aspectj.lang.JoinPoint
     [java]   javax.validation.metadata.BeanDescriptor
     [java]   org.aspectj.weaver.ast.And
     [java]   java.util.concurrent.ForkJoinPool
     [java]   javax.ejb.CreateException
     [java]   net.sf.ehcache.constructs.blocking.CacheEntryFactory
     [java]   bsh.Primitive
     [java]   net.sf.cglib.proxy.MethodProxy
     [java]   org.aspectj.weaver.tools.PointcutParameter
     [java]   net.sf.ehcache.event.CacheEventListener
     [java]   javax.validation.bootstrap.ProviderSpecificBootstrap
     [java]   com.jamonapi.MonitorFactory
     [java]   org.aspectj.weaver.patterns.SimpleScope
     [java]   net.sf.ehcache.CacheManager
     [java]   org.jruby.javasupport.JavaEmbedUtils
     [java]   org.joda.time.LocalDateTime
     [java]   org.aspectj.lang.annotation.AfterReturning
     [java]   javax.interceptor.InvocationContext
     [java]   net.sf.cglib.asm.Type
     [java]   org.aspectj.lang.annotation.After
     [java]   org.aspectj.weaver.ast.Instanceof
     [java]   net.sf.ehcache.constructs.blocking.SelfPopulatingCache
     [java]   org.aspectj.weaver.UnresolvedType
     [java]   org.joda.time.MutableDateTime
     [java]   net.sf.cglib.proxy.Callback
     [java]   javax.el.PropertyNotWritableException
     [java]   net.sf.ehcache.Status
     [java]   org.aspectj.weaver.patterns.FormalBinding
     [java]   org.joda.time.LocalDate
     [java]   org.hibernate.validator.HibernateValidator
     [java]   org.joda.time.ReadableInstant
     [java]   org.joda.time.Instant
     [java]   org.aspectj.lang.annotation.Around
     [java]   org.aspectj.weaver.patterns.Bindings
     [java]   org.apache.log4j.Priority
     [java]   org.aspectj.weaver.patterns.NamePattern
     [java]   org.jruby.RubyException
     [java]   org.jruby.ast.Colon3Node
     [java]   org.aspectj.weaver.patterns.PatternParser
     [java]   org.aspectj.weaver.BCException
     [java]   edu.emory.mathcs.backport.java.util.concurrent.Executors
     [java]   org.aspectj.lang.Signature
     [java]   org.aspectj.lang.reflect.DeclarePrecedence
     [java]   org.jruby.ast.NewlineNode
     [java]   bsh.Interpreter
     [java]   org.aspectj.weaver.reflect.ReflectionVar
     [java]   org.aspectj.weaver.reflect.ShadowMatchImpl
     [java]   org.apache.log4j.LogManager
     [java]   javax.validation.metadata.ConstraintDescriptor
     [java]   javax.ejb.EJBObject
     [java]   org.aspectj.bridge.IMessage
     [java]   org.joda.time.DateTime
     [java]   org.aspectj.util.PartialOrder
     [java]   org.aspectj.weaver.ast.Var
     [java]   org.jruby.runtime.DynamicScope
     [java]   org.aspectj.weaver.patterns.IScope
     [java]   org.aspectj.runtime.internal.AroundClosure
     [java]   org.aspectj.weaver.ast.Literal
     [java]   org.aspectj.weaver.ast.Call
     [java]   org.aspectj.weaver.ast.FieldGetCall
     [java]   org.aspectj.weaver.internal.tools.MatchingContextBasedTest
     [java]   javax.servlet.ServletContextEvent
     [java] Warnings generated: 2059
     [java] Missing classes: 202
[INFO] Done FindBugs Analysis....
[INFO] ------------------------------------------------------------------------
[INFO] Reactor Summary:
[INFO] 
[INFO] Apache UIMA Ruta: ruta-parent ..................... SUCCESS [55.922s]
[INFO] Apache UIMA Ruta: ruta-core ....................... SUCCESS [4:18.579s]
[INFO] Apache UIMA Ruta Eclipse: ruta-ep-engine .......... FAILURE [3:51.280s]
[INFO] Apache UIMA Ruta Eclipse: ruta-ep-ide ............. SKIPPED
[INFO] Apache UIMA Ruta Eclipse: ruta-ep-caseditor ....... SKIPPED
[INFO] Apache UIMA Ruta Eclipse: ruta-ep-addons .......... SKIPPED
[INFO] Apache UIMA Ruta Eclipse: ruta-ep-textruler ....... SKIPPED
[INFO] Apache UIMA Ruta Documentation .................... SKIPPED
[INFO] Apache UIMA Ruta Eclipse: ruta-eclipse-feature .... SKIPPED
[INFO] Apache UIMA Ruta: ruta-ep-example-extensions ...... SKIPPED
[INFO] Apache UIMA Ruta: ruta ............................ SKIPPED
[INFO] ------------------------------------------------------------------------
[INFO] BUILD FAILURE
[INFO] ------------------------------------------------------------------------
[INFO] Total time: 9:16.925s
[INFO] Finished at: Thu Jun 27 14:12:18 UTC 2013
[INFO] Final Memory: 63M/327M
[INFO] ------------------------------------------------------------------------
[JENKINS] Archiving <https://builds.apache.org/job/UIMA-Ruta/ws/trunk/ruta-docbook/pom.xml>
to /home/hudson/hudson/jobs/UIMA-Ruta/modules/org.apache.uima$ruta-docbook/builds/2013-06-27_14-02-38/archive/org.apache.uima/ruta-docbook/2.0.2-SNAPSHOT/ruta-docbook-2.0.2-SNAPSHOT.pom
[JENKINS] Archiving <https://builds.apache.org/job/UIMA-Ruta/ws/trunk/pom.xml> to /home/hudson/hudson/jobs/UIMA-Ruta/modules/org.apache.uima$ruta/builds/2013-06-27_14-02-37/archive/org.apache.uima/ruta/2.0.2-SNAPSHOT/ruta-2.0.2-SNAPSHOT.pom
[JENKINS] Archiving <https://builds.apache.org/job/UIMA-Ruta/ws/trunk/ruta-ep-ide/pom.xml>
to /home/hudson/hudson/jobs/UIMA-Ruta/modules/org.apache.uima$ruta-ep-ide/builds/2013-06-27_14-02-38/archive/org.apache.uima/ruta-ep-ide/2.0.2-SNAPSHOT/ruta-ep-ide-2.0.2-SNAPSHOT.pom
[JENKINS] Archiving <https://builds.apache.org/job/UIMA-Ruta/ws/trunk/example-projects/ruta-ep-example-extensions/pom.xml>
to /home/hudson/hudson/jobs/UIMA-Ruta/modules/org.apache.uima$ruta-ep-example-extensions/builds/2013-06-27_14-02-39/archive/org.apache.uima/ruta-ep-example-extensions/2.0.2-SNAPSHOT/ruta-ep-example-extensions-2.0.2-SNAPSHOT.pom
[JENKINS] Archiving <https://builds.apache.org/job/UIMA-Ruta/ws/trunk/ruta-parent/pom.xml>
to /home/hudson/hudson/jobs/UIMA-Ruta/modules/org.apache.uima$ruta-parent/builds/2013-06-27_14-02-37/archive/org.apache.uima/ruta-parent/2.0.2-SNAPSHOT/ruta-parent-2.0.2-SNAPSHOT.pom
[JENKINS] Archiving <https://builds.apache.org/job/UIMA-Ruta/ws/trunk/ruta-ep-engine/pom.xml>
to /home/hudson/hudson/jobs/UIMA-Ruta/modules/org.apache.uima$ruta-ep-engine/builds/2013-06-27_14-02-37/archive/org.apache.uima/ruta-ep-engine/2.0.2-SNAPSHOT/ruta-ep-engine-2.0.2-SNAPSHOT.pom
[JENKINS] Archiving <https://builds.apache.org/job/UIMA-Ruta/ws/trunk/ruta-ep-engine/target/org.apache.uima.ruta.engine_2.0.2.SNAPSHOT.jar>
to /home/hudson/hudson/jobs/UIMA-Ruta/modules/org.apache.uima$ruta-ep-engine/builds/2013-06-27_14-02-37/archive/org.apache.uima/ruta-ep-engine/2.0.2-SNAPSHOT/ruta-ep-engine-2.0.2-SNAPSHOT.jar
[JENKINS] Archiving <https://builds.apache.org/job/UIMA-Ruta/ws/trunk/ruta-ep-addons/pom.xml>
to /home/hudson/hudson/jobs/UIMA-Ruta/modules/org.apache.uima$ruta-ep-addons/builds/2013-06-27_14-02-38/archive/org.apache.uima/ruta-ep-addons/2.0.2-SNAPSHOT/ruta-ep-addons-2.0.2-SNAPSHOT.pom
[JENKINS] Archiving <https://builds.apache.org/job/UIMA-Ruta/ws/trunk/ruta-ep-caseditor/pom.xml>
to /home/hudson/hudson/jobs/UIMA-Ruta/modules/org.apache.uima$ruta-ep-caseditor/builds/2013-06-27_14-02-38/archive/org.apache.uima/ruta-ep-caseditor/2.0.2-SNAPSHOT/ruta-ep-caseditor-2.0.2-SNAPSHOT.pom
[JENKINS] Archiving <https://builds.apache.org/job/UIMA-Ruta/ws/trunk/ruta-ep-textruler/pom.xml>
to /home/hudson/hudson/jobs/UIMA-Ruta/modules/org.apache.uima$ruta-ep-textruler/builds/2013-06-27_14-02-38/archive/org.apache.uima/ruta-ep-textruler/2.0.2-SNAPSHOT/ruta-ep-textruler-2.0.2-SNAPSHOT.pom
[JENKINS] Archiving <https://builds.apache.org/job/UIMA-Ruta/ws/trunk/ruta-core/pom.xml>
to /home/hudson/hudson/jobs/UIMA-Ruta/modules/org.apache.uima$ruta-core/builds/2013-06-27_14-02-37/archive/org.apache.uima/ruta-core/2.0.2-SNAPSHOT/ruta-core-2.0.2-SNAPSHOT.pom
[JENKINS] Archiving <https://builds.apache.org/job/UIMA-Ruta/ws/trunk/ruta-core/target/ruta-core-2.0.2-SNAPSHOT.jar>
to /home/hudson/hudson/jobs/UIMA-Ruta/modules/org.apache.uima$ruta-core/builds/2013-06-27_14-02-37/archive/org.apache.uima/ruta-core/2.0.2-SNAPSHOT/ruta-core-2.0.2-SNAPSHOT.jar
[JENKINS] Archiving <https://builds.apache.org/job/UIMA-Ruta/ws/trunk/ruta-eclipse-feature/pom.xml>
to /home/hudson/hudson/jobs/UIMA-Ruta/modules/org.apache.uima$ruta-eclipse-feature/builds/2013-06-27_14-02-38/archive/org.apache.uima/ruta-eclipse-feature/2.0.2-SNAPSHOT/ruta-eclipse-feature-2.0.2-SNAPSHOT.pom
Waiting for Jenkins to finish collecting data
mavenExecutionResult exceptions not empty
message : Internal error: java.lang.reflect.UndeclaredThrowableException
cause : null
Stack trace : 
org.apache.maven.InternalErrorException: Internal error: java.lang.reflect.UndeclaredThrowableException
	at org.apache.maven.lifecycle.internal.BuilderCommon.handleBuildError(BuilderCommon.java:128)
	at org.apache.maven.lifecycle.internal.LifecycleModuleBuilder.buildProject(LifecycleModuleBuilder.java:95)
	at org.apache.maven.lifecycle.internal.LifecycleModuleBuilder.buildProject(LifecycleModuleBuilder.java:59)
	at org.apache.maven.lifecycle.internal.LifecycleStarter.singleThreadedBuild(LifecycleStarter.java:183)
	at org.apache.maven.lifecycle.internal.LifecycleStarter.execute(LifecycleStarter.java:161)
	at org.apache.maven.DefaultMaven.doExecute(DefaultMaven.java:320)
	at org.apache.maven.DefaultMaven.execute(DefaultMaven.java:156)
	at org.jvnet.hudson.maven3.launcher.Maven3Launcher.main(Maven3Launcher.java:79)
	at sun.reflect.NativeMethodAccessorImpl.invoke0(Native Method)
	at sun.reflect.NativeMethodAccessorImpl.invoke(NativeMethodAccessorImpl.java:39)
	at sun.reflect.DelegatingMethodAccessorImpl.invoke(DelegatingMethodAccessorImpl.java:25)
	at java.lang.reflect.Method.invoke(Method.java:597)
	at org.codehaus.plexus.classworlds.launcher.Launcher.launchStandard(Launcher.java:329)
	at org.codehaus.plexus.classworlds.launcher.Launcher.launch(Launcher.java:239)
	at org.jvnet.hudson.maven3.agent.Maven3Main.launch(Maven3Main.java:158)
	at hudson.maven.Maven3Builder.call(Maven3Builder.java:100)
	at hudson.maven.Maven3Builder.call(Maven3Builder.java:66)
	at hudson.remoting.UserRequest.perform(UserRequest.java:118)
	at hudson.remoting.UserRequest.perform(UserRequest.java:48)
	at hudson.remoting.Request$2.run(Request.java:326)
	at hudson.remoting.InterceptingExecutorService$1.call(InterceptingExecutorService.java:72)
	at java.util.concurrent.FutureTask$Sync.innerRun(FutureTask.java:303)
	at java.util.concurrent.FutureTask.run(FutureTask.java:138)
	at java.util.concurrent.ThreadPoolExecutor$Worker.runTask(ThreadPoolExecutor.java:895)
	at java.util.concurrent.ThreadPoolExecutor$Worker.run(ThreadPoolExecutor.java:918)
	at java.lang.Thread.run(Thread.java:662)
Caused by: java.lang.reflect.UndeclaredThrowableException
	at com.sun.proxy.$Proxy2.setExecutedMojos(Unknown Source)
	at hudson.maven.MavenBuildProxy$Filter.setExecutedMojos(MavenBuildProxy.java:243)
	at hudson.maven.Maven3Builder$MavenExecutionListener.recordMojoEnded(Maven3Builder.java:439)
	at hudson.maven.Maven3Builder$MavenExecutionListener.mojoSucceeded(Maven3Builder.java:425)
	at org.apache.maven.lifecycle.internal.DefaultExecutionEventCatapult.fire(DefaultExecutionEventCatapult.java:87)
	at org.apache.maven.lifecycle.internal.DefaultExecutionEventCatapult.fire(DefaultExecutionEventCatapult.java:42)
	at org.apache.maven.lifecycle.internal.MojoExecutor.execute(MojoExecutor.java:228)
	at org.apache.maven.lifecycle.internal.MojoExecutor.execute(MojoExecutor.java:153)
	at org.apache.maven.lifecycle.internal.MojoExecutor.execute(MojoExecutor.java:145)
	at org.apache.maven.lifecycle.internal.LifecycleModuleBuilder.buildProject(LifecycleModuleBuilder.java:84)
	... 24 more
Caused by: java.io.StreamCorruptedException: invalid type code: 07
	at java.io.ObjectInputStream.readObject0(ObjectInputStream.java:1374)
	at java.io.ObjectInputStream.defaultReadFields(ObjectInputStream.java:1970)
	at java.io.ObjectInputStream.readSerialData(ObjectInputStream.java:1894)
	at java.io.ObjectInputStream.readOrdinaryObject(ObjectInputStream.java:1777)
	at java.io.ObjectInputStream.readObject0(ObjectInputStream.java:1347)
	at java.io.ObjectInputStream.readObject(ObjectInputStream.java:369)
	at java.util.concurrent.CopyOnWriteArrayList.readObject(CopyOnWriteArrayList.java:879)
	at sun.reflect.GeneratedMethodAccessor8662.invoke(Unknown Source)
	at sun.reflect.DelegatingMethodAccessorImpl.invoke(DelegatingMethodAccessorImpl.java:43)
	at java.lang.reflect.Method.invoke(Method.java:601)
	at java.io.ObjectStreamClass.invokeReadObject(ObjectStreamClass.java:1004)
	at java.io.ObjectInputStream.readSerialData(ObjectInputStream.java:1872)
	at java.io.ObjectInputStream.readOrdinaryObject(ObjectInputStream.java:1777)
	at java.io.ObjectInputStream.readObject0(ObjectInputStream.java:1347)
	at java.io.ObjectInputStream.readArray(ObjectInputStream.java:1685)
	at java.io.ObjectInputStream.readObject0(ObjectInputStream.java:1341)
	at java.io.ObjectInputStream.defaultReadFields(ObjectInputStream.java:1970)
	at java.io.ObjectInputStream.readSerialData(ObjectInputStream.java:1894)
	at java.io.ObjectInputStream.readOrdinaryObject(ObjectInputStream.java:1777)
	at java.io.ObjectInputStream.readObject0(ObjectInputStream.java:1347)
	at java.io.ObjectInputStream.readObject(ObjectInputStream.java:369)
	at hudson.remoting.UserRequest.deserialize(UserRequest.java:182)
	at hudson.remoting.UserRequest.perform(UserRequest.java:98)
	at hudson.remoting.UserRequest.perform(UserRequest.java:48)
	at hudson.remoting.Request$2.run(Request.java:326)
	at hudson.remoting.InterceptingExecutorService$1.call(InterceptingExecutorService.java:72)
	at java.util.concurrent.FutureTask$Sync.innerRun(FutureTask.java:334)
	at java.util.concurrent.FutureTask.run(FutureTask.java:166)
	at java.util.concurrent.ThreadPoolExecutor.runWorker(ThreadPoolExecutor.java:1145)
	at java.util.concurrent.ThreadPoolExecutor$Worker.run(ThreadPoolExecutor.java:615)
	at java.lang.Thread.run(Thread.java:722)
Sending e-mails to: dev@uima.apache.org
channel stopped
[WARNINGS] Skipping publisher since build result is FAILURE
Skipping Cobertura coverage report as build was not UNSTABLE or better ...

Mime
View raw message