uima-dev mailing list archives

Site index · List index
Message view « Date » · « Thread »
Top « Date » · « Thread »
From Apache Jenkins Server <jenk...@builds.apache.org>
Subject Build failed in Jenkins: UIMA-uimaFIT #90
Date Fri, 21 Jun 2013 02:10:50 GMT
See <https://builds.apache.org/job/UIMA-uimaFIT/90/>

------------------------------------------
[...truncated 620 lines...]
A         uimafit-maven-plugin/src/it/default
AU        uimafit-maven-plugin/src/it/default/verify.bsh
A         uimafit-maven-plugin/src/it/default/src
A         uimafit-maven-plugin/src/it/default/src/main
A         uimafit-maven-plugin/src/it/default/src/main/java
AU        uimafit-maven-plugin/src/it/default/src/main/java/TestAnnotator.java
AU        uimafit-maven-plugin/src/it/default/src/main/java/AbstractAnnotator.java
AU        uimafit-maven-plugin/src/it/default/pom.xml
A         uimafit-maven-plugin/src/it/default/reference
AU        uimafit-maven-plugin/src/it/default/reference/TestAnnotator.xml
AU        uimafit-maven-plugin/pom.xml
A         uimafit-maven-plugin/.settings
A         uimafit-maven-plugin/.settings/org.eclipse.jdt.core.prefs
A         uimafit-maven-plugin/.settings/org.eclipse.jdt.ui.prefs
A         uimafit-spring
AU        uimafit-spring/NOTICE
A         uimafit-spring/src
A         uimafit-spring/src/test
A         uimafit-spring/src/test/java
A         uimafit-spring/src/test/java/org
A         uimafit-spring/src/test/java/org/apache
A         uimafit-spring/src/test/java/org/apache/uima
A         uimafit-spring/src/test/java/org/apache/uima/fit
A         uimafit-spring/src/test/java/org/apache/uima/fit/spring
AU        uimafit-spring/src/test/java/org/apache/uima/fit/spring/UimaFactoryInjectionTest.java
AU        uimafit-spring/src/test/java/org/apache/uima/fit/spring/SpringContextResourceManagerTest.java
A         uimafit-spring/src/test/resources
A         uimafit-spring/src/main
A         uimafit-spring/src/main/java
A         uimafit-spring/src/main/java/org
A         uimafit-spring/src/main/java/org/apache
A         uimafit-spring/src/main/java/org/apache/uima
A         uimafit-spring/src/main/java/org/apache/uima/fit
A         uimafit-spring/src/main/java/org/apache/uima/fit/spring
A         uimafit-spring/src/main/java/org/apache/uima/fit/spring/factory
AU        uimafit-spring/src/main/java/org/apache/uima/fit/spring/factory/AnalysisEngineFactory_impl.java
AU        uimafit-spring/src/main/java/org/apache/uima/fit/spring/factory/CasInitializerFactory_impl.java
AU        uimafit-spring/src/main/java/org/apache/uima/fit/spring/factory/CollectionReaderFactory_impl.java
AU        uimafit-spring/src/main/java/org/apache/uima/fit/spring/factory/CasConsumerFactory_impl.java
AU        uimafit-spring/src/main/java/org/apache/uima/fit/spring/factory/CustomResourceFactory_impl.java
AU        uimafit-spring/src/main/java/org/apache/uima/fit/spring/SpringContextResourceManager.java
A         uimafit-spring/src/main/java/org/apache/uima/fit/spring/util
AU        uimafit-spring/src/main/java/org/apache/uima/fit/spring/util/ResourceInitializationUtil.java
A         uimafit-spring/src/main/resources
A         uimafit-spring/CHANGES
AU        uimafit-spring/pom.xml
A         uimafit-spring/.settings
A         uimafit-spring/.settings/org.eclipse.jdt.core.prefs
A         uimafit-spring/.settings/org.eclipse.jdt.ui.prefs
 U        .
At revision 1495272
no change for https://svn.apache.org/repos/asf/uima/sandbox/uimafit/trunk since the previous
build
Parsing POMs
Modules changed, recalculating dependency graph
[trunk] $ /home/hudson/tools/java/latest1.5/bin/java -Xmx800m -XX:MaxPermSize=256m -cp /home/jenkins/jenkins-slave/maven3-agent.jar:/home/hudson/tools/maven/apache-maven-3.0.4/boot/plexus-classworlds-2.4.jar
org.jvnet.hudson.maven3.agent.Maven3Main /home/hudson/tools/maven/apache-maven-3.0.4 /home/jenkins/jenkins-slave/slave.jar
/home/jenkins/jenkins-slave/maven3-interceptor.jar 56362
<===[JENKINS REMOTING CAPACITY]===>channel started
   log4j:WARN No appenders could be found for logger (org.apache.commons.beanutils.converters.BooleanConverter).
log4j:WARN Please initialize the log4j system properly.
Executing Maven:  -B -f <https://builds.apache.org/job/UIMA-uimaFIT/ws/trunk/pom.xml>
-Dmaven.repo.local=/home/jenkins/jenkins-slave/maven-repositories/0 -Djava.awt.headless=true
-Dcobertura.report.format=xml -Ppmd,findbugs,javancss,cobertura-aggregate,attach-source,attach-javadoc,attach-test
clean install dependency:analyze cobertura:cobertura javadoc:aggregate
[INFO] Scanning for projects...
[INFO] ------------------------------------------------------------------------
[INFO] Reactor Build Order:
[INFO] 
[INFO] uimaFIT - Parent
[INFO] uimaFIT
[INFO] uimaFIT - Examples
[INFO] uimaFIT - Spring integration
[INFO] uimaFIT - Maven Plugin
[INFO] uimaFIT - Legacy uimaFIT support
[INFO] uimaFIT - Documentation
[INFO] uimaFIT- Collection Processing Engine support
Downloading: http://repository.apache.org/snapshots/org/apache/uima/jcasgen-maven-plugin/2.4.1-SNAPSHOT/jcasgen-maven-plugin-2.4.1-SNAPSHOT.pom
[WARNING] The POM for org.apache.uima:jcasgen-maven-plugin:jar:2.4.1-SNAPSHOT is missing,
no dependency information available
[WARNING] Failed to retrieve plugin descriptor for org.apache.uima:jcasgen-maven-plugin:2.4.1-SNAPSHOT:
Plugin org.apache.uima:jcasgen-maven-plugin:2.4.1-SNAPSHOT or one of its dependencies could
not be resolved: Failed to read artifact descriptor for org.apache.uima:jcasgen-maven-plugin:jar:2.4.1-SNAPSHOT
[INFO] Downloading: http://repository.apache.org/snapshots/org/apache/uima/jcasgen-maven-plugin/2.4.1-SNAPSHOT/jcasgen-maven-plugin-2.4.1-SNAPSHOT.pom
                                                                        
[INFO] ------------------------------------------------------------------------
[INFO] Building uimaFIT - Parent 2.0.0-SNAPSHOT
[INFO] ------------------------------------------------------------------------
[WARNING] The POM for org.apache.uima:jcasgen-maven-plugin:jar:2.4.1-SNAPSHOT is missing,
no dependency information available
[WARNING] Failed to retrieve plugin descriptor for org.apache.uima:jcasgen-maven-plugin:2.4.1-SNAPSHOT:
Plugin org.apache.uima:jcasgen-maven-plugin:2.4.1-SNAPSHOT or one of its dependencies could
not be resolved: Failed to read artifact descriptor for org.apache.uima:jcasgen-maven-plugin:jar:2.4.1-SNAPSHOT
[INFO] 
[INFO] --- maven-clean-plugin:2.5:clean (default-clean) @ uimafit-parent ---
[TASKS] Scanning folder '<https://builds.apache.org/job/UIMA-uimaFIT/ws/trunk'> for
files matching the pattern '**/*.java' - excludes: uimafit/**/*, uimafit-examples/**/*, uimafit-spring/**/*,
uimafit-maven-plugin/**/*, uimafit-legacy-support/**/*, uimafit-docbook/**/*, uimafit-cpe/**/*
[TASKS] Found 0 files to scan for tasks
Found 0 open tasks.
[TASKS] Computing warning deltas based on reference build #89
[INFO] 
[INFO] --- build-helper-maven-plugin:1.7:parse-version (parse-project-version) @ uimafit-parent
---
[INFO] 
[INFO] --- uima-build-helper-maven-plugin:4:parse-date-time (set buildYear and buildMonth)
@ uimafit-parent ---
[INFO] 
[INFO] --- gmaven-plugin:1.4:execute (read-notice) @ uimafit-parent ---
[INFO] 
[INFO] --- maven-remote-resources-plugin:1.2.1:process (default) @ uimafit-parent ---
[INFO] 
[INFO] --- build-helper-maven-plugin:1.7:parse-version (parse-project-version) @ uimafit-parent
---
[INFO] 
[INFO] --- uima-build-helper-maven-plugin:4:parse-date-time (set buildYear and buildMonth)
@ uimafit-parent ---
[INFO] 
[INFO] --- gmaven-plugin:1.4:execute (read-notice) @ uimafit-parent ---
Jun 21, 2013 2:10:09 AM hudson.maven.ExecutedMojo <init>
WARNING: Failed to getClass for org.apache.maven.plugin.javadoc.JavadocReport
[INFO] 
[INFO] --- maven-javadoc-plugin:2.9:javadoc (javadocs-distr) @ uimafit-parent ---
[INFO] 
[INFO] --- maven-site-plugin:3.2:attach-descriptor (attach-descriptor) @ uimafit-parent ---
[INFO] 
[INFO] --- findbugs-maven-plugin:2.5.2:findbugs (default) @ uimafit-parent ---
[FINDBUGS] No report found for mojo findbugs
[INFO] 
[INFO] --- maven-pmd-plugin:3.0:cpd (default) @ uimafit-parent ---
[DRY] No report found for mojo cpd
[INFO] 
[INFO] --- maven-pmd-plugin:3.0:pmd (default) @ uimafit-parent ---
[PMD] No report found for mojo pmd
[INFO] [INFO] Installing <https://builds.apache.org/job/UIMA-uimaFIT/ws/trunk/pom.xml>
to /home/jenkins/jenkins-slave/maven-repositories/0/org/apache/uima/uimafit-parent/2.0.0-SNAPSHOT/uimafit-parent-2.0.0-SNAPSHOT.pom

[INFO] --- maven-install-plugin:2.4:install (default-install) @ uimafit-parent ---
[INFO] 
[INFO] --- build-helper-maven-plugin:1.7:parse-version (parse-project-version) @ uimafit-parent
---
[INFO] 
[INFO] --- uima-build-helper-maven-plugin:4:parse-date-time (set buildYear and buildMonth)
@ uimafit-parent ---
[INFO] 
[INFO] --- gmaven-plugin:1.4:execute (read-notice) @ uimafit-parent ---
[INFO] 
[INFO] --- maven-remote-resources-plugin:1.2.1:process (default) @ uimafit-parent ---
Jun 21, 2013 2:10:22 AM hudson.maven.ExecutedMojo <init>
WARNING: Failed to getClass for org.apache.maven.plugin.dependency.AnalyzeMojo
[INFO] 
[INFO] --- maven-dependency-plugin:2.3:analyze (default-cli) @ uimafit-parent ---
[INFO] Skipping pom project
[INFO] 
[INFO] --- build-helper-maven-plugin:1.7:parse-version (parse-project-version) @ uimafit-parent
---
[INFO] 
[INFO] --- uima-build-helper-maven-plugin:4:parse-date-time (set buildYear and buildMonth)
@ uimafit-parent ---
[INFO] 
[INFO] --- gmaven-plugin:1.4:execute (read-notice) @ uimafit-parent ---
[INFO] 
[INFO] --- maven-remote-resources-plugin:1.2.1:process (default) @ uimafit-parent ---
[INFO] 
[INFO] --- cobertura-maven-plugin:2.5.2:instrument (default-cli) @ uimafit-parent ---
[INFO] Skipping cobertura mojo for project with packaging type 'pom'
[INFO] 
[INFO] --- cobertura-maven-plugin:2.5.2:cobertura (default-cli) @ uimafit-parent ---
[INFO] Downloading: http://repository.apache.org/snapshots/org/apache/uima/jcasgen-maven-plugin/2.4.1-SNAPSHOT/jcasgen-maven-plugin-2.4.1-SNAPSHOT.pom
                                                                        
[INFO] ------------------------------------------------------------------------
[INFO] Building uimaFIT 2.0.0-SNAPSHOT
[INFO] ------------------------------------------------------------------------
[WARNING] The POM for org.apache.uima:jcasgen-maven-plugin:jar:2.4.1-SNAPSHOT is missing,
no dependency information available
[INFO]                                                                         
[INFO] ------------------------------------------------------------------------
[INFO] Skipping uimaFIT - Parent
[INFO] This project has been banned from the build due to previous failures.
[INFO] ------------------------------------------------------------------------
[INFO] ------------------------------------------------------------------------
[INFO] Reactor Summary:
[INFO] 
[INFO] uimaFIT - Parent .................................. SUCCESS [49.475s]
[INFO] uimaFIT ........................................... FAILURE [0.198s]
[INFO] uimaFIT - Examples ................................ SKIPPED
[INFO] uimaFIT - Spring integration ...................... SKIPPED
[INFO] uimaFIT - Maven Plugin ............................ SKIPPED
[INFO] uimaFIT - Legacy uimaFIT support .................. SKIPPED
[INFO] uimaFIT - Documentation ........................... SKIPPED
[INFO] uimaFIT- Collection Processing Engine support ..... SKIPPED
[INFO] ------------------------------------------------------------------------
[INFO] BUILD FAILURE
[INFO] ------------------------------------------------------------------------
[INFO] Total time: 55.501s
[INFO] Finished at: Fri Jun 21 02:10:26 UTC 2013
[INFO] Final Memory: 33M/78M
[INFO] ------------------------------------------------------------------------
[JENKINS] Archiving <https://builds.apache.org/job/UIMA-uimaFIT/ws/trunk/uimafit-cpe/pom.xml>
to /home/hudson/hudson/jobs/UIMA-uimaFIT/modules/org.apache.uima$uimafit-cpe/builds/2013-06-21_02-09-04/archive/org.apache.uima/uimafit-cpe/2.0.0-SNAPSHOT/uimafit-cpe-2.0.0-SNAPSHOT.pom
[JENKINS] Archiving <https://builds.apache.org/job/UIMA-uimaFIT/ws/trunk/uimafit/pom.xml>
to /home/hudson/hudson/jobs/UIMA-uimaFIT/modules/org.apache.uima$uimafit/builds/2013-06-21_02-09-03/archive/org.apache.uima/uimafit/2.0.0-SNAPSHOT/uimafit-2.0.0-SNAPSHOT.pom
[JENKINS] Archiving <https://builds.apache.org/job/UIMA-uimaFIT/ws/trunk/uimafit-maven-plugin/pom.xml>
to /home/hudson/hudson/jobs/UIMA-uimaFIT/modules/org.apache.uima$uimafit-maven-plugin/builds/2013-06-21_02-09-04/archive/org.apache.uima/uimafit-maven-plugin/2.0.0-SNAPSHOT/uimafit-maven-plugin-2.0.0-SNAPSHOT.pom
[JENKINS] Archiving <https://builds.apache.org/job/UIMA-uimaFIT/ws/trunk/uimafit-spring/pom.xml>
to /home/hudson/hudson/jobs/UIMA-uimaFIT/modules/org.apache.uima$uimafit-spring/builds/2013-06-21_02-09-04/archive/org.apache.uima/uimafit-spring/2.0.0-SNAPSHOT/uimafit-spring-2.0.0-SNAPSHOT.pom
[JENKINS] Archiving <https://builds.apache.org/job/UIMA-uimaFIT/ws/trunk/uimafit-docbook/pom.xml>
to /home/hudson/hudson/jobs/UIMA-uimaFIT/modules/org.apache.uima$uimafit-docbook/builds/2013-06-21_02-09-04/archive/org.apache.uima/uimafit-docbook/2.0.0-SNAPSHOT/uimafit-docbook-2.0.0-SNAPSHOT.pom
[JENKINS] Archiving <https://builds.apache.org/job/UIMA-uimaFIT/ws/trunk/uimafit-examples/pom.xml>
to /home/hudson/hudson/jobs/UIMA-uimaFIT/modules/org.apache.uima$uimafit-examples/builds/2013-06-21_02-09-03/archive/org.apache.uima/uimafit-examples/2.0.0-SNAPSHOT/uimafit-examples-2.0.0-SNAPSHOT.pom
[JENKINS] Archiving <https://builds.apache.org/job/UIMA-uimaFIT/ws/trunk/pom.xml> to
/home/hudson/hudson/jobs/UIMA-uimaFIT/modules/org.apache.uima$uimafit-parent/builds/2013-06-21_02-09-03/archive/org.apache.uima/uimafit-parent/2.0.0-SNAPSHOT/uimafit-parent-2.0.0-SNAPSHOT.pom
[JENKINS] Archiving <https://builds.apache.org/job/UIMA-uimaFIT/ws/trunk/uimafit-legacy-support/pom.xml>
to /home/hudson/hudson/jobs/UIMA-uimaFIT/modules/org.apache.uima$uimafit-legacy-support/builds/2013-06-21_02-09-04/archive/org.apache.uima/uimafit-legacy-support/2.0.0-SNAPSHOT/uimafit-legacy-support-2.0.0-SNAPSHOT.pom
[WARNING] The requested profile "javancss" could not be activated because it does not exist.
[WARNING] The requested profile "cobertura-aggregate" could not be activated because it does
not exist.
[WARNING] The requested profile "attach-source" could not be activated because it does not
exist.
[WARNING] The requested profile "attach-javadoc" could not be activated because it does not
exist.
[WARNING] The requested profile "attach-test" could not be activated because it does not exist.
Waiting for Jenkins to finish collecting data
mavenExecutionResult exceptions not empty
message : Plugin org.apache.uima:jcasgen-maven-plugin:2.4.1-SNAPSHOT or one of its dependencies
could not be resolved: Failed to read artifact descriptor for org.apache.uima:jcasgen-maven-plugin:jar:2.4.1-SNAPSHOT
cause : Failed to read artifact descriptor for org.apache.uima:jcasgen-maven-plugin:jar:2.4.1-SNAPSHOT
Stack trace : 
org.apache.maven.plugin.PluginResolutionException: Plugin org.apache.uima:jcasgen-maven-plugin:2.4.1-SNAPSHOT
or one of its dependencies could not be resolved: Failed to read artifact descriptor for org.apache.uima:jcasgen-maven-plugin:jar:2.4.1-SNAPSHOT
	at org.apache.maven.plugin.internal.DefaultPluginDependenciesResolver.resolve(DefaultPluginDependenciesResolver.java:129)
	at org.apache.maven.plugin.internal.DefaultMavenPluginManager.getPluginDescriptor(DefaultMavenPluginManager.java:142)
	at org.apache.maven.plugin.internal.DefaultMavenPluginManager.getMojoDescriptor(DefaultMavenPluginManager.java:261)
	at org.apache.maven.plugin.DefaultBuildPluginManager.getMojoDescriptor(DefaultBuildPluginManager.java:185)
	at org.apache.maven.lifecycle.internal.DefaultLifecycleExecutionPlanCalculator.calculateLifecycleMappings(DefaultLifecycleExecutionPlanCalculator.java:280)
	at org.apache.maven.lifecycle.internal.DefaultLifecycleExecutionPlanCalculator.calculateMojoExecutions(DefaultLifecycleExecutionPlanCalculator.java:193)
	at org.apache.maven.lifecycle.internal.DefaultLifecycleExecutionPlanCalculator.calculateExecutionPlan(DefaultLifecycleExecutionPlanCalculator.java:112)
	at org.apache.maven.lifecycle.internal.DefaultLifecycleExecutionPlanCalculator.calculateExecutionPlan(DefaultLifecycleExecutionPlanCalculator.java:129)
	at org.apache.maven.lifecycle.internal.BuilderCommon.resolveBuildPlan(BuilderCommon.java:92)
	at org.apache.maven.lifecycle.internal.LifecycleModuleBuilder.buildProject(LifecycleModuleBuilder.java:81)
	at org.apache.maven.lifecycle.internal.LifecycleModuleBuilder.buildProject(LifecycleModuleBuilder.java:59)
	at org.apache.maven.lifecycle.internal.LifecycleStarter.singleThreadedBuild(LifecycleStarter.java:183)
	at org.apache.maven.lifecycle.internal.LifecycleStarter.execute(LifecycleStarter.java:161)
	at org.apache.maven.DefaultMaven.doExecute(DefaultMaven.java:320)
	at org.apache.maven.DefaultMaven.execute(DefaultMaven.java:156)
	at org.jvnet.hudson.maven3.launcher.Maven3Launcher.main(Maven3Launcher.java:79)
	at sun.reflect.NativeMethodAccessorImpl.invoke0(Native Method)
	at sun.reflect.NativeMethodAccessorImpl.invoke(NativeMethodAccessorImpl.java:39)
	at sun.reflect.DelegatingMethodAccessorImpl.invoke(DelegatingMethodAccessorImpl.java:25)
	at java.lang.reflect.Method.invoke(Method.java:592)
	at org.codehaus.plexus.classworlds.launcher.Launcher.launchStandard(Launcher.java:329)
	at org.codehaus.plexus.classworlds.launcher.Launcher.launch(Launcher.java:239)
	at org.jvnet.hudson.maven3.agent.Maven3Main.launch(Maven3Main.java:158)
	at hudson.maven.Maven3Builder.call(Maven3Builder.java:100)
	at hudson.maven.Maven3Builder.call(Maven3Builder.java:66)
	at hudson.remoting.UserRequest.perform(UserRequest.java:118)
	at hudson.remoting.UserRequest.perform(UserRequest.java:48)
	at hudson.remoting.Request$2.run(Request.java:326)
	at hudson.remoting.InterceptingExecutorService$1.call(InterceptingExecutorService.java:72)
	at java.util.concurrent.FutureTask$Sync.innerRun(FutureTask.java:269)
	at java.util.concurrent.FutureTask.run(FutureTask.java:123)
	at java.util.concurrent.ThreadPoolExecutor$Worker.runTask(ThreadPoolExecutor.java:651)
	at java.util.concurrent.ThreadPoolExecutor$Worker.run(ThreadPoolExecutor.java:676)
	at java.lang.Thread.run(Thread.java:595)
Caused by: org.sonatype.aether.resolution.ArtifactDescriptorException: Failed to read artifact
descriptor for org.apache.uima:jcasgen-maven-plugin:jar:2.4.1-SNAPSHOT
	at org.apache.maven.repository.internal.DefaultArtifactDescriptorReader.loadPom(DefaultArtifactDescriptorReader.java:296)
	at org.apache.maven.repository.internal.DefaultArtifactDescriptorReader.readArtifactDescriptor(DefaultArtifactDescriptorReader.java:186)
	at org.sonatype.aether.impl.internal.DefaultRepositorySystem.readArtifactDescriptor(DefaultRepositorySystem.java:279)
	at org.apache.maven.plugin.internal.DefaultPluginDependenciesResolver.resolve(DefaultPluginDependenciesResolver.java:115)
	... 33 more
Caused by: org.sonatype.aether.resolution.ArtifactResolutionException: Could not find artifact
org.apache.uima:jcasgen-maven-plugin:pom:2.4.1-SNAPSHOT in apache.snapshots.plugins (http://repository.apache.org/snapshots)
	at org.sonatype.aether.impl.internal.DefaultArtifactResolver.resolve(DefaultArtifactResolver.java:538)
	at org.sonatype.aether.impl.internal.DefaultArtifactResolver.resolveArtifacts(DefaultArtifactResolver.java:216)
	at org.sonatype.aether.impl.internal.DefaultArtifactResolver.resolveArtifact(DefaultArtifactResolver.java:193)
	at org.apache.maven.repository.internal.DefaultArtifactDescriptorReader.loadPom(DefaultArtifactDescriptorReader.java:281)
	... 36 more
Caused by: org.sonatype.aether.transfer.ArtifactNotFoundException: Could not find artifact
org.apache.uima:jcasgen-maven-plugin:pom:2.4.1-SNAPSHOT in apache.snapshots.plugins (http://repository.apache.org/snapshots)
	at org.sonatype.aether.connector.wagon.WagonRepositoryConnector$4.wrap(WagonRepositoryConnector.java:947)
	at org.sonatype.aether.connector.wagon.WagonRepositoryConnector$4.wrap(WagonRepositoryConnector.java:941)
	at org.sonatype.aether.connector.wagon.WagonRepositoryConnector$GetTask.run(WagonRepositoryConnector.java:669)
	at org.sonatype.aether.util.concurrency.RunnableErrorForwarder$1.run(RunnableErrorForwarder.java:60)
	... 3 more
Sending e-mails to: dev@uima.apache.org
channel stopped
[WARNINGS] Skipping publisher since build result is FAILURE
Skipping Cobertura coverage report as build was not UNSTABLE or better ...

Mime
View raw message