uima-dev mailing list archives

Site index · List index
Message view « Date » · « Thread »
Top « Date » · « Thread »
From Apache Jenkins Server <jenk...@builds.apache.org>
Subject Build failed in Jenkins: UIMA-uimaFIT #127
Date Sun, 04 Aug 2013 13:16:06 GMT
See <https://builds.apache.org/job/UIMA-uimaFIT/127/changes>

Changes:

[rec] [UIMA-2892] Improve/clean up JavaDoc (and Exceptions)
- Removed unnecessary throws declarations

[rec] [UIMA-2892] Improve/clean up JavaDoc (and Exceptions)
- Removed unnecessary throws declarations

[rec] [UIMA-3097] Split JCasIterable into iterable and iterator parts
- Added stepPipeline() method to SimplePipeline (uses JCasIterable)
- Split JCasIterator out of JCasIterable

------------------------------------------
[...truncated 2541 lines...]
Tests run: 1, Failures: 0, Errors: 0, Skipped: 0, Time elapsed: 0 sec
Running org.apache.uima.fit.util.HideOutputTest
Tests run: 1, Failures: 0, Errors: 0, Skipped: 0, Time elapsed: 0 sec
Running org.apache.uima.fit.util.FSCollectionFactoryTest
Tests run: 13, Failures: 0, Errors: 0, Skipped: 0, Time elapsed: 0.256 sec
Running org.apache.uima.fit.util.SimplePipelineTest
Tests run: 1, Failures: 0, Errors: 0, Skipped: 0, Time elapsed: 0.012 sec
Running org.apache.uima.fit.util.JCasIterableTest
Tests run: 1, Failures: 0, Errors: 0, Skipped: 0, Time elapsed: 0.001 sec
Running org.apache.uima.fit.descriptor.TypeCapabilityTest
Tests run: 1, Failures: 0, Errors: 0, Skipped: 0, Time elapsed: 0.002 sec
Running org.apache.uima.fit.testing.factory.TokenBuilderTest
Tests run: 9, Failures: 0, Errors: 0, Skipped: 0, Time elapsed: 0.015 sec
Running org.apache.uima.fit.factory.ExternalResourceConfiguratorTest
Tests run: 2, Failures: 0, Errors: 0, Skipped: 0, Time elapsed: 0.004 sec
Running org.apache.uima.fit.factory.FlowControllerFactoryExternalResourceTest
Tests run: 1, Failures: 0, Errors: 0, Skipped: 0, Time elapsed: 0.029 sec
Running org.apache.uima.fit.factory.testCrs.SingleFileXReaderTest
Tests run: 1, Failures: 0, Errors: 0, Skipped: 0, Time elapsed: 0.073 sec
Running org.apache.uima.fit.factory.LoggingTest
Tests run: 2, Failures: 0, Errors: 0, Skipped: 0, Time elapsed: 0.148 sec
Running org.apache.uima.fit.factory.ResourceCreationSpecifierFactoryTest
Tests run: 4, Failures: 0, Errors: 0, Skipped: 0, Time elapsed: 0.008 sec
Running org.apache.uima.fit.factory.UimaContextFactoryTest
Tests run: 1, Failures: 0, Errors: 0, Skipped: 0, Time elapsed: 0.001 sec
Running org.apache.uima.fit.factory.JCasBuilderTest
Tests run: 1, Failures: 0, Errors: 0, Skipped: 0, Time elapsed: 0.02 sec
Running org.apache.uima.fit.factory.AnalysisEngineFactoryExternalResourceTest
Tests run: 10, Failures: 0, Errors: 0, Skipped: 0, Time elapsed: 0.451 sec
Running org.apache.uima.fit.factory.FsIndexFactoryTest
Tests run: 3, Failures: 0, Errors: 0, Skipped: 0, Time elapsed: 0.035 sec
Running org.apache.uima.fit.factory.CollectionReaderFactoryExternalResourceTest
Tests run: 1, Failures: 0, Errors: 0, Skipped: 0, Time elapsed: 0.012 sec
Running org.apache.uima.fit.factory.initializable.InitializableFactoryTest
Tests run: 3, Failures: 0, Errors: 0, Skipped: 0, Time elapsed: 0.007 sec
Running org.apache.uima.fit.factory.ExternalResourceFactoryTest
Tests run: 4, Failures: 0, Errors: 0, Skipped: 0, Time elapsed: 0.446 sec
Running org.apache.uima.fit.factory.AnalysisEngineFactoryTest
Tests run: 12, Failures: 0, Errors: 0, Skipped: 0, Time elapsed: 0.196 sec
Running org.apache.uima.fit.factory.SofaMappingFactoryTest
Tests run: 1, Failures: 0, Errors: 0, Skipped: 0, Time elapsed: 0 sec
Running org.apache.uima.fit.factory.TypeSystemDescriptionFactoryTest
Tests run: 2, Failures: 0, Errors: 0, Skipped: 0, Time elapsed: 0.013 sec
Running org.apache.uima.fit.factory.TypePrioritiesFactoryTest
Tests run: 1, Failures: 0, Errors: 0, Skipped: 0, Time elapsed: 0.009 sec
Running org.apache.uima.fit.factory.JCasFactoryTest
Tests run: 4, Failures: 0, Errors: 0, Skipped: 0, Time elapsed: 0.038 sec
Running org.apache.uima.fit.factory.AggregateBuilderTest
Tests run: 6, Failures: 0, Errors: 0, Skipped: 0, Time elapsed: 0.047 sec
Running org.apache.uima.fit.factory.ConfigurationParameterFactoryTest
Tests run: 8, Failures: 0, Errors: 0, Skipped: 0, Time elapsed: 0.004 sec
Running org.apache.uima.fit.factory.AnnotationFactoryTest
Tests run: 1, Failures: 0, Errors: 0, Skipped: 0, Time elapsed: 0 sec
Running org.apache.uima.fit.factory.AggregateWithReaderTest
Tests run: 2, Failures: 0, Errors: 0, Skipped: 0, Time elapsed: 0.046 sec
Running org.apache.uima.fit.factory.CollectionReaderFactoryTest
Tests run: 2, Failures: 0, Errors: 0, Skipped: 0, Time elapsed: 0.057 sec

Results :

Tests run: 157, Failures: 0, Errors: 0, Skipped: 0

[JENKINS] Recording test results
Aug 4, 2013 1:15:36 PM org.apache.maven.cli.event.ExecutionEventLogger mojoStarted
INFO: 
Aug 4, 2013 1:15:36 PM org.apache.maven.cli.event.ExecutionEventLogger mojoStarted
INFO: --- maven-enforcer-plugin:1.0.1:enforce (enforce-versions) @ uimafit-legacy-support
---
Aug 4, 2013 1:15:36 PM org.apache.maven.cli.event.ExecutionEventLogger mojoStarted
INFO: 
Aug 4, 2013 1:15:36 PM org.apache.maven.cli.event.ExecutionEventLogger mojoStarted
INFO: --- build-helper-maven-plugin:1.7:parse-version (parse-project-version) @ uimafit-legacy-support
---
Aug 4, 2013 1:15:36 PM org.apache.maven.cli.event.ExecutionEventLogger mojoStarted
INFO: 
Aug 4, 2013 1:15:36 PM org.apache.maven.cli.event.ExecutionEventLogger mojoStarted
INFO: --- gmaven-plugin:1.4:execute (read-notice) @ uimafit-legacy-support ---
Aug 4, 2013 1:15:37 PM hudson.maven.ExecutedMojo <init>
WARNING: Failed to getClass for org.apache.maven.plugin.javadoc.JavadocReport
Aug 4, 2013 1:15:37 PM org.apache.maven.cli.event.ExecutionEventLogger mojoStarted
INFO: 
Aug 4, 2013 1:15:37 PM org.apache.maven.cli.event.ExecutionEventLogger mojoStarted
INFO: --- maven-javadoc-plugin:2.9:javadoc (javadocs-distr) @ uimafit-legacy-support ---
[JENKINS] Archiving  javadoc
Aug 4, 2013 1:15:40 PM org.apache.maven.cli.event.ExecutionEventLogger mojoStarted
INFO: 
Aug 4, 2013 1:15:40 PM org.apache.maven.cli.event.ExecutionEventLogger mojoStarted
INFO: --- maven-jar-plugin:2.4:jar (default-jar) @ uimafit-legacy-support ---
[INFO] Building jar: <https://builds.apache.org/job/UIMA-uimaFIT/ws/trunk/uimafit-legacy-support/target/uimafit-legacy-support-2.0.0-SNAPSHOT.jar>
Aug 4, 2013 1:15:40 PM org.apache.maven.cli.event.ExecutionEventLogger mojoStarted
INFO: 
Aug 4, 2013 1:15:40 PM org.apache.maven.cli.event.ExecutionEventLogger mojoStarted
INFO: --- maven-site-plugin:3.2:attach-descriptor (attach-descriptor) @ uimafit-legacy-support
---
Aug 4, 2013 1:15:40 PM org.apache.maven.cli.event.ExecutionEventLogger mojoStarted
INFO: 
Aug 4, 2013 1:15:40 PM org.apache.maven.cli.event.ExecutionEventLogger mojoStarted
INFO: --- findbugs-maven-plugin:2.5.2:findbugs (default) @ uimafit-legacy-support ---
[INFO] Fork Value is true
     [java] Warnings generated: 13
[INFO] Done FindBugs Analysis....
Aug 4, 2013 1:15:53 PM org.apache.maven.cli.event.ExecutionEventLogger projectSkipped
INFO:                                                                         
Aug 4, 2013 1:15:53 PM org.apache.maven.cli.event.ExecutionEventLogger projectSkipped
INFO: ------------------------------------------------------------------------
Aug 4, 2013 1:15:53 PM org.apache.maven.cli.event.ExecutionEventLogger projectSkipped
INFO: Skipping uimaFIT - Parent
Aug 4, 2013 1:15:53 PM org.apache.maven.cli.event.ExecutionEventLogger projectSkipped
INFO: This project has been banned from the build due to previous failures.
Aug 4, 2013 1:15:53 PM org.apache.maven.cli.event.ExecutionEventLogger projectSkipped
INFO: ------------------------------------------------------------------------
Aug 4, 2013 1:15:53 PM org.apache.maven.cli.event.ExecutionEventLogger logReactorSummary
INFO: ------------------------------------------------------------------------
Aug 4, 2013 1:15:53 PM org.apache.maven.cli.event.ExecutionEventLogger logReactorSummary
INFO: Reactor Summary:
Aug 4, 2013 1:15:53 PM org.apache.maven.cli.event.ExecutionEventLogger logReactorSummary
INFO: 
Aug 4, 2013 1:15:53 PM org.apache.maven.cli.event.ExecutionEventLogger logReactorSummary
INFO: uimaFIT - Parent .................................. SUCCESS [42.665s]
Aug 4, 2013 1:15:53 PM org.apache.maven.cli.event.ExecutionEventLogger logReactorSummary
INFO: uimaFIT ........................................... SUCCESS [3:07.354s]
Aug 4, 2013 1:15:53 PM org.apache.maven.cli.event.ExecutionEventLogger logReactorSummary
INFO: uimaFIT - Examples ................................ SUCCESS [47.441s]
Aug 4, 2013 1:15:53 PM org.apache.maven.cli.event.ExecutionEventLogger logReactorSummary
INFO: uimaFIT - Spring integration ...................... SUCCESS [36.161s]
Aug 4, 2013 1:15:53 PM org.apache.maven.cli.event.ExecutionEventLogger logReactorSummary
INFO: uimaFIT - Maven Plugin ............................ SUCCESS [1:04.631s]
Aug 4, 2013 1:15:53 PM org.apache.maven.cli.event.ExecutionEventLogger logReactorSummary
INFO: uimaFIT - Legacy uimaFIT support .................. FAILURE [36.966s]
Aug 4, 2013 1:15:53 PM org.apache.maven.cli.event.ExecutionEventLogger logReactorSummary
INFO: uimaFIT - Documentation ........................... SKIPPED
Aug 4, 2013 1:15:53 PM org.apache.maven.cli.event.ExecutionEventLogger logReactorSummary
INFO: uimaFIT - Collection Processing Engine support .... SKIPPED
Aug 4, 2013 1:15:53 PM org.apache.maven.cli.event.ExecutionEventLogger logResult
INFO: ------------------------------------------------------------------------
Aug 4, 2013 1:15:53 PM org.apache.maven.cli.event.ExecutionEventLogger logResult
INFO: BUILD FAILURE
Aug 4, 2013 1:15:53 PM org.apache.maven.cli.event.ExecutionEventLogger logStats
INFO: ------------------------------------------------------------------------
Aug 4, 2013 1:15:53 PM org.apache.maven.cli.event.ExecutionEventLogger logStats
INFO: Total time: 7:04.352s
Aug 4, 2013 1:15:53 PM org.apache.maven.cli.event.ExecutionEventLogger logStats
INFO: Finished at: Sun Aug 04 13:15:53 UTC 2013
Aug 4, 2013 1:15:53 PM org.apache.maven.cli.event.ExecutionEventLogger logStats
INFO: Final Memory: 56M/228M
Aug 4, 2013 1:15:53 PM org.apache.maven.cli.event.ExecutionEventLogger sessionEnded
INFO: ------------------------------------------------------------------------
[JENKINS] Archiving <https://builds.apache.org/job/UIMA-uimaFIT/ws/trunk/uimafit-maven-plugin/pom.xml>
to /home/hudson/hudson/jobs/UIMA-uimaFIT/modules/org.apache.uima$uimafit-maven-plugin/builds/2013-08-04_13-08-36/archive/org.apache.uima/uimafit-maven-plugin/2.0.0-SNAPSHOT/uimafit-maven-plugin-2.0.0-SNAPSHOT.pom
[JENKINS] Archiving <https://builds.apache.org/job/UIMA-uimaFIT/ws/trunk/uimafit-maven-plugin/target/uimafit-maven-plugin-2.0.0-SNAPSHOT.jar>
to /home/hudson/hudson/jobs/UIMA-uimaFIT/modules/org.apache.uima$uimafit-maven-plugin/builds/2013-08-04_13-08-36/archive/org.apache.uima/uimafit-maven-plugin/2.0.0-SNAPSHOT/uimafit-maven-plugin-2.0.0-SNAPSHOT.jar
[JENKINS] Archiving <https://builds.apache.org/job/UIMA-uimaFIT/ws/trunk/uimafit-spring/pom.xml>
to /home/hudson/hudson/jobs/UIMA-uimaFIT/modules/org.apache.uima$uimafit-spring/builds/2013-08-04_13-08-36/archive/org.apache.uima/uimafit-spring/2.0.0-SNAPSHOT/uimafit-spring-2.0.0-SNAPSHOT.pom
[JENKINS] Archiving <https://builds.apache.org/job/UIMA-uimaFIT/ws/trunk/uimafit-spring/target/uimafit-spring-2.0.0-SNAPSHOT.jar>
to /home/hudson/hudson/jobs/UIMA-uimaFIT/modules/org.apache.uima$uimafit-spring/builds/2013-08-04_13-08-36/archive/org.apache.uima/uimafit-spring/2.0.0-SNAPSHOT/uimafit-spring-2.0.0-SNAPSHOT.jar
[JENKINS] Archiving <https://builds.apache.org/job/UIMA-uimaFIT/ws/trunk/pom.xml> to
/home/hudson/hudson/jobs/UIMA-uimaFIT/modules/org.apache.uima$uimafit-parent/builds/2013-08-04_13-08-35/archive/org.apache.uima/uimafit-parent/2.0.0-SNAPSHOT/uimafit-parent-2.0.0-SNAPSHOT.pom
[JENKINS] Archiving <https://builds.apache.org/job/UIMA-uimaFIT/ws/trunk/uimafit-examples/pom.xml>
to /home/hudson/hudson/jobs/UIMA-uimaFIT/modules/org.apache.uima$uimafit-examples/builds/2013-08-04_13-08-36/archive/org.apache.uima/uimafit-examples/2.0.0-SNAPSHOT/uimafit-examples-2.0.0-SNAPSHOT.pom
[JENKINS] Archiving <https://builds.apache.org/job/UIMA-uimaFIT/ws/trunk/uimafit-examples/target/uimafit-examples-2.0.0-SNAPSHOT.jar>
to /home/hudson/hudson/jobs/UIMA-uimaFIT/modules/org.apache.uima$uimafit-examples/builds/2013-08-04_13-08-36/archive/org.apache.uima/uimafit-examples/2.0.0-SNAPSHOT/uimafit-examples-2.0.0-SNAPSHOT.jar
[JENKINS] Archiving <https://builds.apache.org/job/UIMA-uimaFIT/ws/trunk/uimafit/pom.xml>
to /home/hudson/hudson/jobs/UIMA-uimaFIT/modules/org.apache.uima$uimafit/builds/2013-08-04_13-08-36/archive/org.apache.uima/uimafit/2.0.0-SNAPSHOT/uimafit-2.0.0-SNAPSHOT.pom
[JENKINS] Archiving <https://builds.apache.org/job/UIMA-uimaFIT/ws/trunk/uimafit/target/uimafit-2.0.0-SNAPSHOT.jar>
to /home/hudson/hudson/jobs/UIMA-uimaFIT/modules/org.apache.uima$uimafit/builds/2013-08-04_13-08-36/archive/org.apache.uima/uimafit/2.0.0-SNAPSHOT/uimafit-2.0.0-SNAPSHOT.jar
[JENKINS] Archiving <https://builds.apache.org/job/UIMA-uimaFIT/ws/trunk/uimafit-cpe/pom.xml>
to /home/hudson/hudson/jobs/UIMA-uimaFIT/modules/org.apache.uima$uimafit-cpe/builds/2013-08-04_13-08-37/archive/org.apache.uima/uimafit-cpe/2.0.0-SNAPSHOT/uimafit-cpe-2.0.0-SNAPSHOT.pom
[JENKINS] Archiving <https://builds.apache.org/job/UIMA-uimaFIT/ws/trunk/uimafit-docbook/pom.xml>
to /home/hudson/hudson/jobs/UIMA-uimaFIT/modules/org.apache.uima$uimafit-docbook/builds/2013-08-04_13-08-37/archive/org.apache.uima/uimafit-docbook/2.0.0-SNAPSHOT/uimafit-docbook-2.0.0-SNAPSHOT.pom
[JENKINS] Archiving <https://builds.apache.org/job/UIMA-uimaFIT/ws/trunk/uimafit-legacy-support/pom.xml>
to /home/hudson/hudson/jobs/UIMA-uimaFIT/modules/org.apache.uima$uimafit-legacy-support/builds/2013-08-04_13-08-37/archive/org.apache.uima/uimafit-legacy-support/2.0.0-SNAPSHOT/uimafit-legacy-support-2.0.0-SNAPSHOT.pom
[JENKINS] Archiving <https://builds.apache.org/job/UIMA-uimaFIT/ws/trunk/uimafit-legacy-support/target/uimafit-legacy-support-2.0.0-SNAPSHOT.jar>
to /home/hudson/hudson/jobs/UIMA-uimaFIT/modules/org.apache.uima$uimafit-legacy-support/builds/2013-08-04_13-08-37/archive/org.apache.uima/uimafit-legacy-support/2.0.0-SNAPSHOT/uimafit-legacy-support-2.0.0-SNAPSHOT.jar
[WARNING] The requested profile "javancss" could not be activated because it does not exist.
[WARNING] The requested profile "cobertura-aggregate" could not be activated because it does
not exist.
[WARNING] The requested profile "attach-source" could not be activated because it does not
exist.
[WARNING] The requested profile "attach-javadoc" could not be activated because it does not
exist.
[WARNING] The requested profile "attach-test" could not be activated because it does not exist.
Waiting for Jenkins to finish collecting data
mavenExecutionResult exceptions not empty
message : Internal error: hudson.remoting.RemotingSystemException: java.io.StreamCorruptedException:
invalid handle value: 00007E00
cause : java.io.StreamCorruptedException: invalid handle value: 00007E00
Stack trace : 
org.apache.maven.InternalErrorException: Internal error: hudson.remoting.RemotingSystemException:
java.io.StreamCorruptedException: invalid handle value: 00007E00
	at org.apache.maven.lifecycle.internal.BuilderCommon.handleBuildError(BuilderCommon.java:128)
	at org.apache.maven.lifecycle.internal.LifecycleModuleBuilder.buildProject(LifecycleModuleBuilder.java:95)
	at org.apache.maven.lifecycle.internal.LifecycleModuleBuilder.buildProject(LifecycleModuleBuilder.java:59)
	at org.apache.maven.lifecycle.internal.LifecycleStarter.singleThreadedBuild(LifecycleStarter.java:183)
	at org.apache.maven.lifecycle.internal.LifecycleStarter.execute(LifecycleStarter.java:161)
	at org.apache.maven.DefaultMaven.doExecute(DefaultMaven.java:320)
	at org.apache.maven.DefaultMaven.execute(DefaultMaven.java:156)
	at org.jvnet.hudson.maven3.launcher.Maven3Launcher.main(Maven3Launcher.java:117)
	at sun.reflect.NativeMethodAccessorImpl.invoke0(Native Method)
	at sun.reflect.NativeMethodAccessorImpl.invoke(NativeMethodAccessorImpl.java:39)
	at sun.reflect.DelegatingMethodAccessorImpl.invoke(DelegatingMethodAccessorImpl.java:25)
	at java.lang.reflect.Method.invoke(Method.java:597)
	at org.codehaus.plexus.classworlds.launcher.Launcher.launchStandard(Launcher.java:329)
	at org.codehaus.plexus.classworlds.launcher.Launcher.launch(Launcher.java:239)
	at org.jvnet.hudson.maven3.agent.Maven3Main.launch(Maven3Main.java:178)
	at sun.reflect.NativeMethodAccessorImpl.invoke0(Native Method)
	at sun.reflect.NativeMethodAccessorImpl.invoke(NativeMethodAccessorImpl.java:39)
	at sun.reflect.DelegatingMethodAccessorImpl.invoke(DelegatingMethodAccessorImpl.java:25)
	at java.lang.reflect.Method.invoke(Method.java:597)
	at hudson.maven.Maven3Builder.call(Maven3Builder.java:129)
	at hudson.maven.Maven3Builder.call(Maven3Builder.java:67)
	at hudson.remoting.UserRequest.perform(UserRequest.java:118)
	at hudson.remoting.UserRequest.perform(UserRequest.java:48)
	at hudson.remoting.Request$2.run(Request.java:326)
	at hudson.remoting.InterceptingExecutorService$1.call(InterceptingExecutorService.java:72)
	at java.util.concurrent.FutureTask$Sync.innerRun(FutureTask.java:303)
	at java.util.concurrent.FutureTask.run(FutureTask.java:138)
	at java.util.concurrent.ThreadPoolExecutor$Worker.runTask(ThreadPoolExecutor.java:895)
	at java.util.concurrent.ThreadPoolExecutor$Worker.run(ThreadPoolExecutor.java:918)
	at java.lang.Thread.run(Thread.java:662)
Caused by: hudson.remoting.RemotingSystemException: java.io.StreamCorruptedException: invalid
handle value: 00007E00
	at hudson.remoting.RemoteInvocationHandler.invoke(RemoteInvocationHandler.java:183)
	at com.sun.proxy.$Proxy7.setExecutedMojos(Unknown Source)
	at hudson.maven.MavenBuildProxy$Filter.setExecutedMojos(MavenBuildProxy.java:243)
	at hudson.maven.Maven3Builder$MavenExecutionListener.recordMojoEnded(Maven3Builder.java:574)
	at hudson.maven.Maven3Builder$MavenExecutionListener.mojoSucceeded(Maven3Builder.java:560)
	at org.apache.maven.lifecycle.internal.DefaultExecutionEventCatapult.fire(DefaultExecutionEventCatapult.java:87)
	at org.apache.maven.lifecycle.internal.DefaultExecutionEventCatapult.fire(DefaultExecutionEventCatapult.java:42)
	at org.apache.maven.lifecycle.internal.MojoExecutor.execute(MojoExecutor.java:228)
	at org.apache.maven.lifecycle.internal.MojoExecutor.execute(MojoExecutor.java:153)
	at org.apache.maven.lifecycle.internal.MojoExecutor.execute(MojoExecutor.java:145)
	at org.apache.maven.lifecycle.internal.LifecycleModuleBuilder.buildProject(LifecycleModuleBuilder.java:84)
	... 28 more
Caused by: java.io.StreamCorruptedException: invalid handle value: 00007E00
	at java.io.ObjectInputStream.readHandle(ObjectInputStream.java:1452)
	at java.io.ObjectInputStream.readObject0(ObjectInputStream.java:1328)
	at java.io.ObjectInputStream.defaultReadFields(ObjectInputStream.java:1989)
	at java.io.ObjectInputStream.readSerialData(ObjectInputStream.java:1913)
	at java.io.ObjectInputStream.readOrdinaryObject(ObjectInputStream.java:1796)
	at java.io.ObjectInputStream.readObject0(ObjectInputStream.java:1348)
	at java.io.ObjectInputStream.readArray(ObjectInputStream.java:1704)
	at java.io.ObjectInputStream.readObject0(ObjectInputStream.java:1342)
	at java.io.ObjectInputStream.defaultReadFields(ObjectInputStream.java:1989)
	at java.io.ObjectInputStream.defaultReadObject(ObjectInputStream.java:499)
	at java.lang.Throwable.readObject(Throwable.java:913)
	at sun.reflect.GeneratedMethodAccessor129.invoke(Unknown Source)
	at sun.reflect.DelegatingMethodAccessorImpl.invoke(DelegatingMethodAccessorImpl.java:43)
	at java.lang.reflect.Method.invoke(Method.java:606)
	at java.io.ObjectStreamClass.invokeReadObject(ObjectStreamClass.java:1017)
	at java.io.ObjectInputStream.readSerialData(ObjectInputStream.java:1891)
	at java.io.ObjectInputStream.readOrdinaryObject(ObjectInputStream.java:1796)
	at java.io.ObjectInputStream.readObject0(ObjectInputStream.java:1348)
	at java.io.ObjectInputStream.defaultReadFields(ObjectInputStream.java:1989)
	at java.io.ObjectInputStream.readSerialData(ObjectInputStream.java:1913)
	at java.io.ObjectInputStream.readOrdinaryObject(ObjectInputStream.java:1796)
	at java.io.ObjectInputStream.readObject0(ObjectInputStream.java:1348)
	at java.io.ObjectInputStream.readObject(ObjectInputStream.java:370)
	at hudson.remoting.UserRequest.deserialize(UserRequest.java:182)
	at hudson.remoting.UserRequest.perform(UserRequest.java:98)
	at hudson.remoting.UserRequest.perform(UserRequest.java:48)
	at hudson.remoting.Request$2.run(Request.java:326)
	at hudson.remoting.InterceptingExecutorService$1.call(InterceptingExecutorService.java:72)
	at java.util.concurrent.FutureTask$Sync.innerRun(FutureTask.java:334)
	at java.util.concurrent.FutureTask.run(FutureTask.java:166)
	at java.util.concurrent.ThreadPoolExecutor.runWorker(ThreadPoolExecutor.java:1145)
	at java.util.concurrent.ThreadPoolExecutor$Worker.run(ThreadPoolExecutor.java:615)
	at java.lang.Thread.run(Thread.java:724)
Sending e-mails to: dev@uima.apache.org
channel stopped
[WARNINGS] Skipping publisher since build result is FAILURE
Skipping Cobertura coverage report as build was not UNSTABLE or better ...

Mime
View raw message