uima-dev mailing list archives

Site index · List index
Message view « Date » · « Thread »
Top « Date » · « Thread »
From Apache Jenkins Server <jenk...@builds.apache.org>
Subject Build failed in Jenkins: UIMA-DUCC #67
Date Tue, 07 Jan 2014 15:56:27 GMT
See <https://builds.apache.org/job/UIMA-DUCC/67/changes>

Changes:

[cwiklik] UIMA-3527 added target to svn ignore

[cwiklik] UIMA-3257 update JIRA link

[cwiklik] UIMA-3520 rollback to 1.0.0-SNAPSHOT

[cwiklik] UIMA-3253 Changed documentation, installation and setup sections

[cwiklik] UIMA-3253 Changed location of ducc docs. Copy INSTALL to root

------------------------------------------
[...truncated 3836 lines...]
[JENKINS] Recording test results
[INFO] 
[INFO] --- maven-jar-plugin:2.3.2:jar (default-jar) @ uima-ducc-examples ---
[INFO] Building jar: F:\hudson\hudson-slave\workspace\UIMA-DUCC\trunk\uima-ducc-examples\target\uima-ducc-examples-1.0.0-SNAPSHOT.jar
[INFO] 
[INFO] --- maven-site-plugin:3.2:attach-descriptor (attach-descriptor) @ uima-ducc-examples
---
[INFO] 
[INFO] --- maven-install-plugin:2.3.1:install (default-install) @ uima-ducc-examples ---
[INFO] Installing F:\hudson\hudson-slave\workspace\UIMA-DUCC\trunk\uima-ducc-examples\target\uima-ducc-examples-1.0.0-SNAPSHOT.jar
to f:\hudson\hudson-slave\maven-repositories\0\org\apache\uima\uima-ducc-examples\1.0.0-SNAPSHOT\uima-ducc-examples-1.0.0-SNAPSHOT.jar
[INFO] Installing F:\hudson\hudson-slave\workspace\UIMA-DUCC\trunk\uima-ducc-examples\pom.xml
to f:\hudson\hudson-slave\maven-repositories\0\org\apache\uima\uima-ducc-examples\1.0.0-SNAPSHOT\uima-ducc-examples-1.0.0-SNAPSHOT.pom
[INFO] 
[INFO] --- maven-pmd-plugin:2.7.1:pmd (default-cli) @ uima-ducc-examples ---
[PMD] Finding all files that match the pattern pmd.xml
[PMD] Parsing 1 files in F:\hudson\hudson-slave\workspace\UIMA-DUCC\trunk\uima-ducc-examples\target
[PMD] Successfully parsed file F:\hudson\hudson-slave\workspace\UIMA-DUCC\trunk\uima-ducc-examples\target\pmd.xml
of module uima-ducc-examples with 8 warnings.
[PMD] Computing warning deltas based on reference build #66
[INFO] 
[INFO] --- maven-pmd-plugin:2.7.1:cpd (default-cli) @ uima-ducc-examples ---
[DRY] Finding all files that match the pattern cpd.xml
[DRY] Parsing 1 files in F:\hudson\hudson-slave\workspace\UIMA-DUCC\trunk\uima-ducc-examples\target
[DRY] Successfully parsed file F:\hudson\hudson-slave\workspace\UIMA-DUCC\trunk\uima-ducc-examples\target\cpd.xml
of module uima-ducc-examples with 0 warnings.
[DRY] Computing warning deltas based on reference build #66
[INFO] 
[INFO] --- findbugs-maven-plugin:2.5.2:findbugs (default-cli) @ uima-ducc-examples ---
[INFO] Fork Value is true
     [java] Warnings generated: 30
[INFO] Done FindBugs Analysis....
[FINDBUGS] Finding all files that match the pattern findbugsXml.xml
[FINDBUGS] Parsing 1 files in F:\hudson\hudson-slave\workspace\UIMA-DUCC\trunk\uima-ducc-examples\target
[FINDBUGS] Successfully parsed file F:\hudson\hudson-slave\workspace\UIMA-DUCC\trunk\uima-ducc-examples\target\findbugsXml.xml
of module uima-ducc-examples with 30 warnings.
[FINDBUGS] Computing warning deltas based on reference build #66
[INFO] 
[INFO] --- maven-enforcer-plugin:1.3:enforce (enforce-versions) @ uima-ducc-examples ---
[INFO] 
[INFO] --- build-helper-maven-plugin:1.7:parse-version (parse-project-version) @ uima-ducc-examples
---
[INFO] 
[INFO] --- uima-build-helper-maven-plugin:7:parse-date-time (set buildYear and buildMonth)
@ uima-ducc-examples ---
[INFO] 
[INFO] --- maven-remote-resources-plugin:1.4:process (default) @ uima-ducc-examples ---
[INFO] 
[INFO] --- maven-resources-plugin:2.6:resources (default-resources) @ uima-ducc-examples ---
[INFO] Using 'UTF-8' encoding to copy filtered resources.
[INFO] Copying 62 resources
[INFO] Copying 3 resources
[INFO] Copying 3 resources
[INFO] 
[INFO] --- maven-compiler-plugin:2.5.1:compile (default-compile) @ uima-ducc-examples ---
[INFO] Nothing to compile - all classes are up to date
[INFO] 
[INFO] --- cobertura-maven-plugin:2.5.2:instrument (default-cli) @ uima-ducc-examples ---
[INFO] Cobertura 1.9.4.1 - GNU GPL License (NO WARRANTY) - See COPYRIGHT file
Instrumenting 24 files to F:\hudson\hudson-slave\workspace\UIMA-DUCC\trunk\uima-ducc-examples\target\generated-classes\cobertura
Cobertura: Saved information on 24 classes.
Instrument time: 333ms

[INFO] Instrumentation was successful.
[INFO] NOT adding cobertura ser file to attached artifacts list.
[INFO] 
[INFO] --- maven-resources-plugin:2.6:testResources (default-testResources) @ uima-ducc-examples
---
[INFO] Using 'UTF-8' encoding to copy filtered resources.
[INFO] skip non existing resourceDirectory F:\hudson\hudson-slave\workspace\UIMA-DUCC\trunk\uima-ducc-examples\src\test\resources
[INFO] Copying 3 resources
[INFO] Copying 3 resources
[INFO] 
[INFO] --- maven-compiler-plugin:2.5.1:testCompile (default-testCompile) @ uima-ducc-examples
---
[INFO] No sources to compile
[INFO] 
[INFO] --- maven-surefire-plugin:2.12.4:test (default-test) @ uima-ducc-examples ---
[JENKINS] Recording test results
[INFO] 
[INFO] --- cobertura-maven-plugin:2.5.2:cobertura (default-cli) @ uima-ducc-examples ---
[INFO] Cobertura 1.9.4.1 - GNU GPL License (NO WARRANTY) - See COPYRIGHT file
Cobertura: Loaded information on 24 classes.
Report time: 723ms

[INFO] Cobertura Report generation was successful.
[INFO] 
[INFO] --- maven-enforcer-plugin:1.3:enforce (enforce-versions) @ uima-ducc-examples ---
[INFO] 
[INFO] --- build-helper-maven-plugin:1.7:parse-version (parse-project-version) @ uima-ducc-examples
---
[INFO] 
[INFO] --- uima-build-helper-maven-plugin:7:parse-date-time (set buildYear and buildMonth)
@ uima-ducc-examples ---
[WARNING] Failed to getClass for org.apache.maven.plugin.javadoc.JavadocReport
[INFO] 
[INFO] --- maven-javadoc-plugin:2.9.1:javadoc (default-cli) @ uima-ducc-examples ---
[INFO] Fixed Javadoc frame injection vulnerability (CVE-2013-1571) in 1 files.
[JENKINS] Archiving  javadoc
[INFO]                                                                         
[INFO] ------------------------------------------------------------------------
[INFO] Building uima-ducc-spawn 1.0.0-SNAPSHOT
[INFO] ------------------------------------------------------------------------
[INFO] 
[INFO] --- maven-clean-plugin:2.5:clean (default-clean) @ uima-ducc-spawn ---
[TASKS] Scanning folder 'F:\hudson\hudson-slave\workspace\UIMA-DUCC\trunk\uima-ducc-spawn'
for files matching the pattern '**/*.java' - excludes: 
[TASKS] Found 0 files to scan for tasks
Found 0 open tasks.
[TASKS] Computing warning deltas based on reference build #66
[INFO] 
[INFO] --- maven-enforcer-plugin:1.3:enforce (enforce-versions) @ uima-ducc-spawn ---
[INFO] 
[INFO] --- build-helper-maven-plugin:1.7:parse-version (parse-project-version) @ uima-ducc-spawn
---
[INFO] 
[INFO] --- uima-build-helper-maven-plugin:7:parse-date-time (set buildYear and buildMonth)
@ uima-ducc-spawn ---
[INFO] 
[INFO] --- maven-remote-resources-plugin:1.4:process (default) @ uima-ducc-spawn ---
[INFO] 
[INFO] --- maven-site-plugin:3.2:attach-descriptor (attach-descriptor) @ uima-ducc-spawn ---
[INFO] 
[INFO] --- maven-install-plugin:2.3.1:install (default-install) @ uima-ducc-spawn ---
[INFO] Installing F:\hudson\hudson-slave\workspace\UIMA-DUCC\trunk\uima-ducc-spawn\pom.xml
to f:\hudson\hudson-slave\maven-repositories\0\org\apache\uima\uima-ducc-spawn\1.0.0-SNAPSHOT\uima-ducc-spawn-1.0.0-SNAPSHOT.pom
[INFO] 
[INFO] --- maven-pmd-plugin:2.7.1:pmd (default-cli) @ uima-ducc-spawn ---
[PMD] No report found for mojo pmd
[INFO] 
[INFO] --- maven-pmd-plugin:2.7.1:cpd (default-cli) @ uima-ducc-spawn ---
[DRY] No report found for mojo cpd
[INFO] 
[INFO] --- findbugs-maven-plugin:2.5.2:findbugs (default-cli) @ uima-ducc-spawn ---
[FINDBUGS] No report found for mojo findbugs
[INFO] 
[INFO] --- maven-enforcer-plugin:1.3:enforce (enforce-versions) @ uima-ducc-spawn ---
[INFO] 
[INFO] --- build-helper-maven-plugin:1.7:parse-version (parse-project-version) @ uima-ducc-spawn
---
[INFO] 
[INFO] --- uima-build-helper-maven-plugin:7:parse-date-time (set buildYear and buildMonth)
@ uima-ducc-spawn ---
[INFO] 
[INFO] --- maven-remote-resources-plugin:1.4:process (default) @ uima-ducc-spawn ---
[INFO] 
[INFO] --- cobertura-maven-plugin:2.5.2:instrument (default-cli) @ uima-ducc-spawn ---
[INFO] Skipping cobertura mojo for project with packaging type 'pom'
[INFO] 
[INFO] --- cobertura-maven-plugin:2.5.2:cobertura (default-cli) @ uima-ducc-spawn ---
[INFO] 
[INFO] --- maven-enforcer-plugin:1.3:enforce (enforce-versions) @ uima-ducc-spawn ---
[INFO] 
[INFO] --- build-helper-maven-plugin:1.7:parse-version (parse-project-version) @ uima-ducc-spawn
---
[INFO] 
[INFO] --- uima-build-helper-maven-plugin:7:parse-date-time (set buildYear and buildMonth)
@ uima-ducc-spawn ---
[WARNING] Failed to getClass for org.apache.maven.plugin.javadoc.JavadocReport
[INFO] 
[INFO] --- maven-javadoc-plugin:2.9.1:javadoc (default-cli) @ uima-ducc-spawn ---
[INFO]                                                                         
[INFO] ------------------------------------------------------------------------
[INFO] Building Apache UIMA-DUCC: uima-ducc 1.0.0-SNAPSHOT
[INFO] ------------------------------------------------------------------------
[INFO] 
[INFO] --- maven-clean-plugin:2.5:clean (default-clean) @ uima-ducc ---
[TASKS] Scanning folder '<https://builds.apache.org/job/UIMA-DUCC/ws/trunk'> for files
matching the pattern '**/*.java' - excludes: uima-ducc-parent/**/*, uima-ducc-cli/**/*, uima-ducc-jd/**/*,
uima-ducc-pm/**/*, uima-ducc-rm/**/*, uima-ducc-sm/**/*, uima-ducc-orchestrator/**/*, uima-ducc-common/**/*,
uima-ducc-transport/**/*, uima-ducc-agent/**/*, uima-ducc-duccdocs/**/*, uima-ducc-web/**/*,
uima-ducc-examples/**/*, uima-ducc-spawn/**/*
[TASKS] Found 0 files to scan for tasks
Found 0 open tasks.
[TASKS] Computing warning deltas based on reference build #66
[INFO] 
[INFO] --- maven-enforcer-plugin:1.3:enforce (enforce-versions) @ uima-ducc ---
[INFO] 
[INFO] --- build-helper-maven-plugin:1.7:parse-version (parse-project-version) @ uima-ducc
---
[INFO] 
[INFO] --- uima-build-helper-maven-plugin:7:parse-date-time (set buildYear and buildMonth)
@ uima-ducc ---
[INFO] 
[INFO] --- maven-remote-resources-plugin:1.4:process (default) @ uima-ducc ---
[INFO] 
[INFO] --- maven-enforcer-plugin:1.3:enforce (enforce-versions) @ uima-ducc ---
[INFO] 
[INFO] --- build-helper-maven-plugin:1.7:parse-version (parse-project-version) @ uima-ducc
---
[INFO] 
[INFO] --- uima-build-helper-maven-plugin:7:parse-date-time (set buildYear and buildMonth)
@ uima-ducc ---
[WARNING] Failed to getClass for org.apache.maven.plugin.javadoc.JavadocReport
[INFO] 
[INFO] --- maven-javadoc-plugin:2.9.1:javadoc (javadocs-distr) @ uima-ducc ---
[INFO] Fixed Javadoc frame injection vulnerability (CVE-2013-1571) in 1 files.
[JENKINS] Archiving  javadoc
[INFO] 
[INFO] --- maven-dependency-plugin:2.8:unpack (unpack-activemq-distro) @ uima-ducc ---
[INFO] Configured Artifact: org.apache.activemq:apache-activemq:bin:5.6.0:tar.gz
[INFO] Unpacking f:\hudson\hudson-slave\maven-repositories\0\org\apache\activemq\apache-activemq\5.6.0\apache-activemq-5.6.0-bin.tar.gz
to <https://builds.apache.org/job/UIMA-DUCC/ws/trunk\target\apache-activemq> with includes
"" and excludes ""
[INFO] Expanding: f:\hudson\hudson-slave\maven-repositories\0\org\apache\activemq\apache-activemq\5.6.0\apache-activemq-5.6.0-bin.tar.gz
into <https://builds.apache.org/job/UIMA-DUCC/ws/trunk\target\apache-activemq>
[INFO] 
[INFO] --- maven-dependency-plugin:2.8:unpack (unpack-jetty-distro) @ uima-ducc ---
[INFO] Configured Artifact: org.eclipse.jetty:jetty-distribution:7.4.4.v20110707:zip
[INFO] Unpacking f:\hudson\hudson-slave\maven-repositories\0\org\eclipse\jetty\jetty-distribution\7.4.4.v20110707\jetty-distribution-7.4.4.v20110707.zip
to <https://builds.apache.org/job/UIMA-DUCC/ws/trunk\target\jetty> with includes ""
and excludes ""
[INFO] 
[INFO] --- maven-site-plugin:3.2:attach-descriptor (attach-descriptor) @ uima-ducc ---
[INFO] 
[INFO] --- maven-assembly-plugin:2.2.1:single (uima-distr) @ uima-ducc ---
[INFO] Reading assembly descriptor: src/main/assembly/bin.xml
[INFO] ------------------------------------------------------------------------
[INFO] Reactor Summary:
[INFO] 
[INFO] uima-ducc-parent .................................. SUCCESS [12.310s]
[INFO] uima-ducc-common .................................. SUCCESS [1:13.247s]
[INFO] uima-ducc-transport ............................... SUCCESS [1:00.732s]
[INFO] uima-ducc-cli ..................................... SUCCESS [58.132s]
[INFO] uima-ducc-jd ...................................... SUCCESS [38.227s]
[INFO] uima-ducc-pm ...................................... SUCCESS [22.703s]
[INFO] uima-ducc-rm ...................................... SUCCESS [45.302s]
[INFO] uima-ducc-sm ...................................... SUCCESS [40.176s]
[INFO] uima-ducc-orchestrator ............................ SUCCESS [47.658s]
[INFO] uima-ducc-agent ................................... SUCCESS [49.534s]
[INFO] uima-ducc-duccdocs ................................ SUCCESS [4.365s]
[INFO] uima-ducc-web ..................................... SUCCESS [1:16.568s]
[INFO] uima-ducc-examples ................................ SUCCESS [38.718s]
[INFO] uima-ducc-spawn ................................... SUCCESS [0.936s]
[INFO] Apache UIMA-DUCC: uima-ducc ....................... FAILURE [20.973s]
[INFO] ------------------------------------------------------------------------
[INFO] BUILD FAILURE
[INFO] ------------------------------------------------------------------------
[INFO] Total time: 10:13.023s
[INFO] Finished at: Tue Jan 07 15:56:07 GMT 2014
[INFO] Final Memory: 94M/384M
[INFO] ------------------------------------------------------------------------
Waiting for Jenkins to finish collecting data
[ERROR] Failed to execute goal org.apache.maven.plugins:maven-assembly-plugin:2.2.1:single
(uima-distr) on project uima-ducc: Failed to create assembly: Error adding file to archive:
<https://builds.apache.org/job/UIMA-DUCC/ws/trunk\uima-ducc-duccdocs\target\site\duccbook-install\INSTALL>
isn't a file. -> [Help 1]
[ERROR] 
[ERROR] To see the full stack trace of the errors, re-run Maven with the -e switch.
[ERROR] Re-run Maven using the -X switch to enable full debug logging.
[ERROR] 
[ERROR] For more information about the errors and possible solutions, please read the following
articles:
[JENKINS] Archiving F:\hudson\hudson-slave\workspace\UIMA-DUCC\trunk\uima-ducc-web\pom.xml
to org.apache.uima/uima-ducc-web/1.0.0-SNAPSHOT/uima-ducc-web-1.0.0-SNAPSHOT.pom
[JENKINS] Archiving F:\hudson\hudson-slave\workspace\UIMA-DUCC\trunk\uima-ducc-web\target\uima-ducc-web-1.0.0-SNAPSHOT.jar
to org.apache.uima/uima-ducc-web/1.0.0-SNAPSHOT/uima-ducc-web-1.0.0-SNAPSHOT.jar
[ERROR] [Help 1] http://cwiki.apache.org/confluence/display/MAVEN/MojoExecutionException
[ERROR] 
[ERROR] After correcting the problems, you can resume the build with the command
[ERROR]   mvn <goals> -rf :uima-ducc
[JENKINS] Archiving F:\hudson\hudson-slave\workspace\UIMA-DUCC\trunk\uima-ducc-rm\pom.xml
to org.apache.uima/uima-ducc-rm/1.0.0-SNAPSHOT/uima-ducc-rm-1.0.0-SNAPSHOT.pom
[JENKINS] Archiving F:\hudson\hudson-slave\workspace\UIMA-DUCC\trunk\uima-ducc-rm\target\uima-ducc-rm-1.0.0-SNAPSHOT.jar
to org.apache.uima/uima-ducc-rm/1.0.0-SNAPSHOT/uima-ducc-rm-1.0.0-SNAPSHOT.jar
[JENKINS] Archiving F:\hudson\hudson-slave\workspace\UIMA-DUCC\trunk\uima-ducc-sm\pom.xml
to org.apache.uima/uima-ducc-sm/1.0.0-SNAPSHOT/uima-ducc-sm-1.0.0-SNAPSHOT.pom
[JENKINS] Archiving F:\hudson\hudson-slave\workspace\UIMA-DUCC\trunk\uima-ducc-sm\target\uima-ducc-sm-1.0.0-SNAPSHOT.jar
to org.apache.uima/uima-ducc-sm/1.0.0-SNAPSHOT/uima-ducc-sm-1.0.0-SNAPSHOT.jar
[JENKINS] Archiving F:\hudson\hudson-slave\workspace\UIMA-DUCC\trunk\uima-ducc-parent\pom.xml
to org.apache.uima/uima-ducc-parent/1.0.0-SNAPSHOT/uima-ducc-parent-1.0.0-SNAPSHOT.pom
[JENKINS] Archiving F:\hudson\hudson-slave\workspace\UIMA-DUCC\trunk\uima-ducc-spawn\pom.xml
to org.apache.uima/uima-ducc-spawn/1.0.0-SNAPSHOT/uima-ducc-spawn-1.0.0-SNAPSHOT.pom
[JENKINS] Archiving F:\hudson\hudson-slave\workspace\UIMA-DUCC\trunk\uima-ducc-orchestrator\pom.xml
to org.apache.uima/uima-ducc-orchestrator/1.0.0-SNAPSHOT/uima-ducc-orchestrator-1.0.0-SNAPSHOT.pom
[JENKINS] Archiving F:\hudson\hudson-slave\workspace\UIMA-DUCC\trunk\uima-ducc-orchestrator\target\uima-ducc-orchestrator-1.0.0-SNAPSHOT.jar
to org.apache.uima/uima-ducc-orchestrator/1.0.0-SNAPSHOT/uima-ducc-orchestrator-1.0.0-SNAPSHOT.jar
[JENKINS] Archiving F:\hudson\hudson-slave\workspace\UIMA-DUCC\trunk\uima-ducc-examples\pom.xml
to org.apache.uima/uima-ducc-examples/1.0.0-SNAPSHOT/uima-ducc-examples-1.0.0-SNAPSHOT.pom
[JENKINS] Archiving F:\hudson\hudson-slave\workspace\UIMA-DUCC\trunk\uima-ducc-examples\target\uima-ducc-examples-1.0.0-SNAPSHOT.jar
to org.apache.uima/uima-ducc-examples/1.0.0-SNAPSHOT/uima-ducc-examples-1.0.0-SNAPSHOT.jar
[JENKINS] Archiving F:\hudson\hudson-slave\workspace\UIMA-DUCC\trunk\uima-ducc-common\pom.xml
to org.apache.uima/uima-ducc-common/1.0.0-SNAPSHOT/uima-ducc-common-1.0.0-SNAPSHOT.pom
[JENKINS] Archiving F:\hudson\hudson-slave\workspace\UIMA-DUCC\trunk\uima-ducc-common\target\uima-ducc-common-1.0.0-SNAPSHOT.jar
to org.apache.uima/uima-ducc-common/1.0.0-SNAPSHOT/uima-ducc-common-1.0.0-SNAPSHOT.jar
[JENKINS] Archiving F:\hudson\hudson-slave\workspace\UIMA-DUCC\trunk\uima-ducc-duccdocs\pom.xml
to org.apache.uima/uima-ducc-duccdocs/1.0.0-SNAPSHOT/uima-ducc-duccdocs-1.0.0-SNAPSHOT.pom
[JENKINS] Archiving F:\hudson\hudson-slave\workspace\UIMA-DUCC\trunk\uima-ducc-agent\pom.xml
to org.apache.uima/uima-ducc-agent/1.0.0-SNAPSHOT/uima-ducc-agent-1.0.0-SNAPSHOT.pom
[JENKINS] Archiving F:\hudson\hudson-slave\workspace\UIMA-DUCC\trunk\uima-ducc-agent\target\uima-ducc-agent-1.0.0-SNAPSHOT.jar
to org.apache.uima/uima-ducc-agent/1.0.0-SNAPSHOT/uima-ducc-agent-1.0.0-SNAPSHOT.jar
[JENKINS] Archiving F:\hudson\hudson-slave\workspace\UIMA-DUCC\trunk\uima-ducc-cli\pom.xml
to org.apache.uima/uima-ducc-cli/1.0.0-SNAPSHOT/uima-ducc-cli-1.0.0-SNAPSHOT.pom
[JENKINS] Archiving F:\hudson\hudson-slave\workspace\UIMA-DUCC\trunk\uima-ducc-cli\target\uima-ducc-cli-1.0.0-SNAPSHOT.jar
to org.apache.uima/uima-ducc-cli/1.0.0-SNAPSHOT/uima-ducc-cli-1.0.0-SNAPSHOT.jar
[JENKINS] Archiving F:\hudson\hudson-slave\workspace\UIMA-DUCC\trunk\uima-ducc-jd\pom.xml
to org.apache.uima/uima-ducc-jd/1.0.0-SNAPSHOT/uima-ducc-jd-1.0.0-SNAPSHOT.pom
[JENKINS] Archiving F:\hudson\hudson-slave\workspace\UIMA-DUCC\trunk\uima-ducc-jd\target\uima-ducc-jd-1.0.0-SNAPSHOT.jar
to org.apache.uima/uima-ducc-jd/1.0.0-SNAPSHOT/uima-ducc-jd-1.0.0-SNAPSHOT.jar
[JENKINS] Archiving <https://builds.apache.org/job/UIMA-DUCC/ws/trunk\pom.xml> to org.apache.uima/uima-ducc/1.0.0-SNAPSHOT/uima-ducc-1.0.0-SNAPSHOT.pom
[JENKINS] Archiving F:\hudson\hudson-slave\workspace\UIMA-DUCC\trunk\uima-ducc-pm\pom.xml
to org.apache.uima/uima-ducc-pm/1.0.0-SNAPSHOT/uima-ducc-pm-1.0.0-SNAPSHOT.pom
[JENKINS] Archiving F:\hudson\hudson-slave\workspace\UIMA-DUCC\trunk\uima-ducc-pm\target\uima-ducc-pm-1.0.0-SNAPSHOT.jar
to org.apache.uima/uima-ducc-pm/1.0.0-SNAPSHOT/uima-ducc-pm-1.0.0-SNAPSHOT.jar
[JENKINS] Archiving F:\hudson\hudson-slave\workspace\UIMA-DUCC\trunk\uima-ducc-transport\pom.xml
to org.apache.uima/uima-ducc-transport/1.0.0-SNAPSHOT/uima-ducc-transport-1.0.0-SNAPSHOT.pom
[JENKINS] Archiving F:\hudson\hudson-slave\workspace\UIMA-DUCC\trunk\uima-ducc-transport\target\uima-ducc-transport-1.0.0-SNAPSHOT.jar
to org.apache.uima/uima-ducc-transport/1.0.0-SNAPSHOT/uima-ducc-transport-1.0.0-SNAPSHOT.jar
Sending e-mails to: dev@uima.apache.org
channel stopped
[WARNINGS] Skipping publisher since build result is FAILURE

Mime
View raw message