uima-dev mailing list archives

Site index · List index
Message view « Date » · « Thread »
Top « Date » · « Thread »
From Apache Jenkins Server <jenk...@builds.apache.org>
Subject Build failed in Jenkins: UIMA-DUCC #71
Date Thu, 09 Jan 2014 21:54:10 GMT
See <https://builds.apache.org/job/UIMA-DUCC/71/changes>

Changes:

[burn] UIMA-3439 Small clarifications in sample app docs

------------------------------------------
[...truncated 3833 lines...]
[INFO] --- maven-jar-plugin:2.3.2:jar (default-jar) @ uima-ducc-examples ---
[INFO] Building jar: <https://builds.apache.org/job/UIMA-DUCC/ws/trunk/uima-ducc-examples/target/uima-ducc-examples-1.0.0-SNAPSHOT.jar>
[INFO] 
[INFO] --- maven-site-plugin:3.2:attach-descriptor (attach-descriptor) @ uima-ducc-examples
---
[INFO] 
[INFO] --- maven-install-plugin:2.3.1:install (default-install) @ uima-ducc-examples ---
[INFO] Installing <https://builds.apache.org/job/UIMA-DUCC/ws/trunk/uima-ducc-examples/target/uima-ducc-examples-1.0.0-SNAPSHOT.jar>
to /home/jenkins/jenkins-slave/maven-repositories/0/org/apache/uima/uima-ducc-examples/1.0.0-SNAPSHOT/uima-ducc-examples-1.0.0-SNAPSHOT.jar
[INFO] Installing <https://builds.apache.org/job/UIMA-DUCC/ws/trunk/uima-ducc-examples/pom.xml>
to /home/jenkins/jenkins-slave/maven-repositories/0/org/apache/uima/uima-ducc-examples/1.0.0-SNAPSHOT/uima-ducc-examples-1.0.0-SNAPSHOT.pom
[INFO] 
[INFO] --- maven-pmd-plugin:3.0.1:pmd (default-cli) @ uima-ducc-examples ---
[PMD] Finding all files that match the pattern pmd.xml
[PMD] Parsing 1 files in <https://builds.apache.org/job/UIMA-DUCC/ws/trunk/uima-ducc-examples/target>
[PMD] Successfully parsed file <https://builds.apache.org/job/UIMA-DUCC/ws/trunk/uima-ducc-examples/target/pmd.xml>
of module uima-ducc-examples with 22 warnings.
[PMD] Computing warning deltas based on reference build #70
[INFO] 
[INFO] --- maven-pmd-plugin:3.0.1:cpd (default-cli) @ uima-ducc-examples ---
[DRY] Finding all files that match the pattern cpd.xml
[DRY] Parsing 1 files in <https://builds.apache.org/job/UIMA-DUCC/ws/trunk/uima-ducc-examples/target>
[DRY] Successfully parsed file <https://builds.apache.org/job/UIMA-DUCC/ws/trunk/uima-ducc-examples/target/cpd.xml>
of module uima-ducc-examples with 0 warnings.
[DRY] Computing warning deltas based on reference build #70
[INFO] 
[INFO] --- findbugs-maven-plugin:2.5.3:findbugs (default-cli) @ uima-ducc-examples ---
[INFO] Fork Value is true
     [java] Warnings generated: 30
[INFO] Done FindBugs Analysis....
[FINDBUGS] Finding all files that match the pattern findbugsXml.xml
[FINDBUGS] Parsing 1 files in <https://builds.apache.org/job/UIMA-DUCC/ws/trunk/uima-ducc-examples/target>
[FINDBUGS] Successfully parsed file <https://builds.apache.org/job/UIMA-DUCC/ws/trunk/uima-ducc-examples/target/findbugsXml.xml>
of module uima-ducc-examples with 30 warnings.
[FINDBUGS] Computing warning deltas based on reference build #70
[INFO] 
[INFO] --- maven-enforcer-plugin:1.3:enforce (enforce-versions) @ uima-ducc-examples ---
[INFO] 
[INFO] --- build-helper-maven-plugin:1.7:parse-version (parse-project-version) @ uima-ducc-examples
---
[INFO] 
[INFO] --- uima-build-helper-maven-plugin:7:parse-date-time (set buildYear and buildMonth)
@ uima-ducc-examples ---
[INFO] 
[INFO] --- maven-remote-resources-plugin:1.4:process (default) @ uima-ducc-examples ---
[INFO] 
[INFO] --- maven-resources-plugin:2.6:resources (default-resources) @ uima-ducc-examples ---
[INFO] Using 'UTF-8' encoding to copy filtered resources.
[INFO] Copying 62 resources
[INFO] Copying 3 resources
[INFO] Copying 3 resources
[INFO] 
[INFO] --- maven-compiler-plugin:2.5.1:compile (default-compile) @ uima-ducc-examples ---
[INFO] Nothing to compile - all classes are up to date
[INFO] 
[INFO] --- cobertura-maven-plugin:2.6:instrument (default-cli) @ uima-ducc-examples ---
[INFO] Cobertura 2.0.3 - GNU GPL License (NO WARRANTY) - See COPYRIGHT file

[ERROR] Jan 9, 2014 9:53:43 PM net.sourceforge.cobertura.coveragedata.CoverageDataFileHandler
saveCoverageData
INFO: Cobertura: Saved information on 24 classes.

[INFO] Instrumentation was successful.
[INFO] NOT adding cobertura ser file to attached artifacts list.
[INFO] 
[INFO] --- maven-resources-plugin:2.6:testResources (default-testResources) @ uima-ducc-examples
---
[INFO] Using 'UTF-8' encoding to copy filtered resources.
[INFO] skip non existing resourceDirectory <https://builds.apache.org/job/UIMA-DUCC/ws/trunk/uima-ducc-examples/src/test/resources>
[INFO] Copying 3 resources
[INFO] Copying 3 resources
[INFO] 
[INFO] --- maven-compiler-plugin:2.5.1:testCompile (default-testCompile) @ uima-ducc-examples
---
[INFO] No sources to compile
[INFO] 
[INFO] --- maven-surefire-plugin:2.12.4:test (default-test) @ uima-ducc-examples ---
[JENKINS] Recording test results
[INFO] 
[INFO] --- cobertura-maven-plugin:2.6:cobertura (default-cli) @ uima-ducc-examples ---
[INFO] Cobertura 2.0.3 - GNU GPL License (NO WARRANTY) - See COPYRIGHT file
Report time: 487ms

[ERROR] Jan 9, 2014 9:53:44 PM net.sourceforge.cobertura.coveragedata.CoverageDataFileHandler
loadCoverageData
INFO: Cobertura: Loaded information on 24 classes.

[INFO] Cobertura Report generation was successful.
[INFO] 
[INFO] --- maven-enforcer-plugin:1.3:enforce (enforce-versions) @ uima-ducc-examples ---
[INFO] 
[INFO] --- build-helper-maven-plugin:1.7:parse-version (parse-project-version) @ uima-ducc-examples
---
[INFO] 
[INFO] --- uima-build-helper-maven-plugin:7:parse-date-time (set buildYear and buildMonth)
@ uima-ducc-examples ---
[WARNING] Failed to getClass for org.apache.maven.plugin.javadoc.JavadocReport
[INFO] 
[INFO] --- maven-javadoc-plugin:2.9.1:javadoc (default-cli) @ uima-ducc-examples ---
[INFO] Fixed Javadoc frame injection vulnerability (CVE-2013-1571) in 1 files.
[JENKINS] Archiving  javadoc
[INFO]                                                                         
[INFO] ------------------------------------------------------------------------
[INFO] Building uima-ducc-spawn 1.0.0-SNAPSHOT
[INFO] ------------------------------------------------------------------------
[INFO] 
[INFO] --- maven-clean-plugin:2.5:clean (default-clean) @ uima-ducc-spawn ---
[TASKS] Scanning folder '<https://builds.apache.org/job/UIMA-DUCC/ws/trunk/uima-ducc-spawn'>
for files matching the pattern '**/*.java' - excludes: 
[TASKS] Found 0 files to scan for tasks
Found 0 open tasks.
[TASKS] Computing warning deltas based on reference build #70
[INFO] 
[INFO] --- maven-enforcer-plugin:1.3:enforce (enforce-versions) @ uima-ducc-spawn ---
[INFO] 
[INFO] --- build-helper-maven-plugin:1.7:parse-version (parse-project-version) @ uima-ducc-spawn
---
[INFO] 
[INFO] --- uima-build-helper-maven-plugin:7:parse-date-time (set buildYear and buildMonth)
@ uima-ducc-spawn ---
[INFO] 
[INFO] --- maven-remote-resources-plugin:1.4:process (default) @ uima-ducc-spawn ---
[INFO] 
[INFO] --- maven-site-plugin:3.2:attach-descriptor (attach-descriptor) @ uima-ducc-spawn ---
[INFO] 
[INFO] --- maven-install-plugin:2.3.1:install (default-install) @ uima-ducc-spawn ---
[INFO] Installing <https://builds.apache.org/job/UIMA-DUCC/ws/trunk/uima-ducc-spawn/pom.xml>
to /home/jenkins/jenkins-slave/maven-repositories/0/org/apache/uima/uima-ducc-spawn/1.0.0-SNAPSHOT/uima-ducc-spawn-1.0.0-SNAPSHOT.pom
[INFO] 
[INFO] --- maven-pmd-plugin:3.0.1:pmd (default-cli) @ uima-ducc-spawn ---
[PMD] No report found for mojo pmd
[INFO] 
[INFO] --- maven-pmd-plugin:3.0.1:cpd (default-cli) @ uima-ducc-spawn ---
[DRY] No report found for mojo cpd
[INFO] 
[INFO] --- findbugs-maven-plugin:2.5.3:findbugs (default-cli) @ uima-ducc-spawn ---
[FINDBUGS] No report found for mojo findbugs
[INFO] 
[INFO] --- maven-enforcer-plugin:1.3:enforce (enforce-versions) @ uima-ducc-spawn ---
[INFO] 
[INFO] --- build-helper-maven-plugin:1.7:parse-version (parse-project-version) @ uima-ducc-spawn
---
[INFO] 
[INFO] --- uima-build-helper-maven-plugin:7:parse-date-time (set buildYear and buildMonth)
@ uima-ducc-spawn ---
[INFO] 
[INFO] --- maven-remote-resources-plugin:1.4:process (default) @ uima-ducc-spawn ---
[INFO] 
[INFO] --- cobertura-maven-plugin:2.6:instrument (default-cli) @ uima-ducc-spawn ---
[INFO] Skipping cobertura mojo for project with packaging type 'pom'
[INFO] 
[INFO] --- cobertura-maven-plugin:2.6:cobertura (default-cli) @ uima-ducc-spawn ---
[INFO] 
[INFO] --- maven-enforcer-plugin:1.3:enforce (enforce-versions) @ uima-ducc-spawn ---
[INFO] 
[INFO] --- build-helper-maven-plugin:1.7:parse-version (parse-project-version) @ uima-ducc-spawn
---
[INFO] 
[INFO] --- uima-build-helper-maven-plugin:7:parse-date-time (set buildYear and buildMonth)
@ uima-ducc-spawn ---
[WARNING] Failed to getClass for org.apache.maven.plugin.javadoc.JavadocReport
[INFO] 
[INFO] --- maven-javadoc-plugin:2.9.1:javadoc (default-cli) @ uima-ducc-spawn ---
[INFO]                                                                         
[INFO] ------------------------------------------------------------------------
[INFO] Building Apache UIMA-DUCC: uima-ducc 1.0.0-SNAPSHOT
[INFO] ------------------------------------------------------------------------
[INFO] 
[INFO] --- maven-clean-plugin:2.5:clean (default-clean) @ uima-ducc ---
[TASKS] Scanning folder '<https://builds.apache.org/job/UIMA-DUCC/ws/trunk'> for files
matching the pattern '**/*.java' - excludes: uima-ducc-parent/**/*, uima-ducc-cli/**/*, uima-ducc-jd/**/*,
uima-ducc-pm/**/*, uima-ducc-rm/**/*, uima-ducc-sm/**/*, uima-ducc-orchestrator/**/*, uima-ducc-common/**/*,
uima-ducc-transport/**/*, uima-ducc-agent/**/*, uima-ducc-duccdocs/**/*, uima-ducc-web/**/*,
uima-ducc-examples/**/*, uima-ducc-spawn/**/*
[TASKS] Found 0 files to scan for tasks
Found 0 open tasks.
[TASKS] Computing warning deltas based on reference build #66
[INFO] 
[INFO] --- maven-enforcer-plugin:1.3:enforce (enforce-versions) @ uima-ducc ---
[INFO] 
[INFO] --- build-helper-maven-plugin:1.7:parse-version (parse-project-version) @ uima-ducc
---
[INFO] 
[INFO] --- uima-build-helper-maven-plugin:7:parse-date-time (set buildYear and buildMonth)
@ uima-ducc ---
[INFO] 
[INFO] --- maven-remote-resources-plugin:1.4:process (default) @ uima-ducc ---
[INFO] 
[INFO] --- maven-enforcer-plugin:1.3:enforce (enforce-versions) @ uima-ducc ---
[INFO] 
[INFO] --- build-helper-maven-plugin:1.7:parse-version (parse-project-version) @ uima-ducc
---
[INFO] 
[INFO] --- uima-build-helper-maven-plugin:7:parse-date-time (set buildYear and buildMonth)
@ uima-ducc ---
[WARNING] Failed to getClass for org.apache.maven.plugin.javadoc.JavadocReport
[INFO] 
[INFO] --- maven-javadoc-plugin:2.9.1:javadoc (javadocs-distr) @ uima-ducc ---
[INFO] Fixed Javadoc frame injection vulnerability (CVE-2013-1571) in 1 files.
[JENKINS] Archiving  javadoc
[INFO] 
[INFO] --- maven-dependency-plugin:2.8:unpack (unpack-activemq-distro) @ uima-ducc ---
[INFO] Configured Artifact: org.apache.activemq:apache-activemq:bin:5.6.0:tar.gz
[INFO] Unpacking /home/jenkins/jenkins-slave/maven-repositories/0/org/apache/activemq/apache-activemq/5.6.0/apache-activemq-5.6.0-bin.tar.gz
to <https://builds.apache.org/job/UIMA-DUCC/ws/trunk/target/apache-activemq> with includes
"" and excludes ""
[INFO] Expanding: /home/jenkins/jenkins-slave/maven-repositories/0/org/apache/activemq/apache-activemq/5.6.0/apache-activemq-5.6.0-bin.tar.gz
into <https://builds.apache.org/job/UIMA-DUCC/ws/trunk/target/apache-activemq>
[INFO] 
[INFO] --- maven-dependency-plugin:2.8:unpack (unpack-jetty-distro) @ uima-ducc ---
[INFO] Configured Artifact: org.eclipse.jetty:jetty-distribution:7.4.4.v20110707:zip
[INFO] Unpacking /home/jenkins/jenkins-slave/maven-repositories/0/org/eclipse/jetty/jetty-distribution/7.4.4.v20110707/jetty-distribution-7.4.4.v20110707.zip
to <https://builds.apache.org/job/UIMA-DUCC/ws/trunk/target/jetty> with includes ""
and excludes ""
[INFO] 
[INFO] --- maven-site-plugin:3.2:attach-descriptor (attach-descriptor) @ uima-ducc ---
[INFO] 
[INFO] --- maven-assembly-plugin:2.2.1:single (uima-distr) @ uima-ducc ---
[INFO] Reading assembly descriptor: src/main/assembly/bin.xml
[INFO] ------------------------------------------------------------------------
[INFO] Reactor Summary:
[INFO] 
[INFO] uima-ducc-parent .................................. SUCCESS [19.090s]
[INFO] uima-ducc-common .................................. SUCCESS [1:08.281s]
[INFO] uima-ducc-transport ............................... SUCCESS [47.973s]
[INFO] uima-ducc-cli ..................................... SUCCESS [49.047s]
[INFO] uima-ducc-jd ...................................... SUCCESS [39.191s]
[INFO] uima-ducc-pm ...................................... SUCCESS [22.141s]
[INFO] uima-ducc-rm ...................................... SUCCESS [43.341s]
[INFO] uima-ducc-sm ...................................... SUCCESS [31.502s]
[INFO] uima-ducc-orchestrator ............................ SUCCESS [39.700s]
[INFO] uima-ducc-agent ................................... SUCCESS [41.089s]
[INFO] uima-ducc-duccdocs ................................ SUCCESS [8.194s]
[INFO] uima-ducc-web ..................................... SUCCESS [53.335s]
[INFO] uima-ducc-examples ................................ SUCCESS [32.623s]
[INFO] uima-ducc-spawn ................................... SUCCESS [3.780s]
[INFO] Apache UIMA-DUCC: uima-ducc ....................... FAILURE [11.646s]
[INFO] ------------------------------------------------------------------------
[INFO] BUILD FAILURE
[INFO] ------------------------------------------------------------------------
[INFO] Total time: 8:53.656s
[INFO] Finished at: Thu Jan 09 21:54:07 UTC 2014
[INFO] Final Memory: 82M/391M
[INFO] ------------------------------------------------------------------------
Waiting for Jenkins to finish collecting data
[ERROR] Failed to execute goal org.apache.maven.plugins:maven-assembly-plugin:2.2.1:single
(uima-distr) on project uima-ducc: Failed to create assembly: Error adding file to archive:
<https://builds.apache.org/job/UIMA-DUCC/ws/trunk/uima-ducc-duccdocs/target/site/duccbook-install/INSTALL>
isn't a file. -> [Help 1]
[ERROR] 
[ERROR] To see the full stack trace of the errors, re-run Maven with the -e switch.
[ERROR] Re-run Maven using the -X switch to enable full debug logging.
[ERROR] 
[JENKINS] Archiving <https://builds.apache.org/job/UIMA-DUCC/ws/trunk/uima-ducc-web/pom.xml>
to org.apache.uima/uima-ducc-web/1.0.0-SNAPSHOT/uima-ducc-web-1.0.0-SNAPSHOT.pom
[JENKINS] Archiving <https://builds.apache.org/job/UIMA-DUCC/ws/trunk/uima-ducc-web/target/uima-ducc-web-1.0.0-SNAPSHOT.jar>
to org.apache.uima/uima-ducc-web/1.0.0-SNAPSHOT/uima-ducc-web-1.0.0-SNAPSHOT.jar
[ERROR] For more information about the errors and possible solutions, please read the following
articles:
[ERROR] [Help 1] http://cwiki.apache.org/confluence/display/MAVEN/MojoExecutionException
[ERROR] 
[ERROR] After correcting the problems, you can resume the build with the command
[ERROR]   mvn <goals> -rf :uima-ducc
[JENKINS] Archiving <https://builds.apache.org/job/UIMA-DUCC/ws/trunk/uima-ducc-rm/pom.xml>
to org.apache.uima/uima-ducc-rm/1.0.0-SNAPSHOT/uima-ducc-rm-1.0.0-SNAPSHOT.pom
[JENKINS] Archiving <https://builds.apache.org/job/UIMA-DUCC/ws/trunk/uima-ducc-rm/target/uima-ducc-rm-1.0.0-SNAPSHOT.jar>
to org.apache.uima/uima-ducc-rm/1.0.0-SNAPSHOT/uima-ducc-rm-1.0.0-SNAPSHOT.jar
[JENKINS] Archiving <https://builds.apache.org/job/UIMA-DUCC/ws/trunk/uima-ducc-sm/pom.xml>
to org.apache.uima/uima-ducc-sm/1.0.0-SNAPSHOT/uima-ducc-sm-1.0.0-SNAPSHOT.pom
[JENKINS] Archiving <https://builds.apache.org/job/UIMA-DUCC/ws/trunk/uima-ducc-sm/target/uima-ducc-sm-1.0.0-SNAPSHOT.jar>
to org.apache.uima/uima-ducc-sm/1.0.0-SNAPSHOT/uima-ducc-sm-1.0.0-SNAPSHOT.jar
[JENKINS] Archiving <https://builds.apache.org/job/UIMA-DUCC/ws/trunk/uima-ducc-parent/pom.xml>
to org.apache.uima/uima-ducc-parent/1.0.0-SNAPSHOT/uima-ducc-parent-1.0.0-SNAPSHOT.pom
[JENKINS] Archiving <https://builds.apache.org/job/UIMA-DUCC/ws/trunk/uima-ducc-spawn/pom.xml>
to org.apache.uima/uima-ducc-spawn/1.0.0-SNAPSHOT/uima-ducc-spawn-1.0.0-SNAPSHOT.pom
[JENKINS] Archiving <https://builds.apache.org/job/UIMA-DUCC/ws/trunk/uima-ducc-orchestrator/pom.xml>
to org.apache.uima/uima-ducc-orchestrator/1.0.0-SNAPSHOT/uima-ducc-orchestrator-1.0.0-SNAPSHOT.pom
[JENKINS] Archiving <https://builds.apache.org/job/UIMA-DUCC/ws/trunk/uima-ducc-orchestrator/target/uima-ducc-orchestrator-1.0.0-SNAPSHOT.jar>
to org.apache.uima/uima-ducc-orchestrator/1.0.0-SNAPSHOT/uima-ducc-orchestrator-1.0.0-SNAPSHOT.jar
[JENKINS] Archiving <https://builds.apache.org/job/UIMA-DUCC/ws/trunk/uima-ducc-examples/pom.xml>
to org.apache.uima/uima-ducc-examples/1.0.0-SNAPSHOT/uima-ducc-examples-1.0.0-SNAPSHOT.pom
[JENKINS] Archiving <https://builds.apache.org/job/UIMA-DUCC/ws/trunk/uima-ducc-examples/target/uima-ducc-examples-1.0.0-SNAPSHOT.jar>
to org.apache.uima/uima-ducc-examples/1.0.0-SNAPSHOT/uima-ducc-examples-1.0.0-SNAPSHOT.jar
[JENKINS] Archiving <https://builds.apache.org/job/UIMA-DUCC/ws/trunk/uima-ducc-common/pom.xml>
to org.apache.uima/uima-ducc-common/1.0.0-SNAPSHOT/uima-ducc-common-1.0.0-SNAPSHOT.pom
[JENKINS] Archiving <https://builds.apache.org/job/UIMA-DUCC/ws/trunk/uima-ducc-common/target/uima-ducc-common-1.0.0-SNAPSHOT.jar>
to org.apache.uima/uima-ducc-common/1.0.0-SNAPSHOT/uima-ducc-common-1.0.0-SNAPSHOT.jar
[JENKINS] Archiving <https://builds.apache.org/job/UIMA-DUCC/ws/trunk/uima-ducc-duccdocs/pom.xml>
to org.apache.uima/uima-ducc-duccdocs/1.0.0-SNAPSHOT/uima-ducc-duccdocs-1.0.0-SNAPSHOT.pom
[JENKINS] Archiving <https://builds.apache.org/job/UIMA-DUCC/ws/trunk/uima-ducc-agent/pom.xml>
to org.apache.uima/uima-ducc-agent/1.0.0-SNAPSHOT/uima-ducc-agent-1.0.0-SNAPSHOT.pom
[JENKINS] Archiving <https://builds.apache.org/job/UIMA-DUCC/ws/trunk/uima-ducc-agent/target/uima-ducc-agent-1.0.0-SNAPSHOT.jar>
to org.apache.uima/uima-ducc-agent/1.0.0-SNAPSHOT/uima-ducc-agent-1.0.0-SNAPSHOT.jar
[JENKINS] Archiving <https://builds.apache.org/job/UIMA-DUCC/ws/trunk/uima-ducc-cli/pom.xml>
to org.apache.uima/uima-ducc-cli/1.0.0-SNAPSHOT/uima-ducc-cli-1.0.0-SNAPSHOT.pom
[JENKINS] Archiving <https://builds.apache.org/job/UIMA-DUCC/ws/trunk/uima-ducc-cli/target/uima-ducc-cli-1.0.0-SNAPSHOT.jar>
to org.apache.uima/uima-ducc-cli/1.0.0-SNAPSHOT/uima-ducc-cli-1.0.0-SNAPSHOT.jar
[JENKINS] Archiving <https://builds.apache.org/job/UIMA-DUCC/ws/trunk/uima-ducc-jd/pom.xml>
to org.apache.uima/uima-ducc-jd/1.0.0-SNAPSHOT/uima-ducc-jd-1.0.0-SNAPSHOT.pom
[JENKINS] Archiving <https://builds.apache.org/job/UIMA-DUCC/ws/trunk/uima-ducc-jd/target/uima-ducc-jd-1.0.0-SNAPSHOT.jar>
to org.apache.uima/uima-ducc-jd/1.0.0-SNAPSHOT/uima-ducc-jd-1.0.0-SNAPSHOT.jar
[JENKINS] Archiving <https://builds.apache.org/job/UIMA-DUCC/ws/trunk/pom.xml> to org.apache.uima/uima-ducc/1.0.0-SNAPSHOT/uima-ducc-1.0.0-SNAPSHOT.pom
[JENKINS] Archiving <https://builds.apache.org/job/UIMA-DUCC/ws/trunk/uima-ducc-pm/pom.xml>
to org.apache.uima/uima-ducc-pm/1.0.0-SNAPSHOT/uima-ducc-pm-1.0.0-SNAPSHOT.pom
[JENKINS] Archiving <https://builds.apache.org/job/UIMA-DUCC/ws/trunk/uima-ducc-pm/target/uima-ducc-pm-1.0.0-SNAPSHOT.jar>
to org.apache.uima/uima-ducc-pm/1.0.0-SNAPSHOT/uima-ducc-pm-1.0.0-SNAPSHOT.jar
[JENKINS] Archiving <https://builds.apache.org/job/UIMA-DUCC/ws/trunk/uima-ducc-transport/pom.xml>
to org.apache.uima/uima-ducc-transport/1.0.0-SNAPSHOT/uima-ducc-transport-1.0.0-SNAPSHOT.pom
[JENKINS] Archiving <https://builds.apache.org/job/UIMA-DUCC/ws/trunk/uima-ducc-transport/target/uima-ducc-transport-1.0.0-SNAPSHOT.jar>
to org.apache.uima/uima-ducc-transport/1.0.0-SNAPSHOT/uima-ducc-transport-1.0.0-SNAPSHOT.jar
Sending e-mails to: dev@uima.apache.org
channel stopped
[WARNINGS] Skipping publisher since build result is FAILURE

Mime
View raw message