uima-dev mailing list archives

Site index · List index
Message view « Date » · « Thread »
Top « Date » · « Thread »
From Apache Jenkins Server <jenk...@builds.apache.org>
Subject Build failed in Jenkins: UIMA-uimaFIT_java8 » uimaFIT - Core #2
Date Wed, 26 Mar 2014 12:29:05 GMT
See <https://builds.apache.org/job/UIMA-uimaFIT_java8/org.apache.uima$uimafit-core/2/>

------------------------------------------
[...truncated 1339 lines...]
     [java]       At edu.umd.cs.findbugs.classfile.engine.ClassInfoAnalysisEngine.analyze(ClassInfoAnalysisEngine.java:76)
     [java]       At edu.umd.cs.findbugs.classfile.engine.ClassInfoAnalysisEngine.analyze(ClassInfoAnalysisEngine.java:38)
     [java]       At edu.umd.cs.findbugs.classfile.impl.AnalysisCache.getClassAnalysis(AnalysisCache.java:266)
     [java]       At edu.umd.cs.findbugs.ba.XFactory.getXClass(XFactory.java:652)
     [java]       At edu.umd.cs.findbugs.ba.AnalysisCacheToAnalysisContextAdapter.setAppClassList(AnalysisCacheToAnalysisContextAdapter.java:391)
     [java]       At edu.umd.cs.findbugs.FindBugs2.setAppClassList(FindBugs2.java:982)
     [java]       At edu.umd.cs.findbugs.FindBugs2.execute(FindBugs2.java:225)
     [java]       At edu.umd.cs.findbugs.FindBugs.runMain(FindBugs.java:391)
     [java]       At edu.umd.cs.findbugs.FindBugs2.main(FindBugs2.java:1300)
     [java] Mar 26, 2014 12:28:53 PM edu.umd.cs.findbugs.TextUIBugReporter reportAnalysisError
     [java] SEVERE: Couldn't get class info for java/util/function/BiFunction
     [java] java.lang.ArrayIndexOutOfBoundsException: 26950
     [java] 	at org.objectweb.asm.ClassReader.readClass(Unknown Source)
     [java] 	at org.objectweb.asm.ClassReader.accept(Unknown Source)
     [java] 	at edu.umd.cs.findbugs.asm.FBClassReader.accept(FBClassReader.java:44)
     [java] 	at org.objectweb.asm.ClassReader.accept(Unknown Source)
     [java] 	at edu.umd.cs.findbugs.classfile.engine.ClassParserUsingASM.parse(ClassParserUsingASM.java:110)
     [java] 	at edu.umd.cs.findbugs.classfile.engine.ClassParserUsingASM.parse(ClassParserUsingASM.java:554)
     [java] 	at edu.umd.cs.findbugs.classfile.engine.ClassInfoAnalysisEngine.analyze(ClassInfoAnalysisEngine.java:76)
     [java] 	at edu.umd.cs.findbugs.classfile.engine.ClassInfoAnalysisEngine.analyze(ClassInfoAnalysisEngine.java:38)
     [java] 	at edu.umd.cs.findbugs.classfile.impl.AnalysisCache.getClassAnalysis(AnalysisCache.java:266)
     [java] 	at edu.umd.cs.findbugs.ba.XFactory.getXClass(XFactory.java:652)
     [java] 	at edu.umd.cs.findbugs.ba.AnalysisCacheToAnalysisContextAdapter.setAppClassList(AnalysisCacheToAnalysisContextAdapter.java:391)
     [java] 	at edu.umd.cs.findbugs.FindBugs2.setAppClassList(FindBugs2.java:982)
     [java] 	at edu.umd.cs.findbugs.FindBugs2.execute(FindBugs2.java:225)
     [java] 	at edu.umd.cs.findbugs.FindBugs.runMain(FindBugs.java:391)
     [java] 	at edu.umd.cs.findbugs.FindBugs2.main(FindBugs2.java:1300)
     [java]   Couldn't get class info for java/util/function/BiFunction
     [java]     java.lang.ArrayIndexOutOfBoundsException: 26950
     [java]       At org.objectweb.asm.ClassReader.readClass(Unknown Source)
     [java]       At org.objectweb.asm.ClassReader.accept(Unknown Source)
     [java]       At edu.umd.cs.findbugs.asm.FBClassReader.accept(FBClassReader.java:44)
     [java]       At org.objectweb.asm.ClassReader.accept(Unknown Source)
     [java]       At edu.umd.cs.findbugs.classfile.engine.ClassParserUsingASM.parse(ClassParserUsingASM.java:110)
     [java]       At edu.umd.cs.findbugs.classfile.engine.ClassParserUsingASM.parse(ClassParserUsingASM.java:554)
     [java]       At edu.umd.cs.findbugs.classfile.engine.ClassInfoAnalysisEngine.analyze(ClassInfoAnalysisEngine.java:76)
     [java]       At edu.umd.cs.findbugs.classfile.engine.ClassInfoAnalysisEngine.analyze(ClassInfoAnalysisEngine.java:38)
     [java]       At edu.umd.cs.findbugs.classfile.impl.AnalysisCache.getClassAnalysis(AnalysisCache.java:266)
     [java]       At edu.umd.cs.findbugs.ba.XFactory.getXClass(XFactory.java:652)
     [java]       At edu.umd.cs.findbugs.ba.AnalysisCacheToAnalysisContextAdapter.setAppClassList(AnalysisCacheToAnalysisContextAdapter.java:391)
     [java]       At edu.umd.cs.findbugs.FindBugs2.setAppClassList(FindBugs2.java:982)
     [java]       At edu.umd.cs.findbugs.FindBugs2.execute(FindBugs2.java:225)
     [java]       At edu.umd.cs.findbugs.FindBugs.runMain(FindBugs.java:391)
     [java]       At edu.umd.cs.findbugs.FindBugs2.main(FindBugs2.java:1300)
     [java] Mar 26, 2014 12:28:53 PM edu.umd.cs.findbugs.TextUIBugReporter reportAnalysisError
     [java] SEVERE: Couldn't get class info for java/util/function/Predicate
     [java] java.lang.ArrayIndexOutOfBoundsException: 512
     [java] 	at org.objectweb.asm.ClassReader.readClass(Unknown Source)
     [java] 	at org.objectweb.asm.ClassReader.accept(Unknown Source)
     [java] 	at edu.umd.cs.findbugs.asm.FBClassReader.accept(FBClassReader.java:44)
     [java] 	at org.objectweb.asm.ClassReader.accept(Unknown Source)
     [java] 	at edu.umd.cs.findbugs.classfile.engine.ClassParserUsingASM.parse(ClassParserUsingASM.java:110)
     [java] 	at edu.umd.cs.findbugs.classfile.engine.ClassParserUsingASM.parse(ClassParserUsingASM.java:554)
     [java] 	at edu.umd.cs.findbugs.classfile.engine.ClassInfoAnalysisEngine.analyze(ClassInfoAnalysisEngine.java:76)
     [java] 	at edu.umd.cs.findbugs.classfile.engine.ClassInfoAnalysisEngine.analyze(ClassInfoAnalysisEngine.java:38)
     [java] 	at edu.umd.cs.findbugs.classfile.impl.AnalysisCache.getClassAnalysis(AnalysisCache.java:266)
     [java] 	at edu.umd.cs.findbugs.ba.XFactory.getXClass(XFactory.java:652)
     [java] 	at edu.umd.cs.findbugs.ba.AnalysisCacheToAnalysisContextAdapter.setAppClassList(AnalysisCacheToAnalysisContextAdapter.java:391)
     [java] 	at edu.umd.cs.findbugs.FindBugs2.setAppClassList(FindBugs2.java:982)
     [java] 	at edu.umd.cs.findbugs.FindBugs2.execute(FindBugs2.java:225)
     [java] 	at edu.umd.cs.findbugs.FindBugs.runMain(FindBugs.java:391)
     [java] 	at edu.umd.cs.findbugs.FindBugs2.main(FindBugs2.java:1300)
     [java]   Couldn't get class info for java/util/function/Predicate
     [java]     java.lang.ArrayIndexOutOfBoundsException: 512
     [java]       At org.objectweb.asm.ClassReader.readClass(Unknown Source)
     [java]       At org.objectweb.asm.ClassReader.accept(Unknown Source)
     [java]       At edu.umd.cs.findbugs.asm.FBClassReader.accept(FBClassReader.java:44)
     [java]       At org.objectweb.asm.ClassReader.accept(Unknown Source)
     [java]       At edu.umd.cs.findbugs.classfile.engine.ClassParserUsingASM.parse(ClassParserUsingASM.java:110)
     [java]       At edu.umd.cs.findbugs.classfile.engine.ClassParserUsingASM.parse(ClassParserUsingASM.java:554)
     [java]       At edu.umd.cs.findbugs.classfile.engine.ClassInfoAnalysisEngine.analyze(ClassInfoAnalysisEngine.java:76)
     [java]       At edu.umd.cs.findbugs.classfile.engine.ClassInfoAnalysisEngine.analyze(ClassInfoAnalysisEngine.java:38)
     [java]       At edu.umd.cs.findbugs.classfile.impl.AnalysisCache.getClassAnalysis(AnalysisCache.java:266)
     [java]       At edu.umd.cs.findbugs.ba.XFactory.getXClass(XFactory.java:652)
     [java]       At edu.umd.cs.findbugs.ba.AnalysisCacheToAnalysisContextAdapter.setAppClassList(AnalysisCacheToAnalysisContextAdapter.java:391)
     [java]       At edu.umd.cs.findbugs.FindBugs2.setAppClassList(FindBugs2.java:982)
     [java]       At edu.umd.cs.findbugs.FindBugs2.execute(FindBugs2.java:225)
     [java]       At edu.umd.cs.findbugs.FindBugs.runMain(FindBugs.java:391)
     [java]       At edu.umd.cs.findbugs.FindBugs2.main(FindBugs2.java:1300)
     [java] Mar 26, 2014 12:28:53 PM edu.umd.cs.findbugs.TextUIBugReporter reportAnalysisError
     [java] SEVERE: Couldn't get class info for java/util/Map$Entry
     [java] java.lang.ArrayIndexOutOfBoundsException: 9216
     [java] 	at org.objectweb.asm.ClassReader.readClass(Unknown Source)
     [java] 	at org.objectweb.asm.ClassReader.accept(Unknown Source)
     [java] 	at edu.umd.cs.findbugs.asm.FBClassReader.accept(FBClassReader.java:44)
     [java] 	at org.objectweb.asm.ClassReader.accept(Unknown Source)
     [java] 	at edu.umd.cs.findbugs.classfile.engine.ClassParserUsingASM.parse(ClassParserUsingASM.java:110)
     [java] 	at edu.umd.cs.findbugs.classfile.engine.ClassParserUsingASM.parse(ClassParserUsingASM.java:554)
     [java] 	at edu.umd.cs.findbugs.classfile.engine.ClassInfoAnalysisEngine.analyze(ClassInfoAnalysisEngine.java:76)
     [java] 	at edu.umd.cs.findbugs.classfile.engine.ClassInfoAnalysisEngine.analyze(ClassInfoAnalysisEngine.java:38)
     [java] 	at edu.umd.cs.findbugs.classfile.impl.AnalysisCache.getClassAnalysis(AnalysisCache.java:266)
     [java] 	at edu.umd.cs.findbugs.ba.XFactory.getXClass(XFactory.java:652)
     [java] 	at edu.umd.cs.findbugs.ba.ch.Subtypes2.addInheritanceEdge(Subtypes2.java:1227)
     [java] 	at edu.umd.cs.findbugs.ba.ch.Subtypes2.addSupertypeEdges(Subtypes2.java:1200)
     [java] 	at edu.umd.cs.findbugs.ba.ch.Subtypes2.addClassAndGetClassVertex(Subtypes2.java:275)
     [java] 	at edu.umd.cs.findbugs.ba.ch.Subtypes2.addClass(Subtypes2.java:244)
     [java] 	at edu.umd.cs.findbugs.ba.AnalysisCacheToAnalysisContextAdapter.setAppClassList(AnalysisCacheToAnalysisContextAdapter.java:400)
     [java] 	at edu.umd.cs.findbugs.FindBugs2.setAppClassList(FindBugs2.java:982)
     [java] 	at edu.umd.cs.findbugs.FindBugs2.execute(FindBugs2.java:225)
     [java] 	at edu.umd.cs.findbugs.FindBugs.runMain(FindBugs.java:391)
     [java] 	at edu.umd.cs.findbugs.FindBugs2.main(FindBugs2.java:1300)
     [java]   Couldn't get class info for java/util/Map$Entry
     [java]     java.lang.ArrayIndexOutOfBoundsException: 9216
     [java]       At org.objectweb.asm.ClassReader.readClass(Unknown Source)
     [java]       At org.objectweb.asm.ClassReader.accept(Unknown Source)
     [java]       At edu.umd.cs.findbugs.asm.FBClassReader.accept(FBClassReader.java:44)
     [java]       At org.objectweb.asm.ClassReader.accept(Unknown Source)
     [java]       At edu.umd.cs.findbugs.classfile.engine.ClassParserUsingASM.parse(ClassParserUsingASM.java:110)
     [java]       At edu.umd.cs.findbugs.classfile.engine.ClassParserUsingASM.parse(ClassParserUsingASM.java:554)
     [java]       At edu.umd.cs.findbugs.classfile.engine.ClassInfoAnalysisEngine.analyze(ClassInfoAnalysisEngine.java:76)
     [java]       At edu.umd.cs.findbugs.classfile.engine.ClassInfoAnalysisEngine.analyze(ClassInfoAnalysisEngine.java:38)
     [java]       At edu.umd.cs.findbugs.classfile.impl.AnalysisCache.getClassAnalysis(AnalysisCache.java:266)
     [java]       At edu.umd.cs.findbugs.ba.XFactory.getXClass(XFactory.java:652)
     [java]       At edu.umd.cs.findbugs.ba.ch.Subtypes2.addInheritanceEdge(Subtypes2.java:1227)
     [java]       At edu.umd.cs.findbugs.ba.ch.Subtypes2.addSupertypeEdges(Subtypes2.java:1200)
     [java]       At edu.umd.cs.findbugs.ba.ch.Subtypes2.addClassAndGetClassVertex(Subtypes2.java:275)
     [java]       At edu.umd.cs.findbugs.ba.ch.Subtypes2.addClass(Subtypes2.java:244)
     [java]       At edu.umd.cs.findbugs.ba.AnalysisCacheToAnalysisContextAdapter.setAppClassList(AnalysisCacheToAnalysisContextAdapter.java:400)
     [java]       At edu.umd.cs.findbugs.FindBugs2.setAppClassList(FindBugs2.java:982)
     [java]       At edu.umd.cs.findbugs.FindBugs2.execute(FindBugs2.java:225)
     [java]       At edu.umd.cs.findbugs.FindBugs.runMain(FindBugs.java:391)
     [java]       At edu.umd.cs.findbugs.FindBugs2.main(FindBugs2.java:1300)
     [java] Mar 26, 2014 12:28:53 PM edu.umd.cs.findbugs.TextUIBugReporter reportAnalysisError
     [java] SEVERE: Couldn't get class info for java/util/regex/Pattern
     [java] java.lang.ArrayIndexOutOfBoundsException: 1875
     [java] 	at org.objectweb.asm.ClassReader.readClass(Unknown Source)
     [java] 	at org.objectweb.asm.ClassReader.accept(Unknown Source)
     [java] 	at edu.umd.cs.findbugs.asm.FBClassReader.accept(FBClassReader.java:44)
     [java] 	at org.objectweb.asm.ClassReader.accept(Unknown Source)
     [java] 	at edu.umd.cs.findbugs.classfile.engine.ClassParserUsingASM.parse(ClassParserUsingASM.java:110)
     [java] 	at edu.umd.cs.findbugs.classfile.engine.ClassParserUsingASM.parse(ClassParserUsingASM.java:554)
     [java] 	at edu.umd.cs.findbugs.classfile.engine.ClassInfoAnalysisEngine.analyze(ClassInfoAnalysisEngine.java:76)
     [java] 	at edu.umd.cs.findbugs.classfile.engine.ClassInfoAnalysisEngine.analyze(ClassInfoAnalysisEngine.java:38)
     [java] 	at edu.umd.cs.findbugs.classfile.impl.AnalysisCache.getClassAnalysis(AnalysisCache.java:266)
     [java] 	at edu.umd.cs.findbugs.ba.XFactory.getXClass(XFactory.java:652)
     [java] 	at edu.umd.cs.findbugs.ba.AnalysisCacheToAnalysisContextAdapter.setAppClassList(AnalysisCacheToAnalysisContextAdapter.java:391)
     [java] 	at edu.umd.cs.findbugs.FindBugs2.setAppClassList(FindBugs2.java:982)
     [java] 	at edu.umd.cs.findbugs.FindBugs2.execute(FindBugs2.java:225)
     [java] 	at edu.umd.cs.findbugs.FindBugs.runMain(FindBugs.java:391)
     [java] 	at edu.umd.cs.findbugs.FindBugs2.main(FindBugs2.java:1300)
     [java]   Couldn't get class info for java/util/regex/Pattern
     [java]     java.lang.ArrayIndexOutOfBoundsException: 1875
     [java]       At org.objectweb.asm.ClassReader.readClass(Unknown Source)
     [java]       At org.objectweb.asm.ClassReader.accept(Unknown Source)
     [java]       At edu.umd.cs.findbugs.asm.FBClassReader.accept(FBClassReader.java:44)
     [java]       At org.objectweb.asm.ClassReader.accept(Unknown Source)
     [java]       At edu.umd.cs.findbugs.classfile.engine.ClassParserUsingASM.parse(ClassParserUsingASM.java:110)
     [java]       At edu.umd.cs.findbugs.classfile.engine.ClassParserUsingASM.parse(ClassParserUsingASM.java:554)
     [java]       At edu.umd.cs.findbugs.classfile.engine.ClassInfoAnalysisEngine.analyze(ClassInfoAnalysisEngine.java:76)
     [java]       At edu.umd.cs.findbugs.classfile.engine.ClassInfoAnalysisEngine.analyze(ClassInfoAnalysisEngine.java:38)
     [java]       At edu.umd.cs.findbugs.classfile.impl.AnalysisCache.getClassAnalysis(AnalysisCache.java:266)
     [java]       At edu.umd.cs.findbugs.ba.XFactory.getXClass(XFactory.java:652)
     [java]       At edu.umd.cs.findbugs.ba.AnalysisCacheToAnalysisContextAdapter.setAppClassList(AnalysisCacheToAnalysisContextAdapter.java:391)
     [java]       At edu.umd.cs.findbugs.FindBugs2.setAppClassList(FindBugs2.java:982)
     [java]       At edu.umd.cs.findbugs.FindBugs2.execute(FindBugs2.java:225)
     [java]       At edu.umd.cs.findbugs.FindBugs.runMain(FindBugs.java:391)
     [java]       At edu.umd.cs.findbugs.FindBugs2.main(FindBugs2.java:1300)
     [java] Mar 26, 2014 12:28:53 PM edu.umd.cs.findbugs.TextUIBugReporter reportAnalysisError
     [java] SEVERE: Couldn't get class info for java/lang/CharSequence
     [java] java.lang.ArrayIndexOutOfBoundsException: 26721
     [java] 	at org.objectweb.asm.ClassReader.readClass(Unknown Source)
     [java] 	at org.objectweb.asm.ClassReader.accept(Unknown Source)
     [java] 	at edu.umd.cs.findbugs.asm.FBClassReader.accept(FBClassReader.java:44)
     [java] 	at org.objectweb.asm.ClassReader.accept(Unknown Source)
     [java] 	at edu.umd.cs.findbugs.classfile.engine.ClassParserUsingASM.parse(ClassParserUsingASM.java:110)
     [java] 	at edu.umd.cs.findbugs.classfile.engine.ClassParserUsingASM.parse(ClassParserUsingASM.java:554)
     [java] 	at edu.umd.cs.findbugs.classfile.engine.ClassInfoAnalysisEngine.analyze(ClassInfoAnalysisEngine.java:76)
     [java] 	at edu.umd.cs.findbugs.classfile.engine.ClassInfoAnalysisEngine.analyze(ClassInfoAnalysisEngine.java:38)
     [java] 	at edu.umd.cs.findbugs.classfile.impl.AnalysisCache.getClassAnalysis(AnalysisCache.java:266)
     [java] 	at edu.umd.cs.findbugs.ba.XFactory.getXClass(XFactory.java:652)
     [java] 	at edu.umd.cs.findbugs.ba.ch.Subtypes2.addInheritanceEdge(Subtypes2.java:1227)
     [java] 	at edu.umd.cs.findbugs.ba.ch.Subtypes2.addSupertypeEdges(Subtypes2.java:1200)
     [java] 	at edu.umd.cs.findbugs.ba.ch.Subtypes2.addClassAndGetClassVertex(Subtypes2.java:275)
     [java] 	at edu.umd.cs.findbugs.ba.ch.Subtypes2.addClass(Subtypes2.java:244)
     [java] 	at edu.umd.cs.findbugs.ba.AnalysisCacheToAnalysisContextAdapter.setAppClassList(AnalysisCacheToAnalysisContextAdapter.java:400)
     [java] 	at edu.umd.cs.findbugs.FindBugs2.setAppClassList(FindBugs2.java:982)
     [java] 	at edu.umd.cs.findbugs.FindBugs2.execute(FindBugs2.java:225)
     [java] 	at edu.umd.cs.findbugs.FindBugs.runMain(FindBugs.java:391)
     [java] 	at edu.umd.cs.findbugs.FindBugs2.main(FindBugs2.java:1300)
     [java]   Couldn't get class info for java/lang/CharSequence
     [java]     java.lang.ArrayIndexOutOfBoundsException: 26721
     [java]       At org.objectweb.asm.ClassReader.readClass(Unknown Source)
     [java]       At org.objectweb.asm.ClassReader.accept(Unknown Source)
     [java]       At edu.umd.cs.findbugs.asm.FBClassReader.accept(FBClassReader.java:44)
     [java]       At org.objectweb.asm.ClassReader.accept(Unknown Source)
     [java]       At edu.umd.cs.findbugs.classfile.engine.ClassParserUsingASM.parse(ClassParserUsingASM.java:110)
     [java]       At edu.umd.cs.findbugs.classfile.engine.ClassParserUsingASM.parse(ClassParserUsingASM.java:554)
     [java]       At edu.umd.cs.findbugs.classfile.engine.ClassInfoAnalysisEngine.analyze(ClassInfoAnalysisEngine.java:76)
     [java]       At edu.umd.cs.findbugs.classfile.engine.ClassInfoAnalysisEngine.analyze(ClassInfoAnalysisEngine.java:38)
     [java]       At edu.umd.cs.findbugs.classfile.impl.AnalysisCache.getClassAnalysis(AnalysisCache.java:266)
     [java]       At edu.umd.cs.findbugs.ba.XFactory.getXClass(XFactory.java:652)
     [java]       At edu.umd.cs.findbugs.ba.ch.Subtypes2.addInheritanceEdge(Subtypes2.java:1227)
     [java]       At edu.umd.cs.findbugs.ba.ch.Subtypes2.addSupertypeEdges(Subtypes2.java:1200)
     [java]       At edu.umd.cs.findbugs.ba.ch.Subtypes2.addClassAndGetClassVertex(Subtypes2.java:275)
     [java]       At edu.umd.cs.findbugs.ba.ch.Subtypes2.addClass(Subtypes2.java:244)
     [java]       At edu.umd.cs.findbugs.ba.AnalysisCacheToAnalysisContextAdapter.setAppClassList(AnalysisCacheToAnalysisContextAdapter.java:400)
     [java]       At edu.umd.cs.findbugs.FindBugs2.setAppClassList(FindBugs2.java:982)
     [java]       At edu.umd.cs.findbugs.FindBugs2.execute(FindBugs2.java:225)
     [java]       At edu.umd.cs.findbugs.FindBugs.runMain(FindBugs.java:391)
     [java]       At edu.umd.cs.findbugs.FindBugs2.main(FindBugs2.java:1300)
     [java] Mar 26, 2014 12:28:53 PM edu.umd.cs.findbugs.TextUIBugReporter reportAnalysisError
     [java] SEVERE: Couldn't get class info for java/util/Arrays
     [java] java.lang.ArrayIndexOutOfBoundsException: 35328
     [java] 	at org.objectweb.asm.ClassReader.accept(Unknown Source)
     [java] 	at edu.umd.cs.findbugs.asm.FBClassReader.accept(FBClassReader.java:44)
     [java] 	at org.objectweb.asm.ClassReader.accept(Unknown Source)
     [java] 	at edu.umd.cs.findbugs.classfile.engine.ClassParserUsingASM.parse(ClassParserUsingASM.java:110)
     [java] 	at edu.umd.cs.findbugs.classfile.engine.ClassParserUsingASM.parse(ClassParserUsingASM.java:554)
     [java] 	at edu.umd.cs.findbugs.classfile.engine.ClassInfoAnalysisEngine.analyze(ClassInfoAnalysisEngine.java:76)
     [java] 	at edu.umd.cs.findbugs.classfile.engine.ClassInfoAnalysisEngine.analyze(ClassInfoAnalysisEngine.java:38)
     [java] 	at edu.umd.cs.findbugs.classfile.impl.AnalysisCache.getClassAnalysis(AnalysisCache.java:266)
     [java] 	at edu.umd.cs.findbugs.ba.XFactory.getXClass(XFactory.java:652)
     [java] 	at edu.umd.cs.findbugs.ba.AnalysisCacheToAnalysisContextAdapter.setAppClassList(AnalysisCacheToAnalysisContextAdapter.java:391)
     [java] 	at edu.umd.cs.findbugs.FindBugs2.setAppClassList(FindBugs2.java:982)
     [java] 	at edu.umd.cs.findbugs.FindBugs2.execute(FindBugs2.java:225)
     [java] 	at edu.umd.cs.findbugs.FindBugs.runMain(FindBugs.java:391)
     [java] 	at edu.umd.cs.findbugs.FindBugs2.main(FindBugs2.java:1300)
     [java]   Couldn't get class info for java/util/Arrays
     [java]     java.lang.ArrayIndexOutOfBoundsException: 35328
     [java]       At org.objectweb.asm.ClassReader.accept(Unknown Source)
     [java]       At edu.umd.cs.findbugs.asm.FBClassReader.accept(FBClassReader.java:44)
     [java]       At org.objectweb.asm.ClassReader.accept(Unknown Source)
     [java]       At edu.umd.cs.findbugs.classfile.engine.ClassParserUsingASM.parse(ClassParserUsingASM.java:110)
     [java]       At edu.umd.cs.findbugs.classfile.engine.ClassParserUsingASM.parse(ClassParserUsingASM.java:554)
     [java]       At edu.umd.cs.findbugs.classfile.engine.ClassInfoAnalysisEngine.analyze(ClassInfoAnalysisEngine.java:76)
     [java]       At edu.umd.cs.findbugs.classfile.engine.ClassInfoAnalysisEngine.analyze(ClassInfoAnalysisEngine.java:38)
     [java]       At edu.umd.cs.findbugs.classfile.impl.AnalysisCache.getClassAnalysis(AnalysisCache.java:266)
     [java]       At edu.umd.cs.findbugs.ba.XFactory.getXClass(XFactory.java:652)
     [java]       At edu.umd.cs.findbugs.ba.AnalysisCacheToAnalysisContextAdapter.setAppClassList(AnalysisCacheToAnalysisContextAdapter.java:391)
     [java]       At edu.umd.cs.findbugs.FindBugs2.setAppClassList(FindBugs2.java:982)
     [java]       At edu.umd.cs.findbugs.FindBugs2.execute(FindBugs2.java:225)
     [java]       At edu.umd.cs.findbugs.FindBugs.runMain(FindBugs.java:391)
     [java]       At edu.umd.cs.findbugs.FindBugs2.main(FindBugs2.java:1300)
     [java] Exception in thread "main" java.lang.ArrayIndexOutOfBoundsException: 35328
     [java] 	at org.objectweb.asm.ClassReader.accept(Unknown Source)
     [java] 	at edu.umd.cs.findbugs.asm.FBClassReader.accept(FBClassReader.java:44)
     [java] 	at org.objectweb.asm.ClassReader.accept(Unknown Source)
     [java] 	at edu.umd.cs.findbugs.classfile.engine.ClassParserUsingASM.parse(ClassParserUsingASM.java:110)
     [java] 	at edu.umd.cs.findbugs.classfile.engine.ClassParserUsingASM.parse(ClassParserUsingASM.java:554)
     [java] 	at edu.umd.cs.findbugs.classfile.engine.ClassInfoAnalysisEngine.analyze(ClassInfoAnalysisEngine.java:76)
     [java] 	at edu.umd.cs.findbugs.classfile.engine.ClassInfoAnalysisEngine.analyze(ClassInfoAnalysisEngine.java:38)
     [java] 	at edu.umd.cs.findbugs.classfile.impl.AnalysisCache.getClassAnalysis(AnalysisCache.java:266)
     [java] 	at edu.umd.cs.findbugs.ba.XFactory.getXClass(XFactory.java:652)
     [java] 	at edu.umd.cs.findbugs.ba.AnalysisCacheToAnalysisContextAdapter.setAppClassList(AnalysisCacheToAnalysisContextAdapter.java:391)
     [java] 	at edu.umd.cs.findbugs.FindBugs2.setAppClassList(FindBugs2.java:982)
     [java] 	at edu.umd.cs.findbugs.FindBugs2.execute(FindBugs2.java:225)
     [java] 	at edu.umd.cs.findbugs.FindBugs.runMain(FindBugs.java:391)
     [java] 	at edu.umd.cs.findbugs.FindBugs2.main(FindBugs2.java:1300)
[FINDBUGS] No report found for mojo findbugs

Mime
View raw message