uima-dev mailing list archives

Site index · List index
Message view « Date » · « Thread »
Top « Date » · « Thread »
From Apache Jenkins Server <jenk...@builds.apache.org>
Subject Build failed in Jenkins: UIMA-uimaFIT_java8 #2
Date Wed, 26 Mar 2014 12:29:08 GMT
See <https://builds.apache.org/job/UIMA-uimaFIT_java8/2/>

------------------------------------------
[...truncated 2157 lines...]
     [java] 	at edu.umd.cs.findbugs.classfile.engine.ClassInfoAnalysisEngine.analyze(ClassInfoAnalysisEngine.java:38)
     [java] 	at edu.umd.cs.findbugs.classfile.impl.AnalysisCache.getClassAnalysis(AnalysisCache.java:266)
     [java] 	at edu.umd.cs.findbugs.ba.XFactory.getXClass(XFactory.java:652)
     [java] 	at edu.umd.cs.findbugs.ba.AnalysisCacheToAnalysisContextAdapter.setAppClassList(AnalysisCacheToAnalysisContextAdapter.java:391)
     [java] 	at edu.umd.cs.findbugs.FindBugs2.setAppClassList(FindBugs2.java:982)
     [java] 	at edu.umd.cs.findbugs.FindBugs2.execute(FindBugs2.java:225)
     [java] 	at edu.umd.cs.findbugs.FindBugs.runMain(FindBugs.java:391)
     [java] 	at edu.umd.cs.findbugs.FindBugs2.main(FindBugs2.java:1300)
     [java]   Couldn't get class info for java/util/function/Predicate
     [java]     java.lang.ArrayIndexOutOfBoundsException: 512
     [java]       At org.objectweb.asm.ClassReader.readClass(Unknown Source)
     [java]       At org.objectweb.asm.ClassReader.accept(Unknown Source)
     [java]       At edu.umd.cs.findbugs.asm.FBClassReader.accept(FBClassReader.java:44)
     [java]       At org.objectweb.asm.ClassReader.accept(Unknown Source)
     [java]       At edu.umd.cs.findbugs.classfile.engine.ClassParserUsingASM.parse(ClassParserUsingASM.java:110)
     [java]       At edu.umd.cs.findbugs.classfile.engine.ClassParserUsingASM.parse(ClassParserUsingASM.java:554)
     [java]       At edu.umd.cs.findbugs.classfile.engine.ClassInfoAnalysisEngine.analyze(ClassInfoAnalysisEngine.java:76)
     [java]       At edu.umd.cs.findbugs.classfile.engine.ClassInfoAnalysisEngine.analyze(ClassInfoAnalysisEngine.java:38)
     [java]       At edu.umd.cs.findbugs.classfile.impl.AnalysisCache.getClassAnalysis(AnalysisCache.java:266)
     [java]       At edu.umd.cs.findbugs.ba.XFactory.getXClass(XFactory.java:652)
     [java]       At edu.umd.cs.findbugs.ba.AnalysisCacheToAnalysisContextAdapter.setAppClassList(AnalysisCacheToAnalysisContextAdapter.java:391)
     [java]       At edu.umd.cs.findbugs.FindBugs2.setAppClassList(FindBugs2.java:982)
     [java]       At edu.umd.cs.findbugs.FindBugs2.execute(FindBugs2.java:225)
     [java]       At edu.umd.cs.findbugs.FindBugs.runMain(FindBugs.java:391)
     [java]       At edu.umd.cs.findbugs.FindBugs2.main(FindBugs2.java:1300)
     [java] Mar 26, 2014 12:28:53 PM edu.umd.cs.findbugs.TextUIBugReporter reportAnalysisError
     [java] SEVERE: Couldn't get class info for java/util/Map$Entry
     [java] java.lang.ArrayIndexOutOfBoundsException: 9216
     [java] 	at org.objectweb.asm.ClassReader.readClass(Unknown Source)
     [java] 	at org.objectweb.asm.ClassReader.accept(Unknown Source)
     [java] 	at edu.umd.cs.findbugs.asm.FBClassReader.accept(FBClassReader.java:44)
     [java] 	at org.objectweb.asm.ClassReader.accept(Unknown Source)
     [java] 	at edu.umd.cs.findbugs.classfile.engine.ClassParserUsingASM.parse(ClassParserUsingASM.java:110)
     [java] 	at edu.umd.cs.findbugs.classfile.engine.ClassParserUsingASM.parse(ClassParserUsingASM.java:554)
     [java] 	at edu.umd.cs.findbugs.classfile.engine.ClassInfoAnalysisEngine.analyze(ClassInfoAnalysisEngine.java:76)
     [java] 	at edu.umd.cs.findbugs.classfile.engine.ClassInfoAnalysisEngine.analyze(ClassInfoAnalysisEngine.java:38)
     [java] 	at edu.umd.cs.findbugs.classfile.impl.AnalysisCache.getClassAnalysis(AnalysisCache.java:266)
     [java] 	at edu.umd.cs.findbugs.ba.XFactory.getXClass(XFactory.java:652)
     [java] 	at edu.umd.cs.findbugs.ba.ch.Subtypes2.addInheritanceEdge(Subtypes2.java:1227)
     [java] 	at edu.umd.cs.findbugs.ba.ch.Subtypes2.addSupertypeEdges(Subtypes2.java:1200)
     [java] 	at edu.umd.cs.findbugs.ba.ch.Subtypes2.addClassAndGetClassVertex(Subtypes2.java:275)
     [java] 	at edu.umd.cs.findbugs.ba.ch.Subtypes2.addClass(Subtypes2.java:244)
     [java] 	at edu.umd.cs.findbugs.ba.AnalysisCacheToAnalysisContextAdapter.setAppClassList(AnalysisCacheToAnalysisContextAdapter.java:400)
     [java] 	at edu.umd.cs.findbugs.FindBugs2.setAppClassList(FindBugs2.java:982)
     [java] 	at edu.umd.cs.findbugs.FindBugs2.execute(FindBugs2.java:225)
     [java] 	at edu.umd.cs.findbugs.FindBugs.runMain(FindBugs.java:391)
     [java] 	at edu.umd.cs.findbugs.FindBugs2.main(FindBugs2.java:1300)
     [java]   Couldn't get class info for java/util/Map$Entry
     [java]     java.lang.ArrayIndexOutOfBoundsException: 9216
     [java]       At org.objectweb.asm.ClassReader.readClass(Unknown Source)
     [java]       At org.objectweb.asm.ClassReader.accept(Unknown Source)
     [java]       At edu.umd.cs.findbugs.asm.FBClassReader.accept(FBClassReader.java:44)
     [java]       At org.objectweb.asm.ClassReader.accept(Unknown Source)
     [java]       At edu.umd.cs.findbugs.classfile.engine.ClassParserUsingASM.parse(ClassParserUsingASM.java:110)
     [java]       At edu.umd.cs.findbugs.classfile.engine.ClassParserUsingASM.parse(ClassParserUsingASM.java:554)
     [java]       At edu.umd.cs.findbugs.classfile.engine.ClassInfoAnalysisEngine.analyze(ClassInfoAnalysisEngine.java:76)
     [java]       At edu.umd.cs.findbugs.classfile.engine.ClassInfoAnalysisEngine.analyze(ClassInfoAnalysisEngine.java:38)
     [java]       At edu.umd.cs.findbugs.classfile.impl.AnalysisCache.getClassAnalysis(AnalysisCache.java:266)
     [java]       At edu.umd.cs.findbugs.ba.XFactory.getXClass(XFactory.java:652)
     [java]       At edu.umd.cs.findbugs.ba.ch.Subtypes2.addInheritanceEdge(Subtypes2.java:1227)
     [java]       At edu.umd.cs.findbugs.ba.ch.Subtypes2.addSupertypeEdges(Subtypes2.java:1200)
     [java]       At edu.umd.cs.findbugs.ba.ch.Subtypes2.addClassAndGetClassVertex(Subtypes2.java:275)
     [java]       At edu.umd.cs.findbugs.ba.ch.Subtypes2.addClass(Subtypes2.java:244)
     [java]       At edu.umd.cs.findbugs.ba.AnalysisCacheToAnalysisContextAdapter.setAppClassList(AnalysisCacheToAnalysisContextAdapter.java:400)
     [java]       At edu.umd.cs.findbugs.FindBugs2.setAppClassList(FindBugs2.java:982)
     [java]       At edu.umd.cs.findbugs.FindBugs2.execute(FindBugs2.java:225)
     [java]       At edu.umd.cs.findbugs.FindBugs.runMain(FindBugs.java:391)
     [java]       At edu.umd.cs.findbugs.FindBugs2.main(FindBugs2.java:1300)
     [java] Mar 26, 2014 12:28:53 PM edu.umd.cs.findbugs.TextUIBugReporter reportAnalysisError
     [java] SEVERE: Couldn't get class info for java/util/regex/Pattern
     [java] java.lang.ArrayIndexOutOfBoundsException: 1875
     [java] 	at org.objectweb.asm.ClassReader.readClass(Unknown Source)
     [java] 	at org.objectweb.asm.ClassReader.accept(Unknown Source)
     [java] 	at edu.umd.cs.findbugs.asm.FBClassReader.accept(FBClassReader.java:44)
     [java] 	at org.objectweb.asm.ClassReader.accept(Unknown Source)
     [java] 	at edu.umd.cs.findbugs.classfile.engine.ClassParserUsingASM.parse(ClassParserUsingASM.java:110)
     [java] 	at edu.umd.cs.findbugs.classfile.engine.ClassParserUsingASM.parse(ClassParserUsingASM.java:554)
     [java] 	at edu.umd.cs.findbugs.classfile.engine.ClassInfoAnalysisEngine.analyze(ClassInfoAnalysisEngine.java:76)
     [java] 	at edu.umd.cs.findbugs.classfile.engine.ClassInfoAnalysisEngine.analyze(ClassInfoAnalysisEngine.java:38)
     [java] 	at edu.umd.cs.findbugs.classfile.impl.AnalysisCache.getClassAnalysis(AnalysisCache.java:266)
     [java] 	at edu.umd.cs.findbugs.ba.XFactory.getXClass(XFactory.java:652)
     [java] 	at edu.umd.cs.findbugs.ba.AnalysisCacheToAnalysisContextAdapter.setAppClassList(AnalysisCacheToAnalysisContextAdapter.java:391)
     [java] 	at edu.umd.cs.findbugs.FindBugs2.setAppClassList(FindBugs2.java:982)
     [java] 	at edu.umd.cs.findbugs.FindBugs2.execute(FindBugs2.java:225)
     [java] 	at edu.umd.cs.findbugs.FindBugs.runMain(FindBugs.java:391)
     [java] 	at edu.umd.cs.findbugs.FindBugs2.main(FindBugs2.java:1300)
     [java]   Couldn't get class info for java/util/regex/Pattern
     [java]     java.lang.ArrayIndexOutOfBoundsException: 1875
     [java]       At org.objectweb.asm.ClassReader.readClass(Unknown Source)
     [java]       At org.objectweb.asm.ClassReader.accept(Unknown Source)
     [java]       At edu.umd.cs.findbugs.asm.FBClassReader.accept(FBClassReader.java:44)
     [java]       At org.objectweb.asm.ClassReader.accept(Unknown Source)
     [java]       At edu.umd.cs.findbugs.classfile.engine.ClassParserUsingASM.parse(ClassParserUsingASM.java:110)
     [java]       At edu.umd.cs.findbugs.classfile.engine.ClassParserUsingASM.parse(ClassParserUsingASM.java:554)
     [java]       At edu.umd.cs.findbugs.classfile.engine.ClassInfoAnalysisEngine.analyze(ClassInfoAnalysisEngine.java:76)
     [java]       At edu.umd.cs.findbugs.classfile.engine.ClassInfoAnalysisEngine.analyze(ClassInfoAnalysisEngine.java:38)
     [java]       At edu.umd.cs.findbugs.classfile.impl.AnalysisCache.getClassAnalysis(AnalysisCache.java:266)
     [java]       At edu.umd.cs.findbugs.ba.XFactory.getXClass(XFactory.java:652)
     [java]       At edu.umd.cs.findbugs.ba.AnalysisCacheToAnalysisContextAdapter.setAppClassList(AnalysisCacheToAnalysisContextAdapter.java:391)
     [java]       At edu.umd.cs.findbugs.FindBugs2.setAppClassList(FindBugs2.java:982)
     [java]       At edu.umd.cs.findbugs.FindBugs2.execute(FindBugs2.java:225)
     [java]       At edu.umd.cs.findbugs.FindBugs.runMain(FindBugs.java:391)
     [java]       At edu.umd.cs.findbugs.FindBugs2.main(FindBugs2.java:1300)
     [java] Mar 26, 2014 12:28:53 PM edu.umd.cs.findbugs.TextUIBugReporter reportAnalysisError
     [java] SEVERE: Couldn't get class info for java/lang/CharSequence
     [java] java.lang.ArrayIndexOutOfBoundsException: 26721
     [java] 	at org.objectweb.asm.ClassReader.readClass(Unknown Source)
     [java] 	at org.objectweb.asm.ClassReader.accept(Unknown Source)
     [java] 	at edu.umd.cs.findbugs.asm.FBClassReader.accept(FBClassReader.java:44)
     [java] 	at org.objectweb.asm.ClassReader.accept(Unknown Source)
     [java] 	at edu.umd.cs.findbugs.classfile.engine.ClassParserUsingASM.parse(ClassParserUsingASM.java:110)
     [java] 	at edu.umd.cs.findbugs.classfile.engine.ClassParserUsingASM.parse(ClassParserUsingASM.java:554)
     [java] 	at edu.umd.cs.findbugs.classfile.engine.ClassInfoAnalysisEngine.analyze(ClassInfoAnalysisEngine.java:76)
     [java] 	at edu.umd.cs.findbugs.classfile.engine.ClassInfoAnalysisEngine.analyze(ClassInfoAnalysisEngine.java:38)
     [java] 	at edu.umd.cs.findbugs.classfile.impl.AnalysisCache.getClassAnalysis(AnalysisCache.java:266)
     [java] 	at edu.umd.cs.findbugs.ba.XFactory.getXClass(XFactory.java:652)
     [java] 	at edu.umd.cs.findbugs.ba.ch.Subtypes2.addInheritanceEdge(Subtypes2.java:1227)
     [java] 	at edu.umd.cs.findbugs.ba.ch.Subtypes2.addSupertypeEdges(Subtypes2.java:1200)
     [java] 	at edu.umd.cs.findbugs.ba.ch.Subtypes2.addClassAndGetClassVertex(Subtypes2.java:275)
     [java] 	at edu.umd.cs.findbugs.ba.ch.Subtypes2.addClass(Subtypes2.java:244)
     [java] 	at edu.umd.cs.findbugs.ba.AnalysisCacheToAnalysisContextAdapter.setAppClassList(AnalysisCacheToAnalysisContextAdapter.java:400)
     [java] 	at edu.umd.cs.findbugs.FindBugs2.setAppClassList(FindBugs2.java:982)
     [java] 	at edu.umd.cs.findbugs.FindBugs2.execute(FindBugs2.java:225)
     [java] 	at edu.umd.cs.findbugs.FindBugs.runMain(FindBugs.java:391)
     [java] 	at edu.umd.cs.findbugs.FindBugs2.main(FindBugs2.java:1300)
     [java]   Couldn't get class info for java/lang/CharSequence
     [java]     java.lang.ArrayIndexOutOfBoundsException: 26721
     [java]       At org.objectweb.asm.ClassReader.readClass(Unknown Source)
     [java]       At org.objectweb.asm.ClassReader.accept(Unknown Source)
     [java]       At edu.umd.cs.findbugs.asm.FBClassReader.accept(FBClassReader.java:44)
     [java]       At org.objectweb.asm.ClassReader.accept(Unknown Source)
     [java]       At edu.umd.cs.findbugs.classfile.engine.ClassParserUsingASM.parse(ClassParserUsingASM.java:110)
     [java]       At edu.umd.cs.findbugs.classfile.engine.ClassParserUsingASM.parse(ClassParserUsingASM.java:554)
     [java]       At edu.umd.cs.findbugs.classfile.engine.ClassInfoAnalysisEngine.analyze(ClassInfoAnalysisEngine.java:76)
     [java]       At edu.umd.cs.findbugs.classfile.engine.ClassInfoAnalysisEngine.analyze(ClassInfoAnalysisEngine.java:38)
     [java]       At edu.umd.cs.findbugs.classfile.impl.AnalysisCache.getClassAnalysis(AnalysisCache.java:266)
     [java]       At edu.umd.cs.findbugs.ba.XFactory.getXClass(XFactory.java:652)
     [java]       At edu.umd.cs.findbugs.ba.ch.Subtypes2.addInheritanceEdge(Subtypes2.java:1227)
     [java]       At edu.umd.cs.findbugs.ba.ch.Subtypes2.addSupertypeEdges(Subtypes2.java:1200)
     [java]       At edu.umd.cs.findbugs.ba.ch.Subtypes2.addClassAndGetClassVertex(Subtypes2.java:275)
     [java]       At edu.umd.cs.findbugs.ba.ch.Subtypes2.addClass(Subtypes2.java:244)
     [java]       At edu.umd.cs.findbugs.ba.AnalysisCacheToAnalysisContextAdapter.setAppClassList(AnalysisCacheToAnalysisContextAdapter.java:400)
     [java]       At edu.umd.cs.findbugs.FindBugs2.setAppClassList(FindBugs2.java:982)
     [java]       At edu.umd.cs.findbugs.FindBugs2.execute(FindBugs2.java:225)
     [java]       At edu.umd.cs.findbugs.FindBugs.runMain(FindBugs.java:391)
     [java]       At edu.umd.cs.findbugs.FindBugs2.main(FindBugs2.java:1300)
     [java] Mar 26, 2014 12:28:53 PM edu.umd.cs.findbugs.TextUIBugReporter reportAnalysisError
     [java] SEVERE: Couldn't get class info for java/util/Arrays
     [java] java.lang.ArrayIndexOutOfBoundsException: 35328
     [java] 	at org.objectweb.asm.ClassReader.accept(Unknown Source)
     [java] 	at edu.umd.cs.findbugs.asm.FBClassReader.accept(FBClassReader.java:44)
     [java] 	at org.objectweb.asm.ClassReader.accept(Unknown Source)
     [java] 	at edu.umd.cs.findbugs.classfile.engine.ClassParserUsingASM.parse(ClassParserUsingASM.java:110)
     [java] 	at edu.umd.cs.findbugs.classfile.engine.ClassParserUsingASM.parse(ClassParserUsingASM.java:554)
     [java] 	at edu.umd.cs.findbugs.classfile.engine.ClassInfoAnalysisEngine.analyze(ClassInfoAnalysisEngine.java:76)
     [java] 	at edu.umd.cs.findbugs.classfile.engine.ClassInfoAnalysisEngine.analyze(ClassInfoAnalysisEngine.java:38)
     [java] 	at edu.umd.cs.findbugs.classfile.impl.AnalysisCache.getClassAnalysis(AnalysisCache.java:266)
     [java] 	at edu.umd.cs.findbugs.ba.XFactory.getXClass(XFactory.java:652)
     [java] 	at edu.umd.cs.findbugs.ba.AnalysisCacheToAnalysisContextAdapter.setAppClassList(AnalysisCacheToAnalysisContextAdapter.java:391)
     [java] 	at edu.umd.cs.findbugs.FindBugs2.setAppClassList(FindBugs2.java:982)
     [java] 	at edu.umd.cs.findbugs.FindBugs2.execute(FindBugs2.java:225)
     [java] 	at edu.umd.cs.findbugs.FindBugs.runMain(FindBugs.java:391)
     [java] 	at edu.umd.cs.findbugs.FindBugs2.main(FindBugs2.java:1300)
     [java]   Couldn't get class info for java/util/Arrays
     [java]     java.lang.ArrayIndexOutOfBoundsException: 35328
     [java]       At org.objectweb.asm.ClassReader.accept(Unknown Source)
     [java]       At edu.umd.cs.findbugs.asm.FBClassReader.accept(FBClassReader.java:44)
     [java]       At org.objectweb.asm.ClassReader.accept(Unknown Source)
     [java]       At edu.umd.cs.findbugs.classfile.engine.ClassParserUsingASM.parse(ClassParserUsingASM.java:110)
     [java]       At edu.umd.cs.findbugs.classfile.engine.ClassParserUsingASM.parse(ClassParserUsingASM.java:554)
     [java]       At edu.umd.cs.findbugs.classfile.engine.ClassInfoAnalysisEngine.analyze(ClassInfoAnalysisEngine.java:76)
     [java]       At edu.umd.cs.findbugs.classfile.engine.ClassInfoAnalysisEngine.analyze(ClassInfoAnalysisEngine.java:38)
     [java]       At edu.umd.cs.findbugs.classfile.impl.AnalysisCache.getClassAnalysis(AnalysisCache.java:266)
     [java]       At edu.umd.cs.findbugs.ba.XFactory.getXClass(XFactory.java:652)
     [java]       At edu.umd.cs.findbugs.ba.AnalysisCacheToAnalysisContextAdapter.setAppClassList(AnalysisCacheToAnalysisContextAdapter.java:391)
     [java]       At edu.umd.cs.findbugs.FindBugs2.setAppClassList(FindBugs2.java:982)
     [java]       At edu.umd.cs.findbugs.FindBugs2.execute(FindBugs2.java:225)
     [java]       At edu.umd.cs.findbugs.FindBugs.runMain(FindBugs.java:391)
     [java]       At edu.umd.cs.findbugs.FindBugs2.main(FindBugs2.java:1300)
     [java] Exception in thread "main" java.lang.ArrayIndexOutOfBoundsException: 35328
     [java] 	at org.objectweb.asm.ClassReader.accept(Unknown Source)
     [java] 	at edu.umd.cs.findbugs.asm.FBClassReader.accept(FBClassReader.java:44)
     [java] 	at org.objectweb.asm.ClassReader.accept(Unknown Source)
     [java] 	at edu.umd.cs.findbugs.classfile.engine.ClassParserUsingASM.parse(ClassParserUsingASM.java:110)
     [java] 	at edu.umd.cs.findbugs.classfile.engine.ClassParserUsingASM.parse(ClassParserUsingASM.java:554)
     [java] 	at edu.umd.cs.findbugs.classfile.engine.ClassInfoAnalysisEngine.analyze(ClassInfoAnalysisEngine.java:76)
     [java] 	at edu.umd.cs.findbugs.classfile.engine.ClassInfoAnalysisEngine.analyze(ClassInfoAnalysisEngine.java:38)
     [java] 	at edu.umd.cs.findbugs.classfile.impl.AnalysisCache.getClassAnalysis(AnalysisCache.java:266)
     [java] 	at edu.umd.cs.findbugs.ba.XFactory.getXClass(XFactory.java:652)
     [java] 	at edu.umd.cs.findbugs.ba.AnalysisCacheToAnalysisContextAdapter.setAppClassList(AnalysisCacheToAnalysisContextAdapter.java:391)
     [java] 	at edu.umd.cs.findbugs.FindBugs2.setAppClassList(FindBugs2.java:982)
     [java] 	at edu.umd.cs.findbugs.FindBugs2.execute(FindBugs2.java:225)
     [java] 	at edu.umd.cs.findbugs.FindBugs.runMain(FindBugs.java:391)
     [java] 	at edu.umd.cs.findbugs.FindBugs2.main(FindBugs2.java:1300)
[FINDBUGS] No report found for mojo findbugs
[INFO]                                                                         
[INFO] ------------------------------------------------------------------------
[INFO] Skipping uimaFIT
[INFO] This project has been banned from the build due to previous failures.
[INFO] ------------------------------------------------------------------------
[INFO] ------------------------------------------------------------------------
[INFO] Reactor Summary:
[INFO] 
[INFO] uimaFIT - Parent .................................. SUCCESS [1:17.451s]
[INFO] uimaFIT - Core .................................... FAILURE [1:07.189s]
[INFO] uimaFIT - Examples ................................ SKIPPED
[INFO] uimaFIT - Spring integration ...................... SKIPPED
[INFO] uimaFIT - Maven Plugin ............................ SKIPPED
[INFO] uimaFIT - Legacy uimaFIT support .................. SKIPPED
[INFO] uimaFIT - Documentation ........................... SKIPPED
[INFO] uimaFIT - Collection Processing Engine support .... SKIPPED
[INFO] uimaFIT ........................................... SKIPPED
[INFO] ------------------------------------------------------------------------
[INFO] BUILD FAILURE
[INFO] ------------------------------------------------------------------------
[INFO] Total time: 2:35.175s
[INFO] Finished at: Wed Mar 26 12:28:56 UTC 2014
[INFO] Final Memory: 52M/111M
[INFO] ------------------------------------------------------------------------
[WARNING] The requested profile "javancss" could not be activated because it does not exist.
[WARNING] The requested profile "cobertura-aggregate" could not be activated because it does
not exist.
[WARNING] The requested profile "attach-source" could not be activated because it does not
exist.
[WARNING] The requested profile "attach-javadoc" could not be activated because it does not
exist.
[WARNING] The requested profile "attach-test" could not be activated because it does not exist.
Waiting for Jenkins to finish collecting data[ERROR] Failed to execute goal org.codehaus.mojo:findbugs-maven-plugin:2.5.2:findbugs
(default) on project uimafit-core: Execution default of goal org.codehaus.mojo:findbugs-maven-plugin:2.5.2:findbugs
failed: Java returned: 1 -> [Help 1]
[ERROR] 
[ERROR] To see the full stack trace of the errors, re-run Maven with the -e switch.
[ERROR] Re-run Maven using the -X switch to enable full debug logging.
[ERROR] 
[ERROR] For more information about the errors and possible solutions, please read the following
articles:
[ERROR] [Help 1] http://cwiki.apache.org/confluence/display/MAVEN/PluginExecutionException
[ERROR] 
[ERROR] After correcting the problems, you can resume the build with the command
[ERROR]   mvn <goals> -rf :uimafit-core

[JENKINS] Archiving <https://builds.apache.org/job/UIMA-uimaFIT_java8/ws/trunk/uimafit-maven-plugin/pom.xml>
to org.apache.uima/uimafit-maven-plugin/2.1.0-SNAPSHOT/uimafit-maven-plugin-2.1.0-SNAPSHOT.pom
[JENKINS] Archiving <https://builds.apache.org/job/UIMA-uimaFIT_java8/ws/trunk/uimafit-spring/pom.xml>
to org.apache.uima/uimafit-spring/2.1.0-SNAPSHOT/uimafit-spring-2.1.0-SNAPSHOT.pom
[JENKINS] Archiving <https://builds.apache.org/job/UIMA-uimaFIT_java8/ws/trunk/uimafit-examples/pom.xml>
to org.apache.uima/uimafit-examples/2.1.0-SNAPSHOT/uimafit-examples-2.1.0-SNAPSHOT.pom
[JENKINS] Archiving <https://builds.apache.org/job/UIMA-uimaFIT_java8/ws/trunk/uimafit-cpe/pom.xml>
to org.apache.uima/uimafit-cpe/2.1.0-SNAPSHOT/uimafit-cpe-2.1.0-SNAPSHOT.pom
[JENKINS] Archiving <https://builds.apache.org/job/UIMA-uimaFIT_java8/ws/trunk/uimafit-docbook/pom.xml>
to org.apache.uima/uimafit-docbook/2.1.0-SNAPSHOT/uimafit-docbook-2.1.0-SNAPSHOT.pom
[JENKINS] Archiving <https://builds.apache.org/job/UIMA-uimaFIT_java8/ws/trunk/uimafit-legacy-support/pom.xml>
to org.apache.uima/uimafit-legacy-support/2.1.0-SNAPSHOT/uimafit-legacy-support-2.1.0-SNAPSHOT.pom
[JENKINS] Archiving <https://builds.apache.org/job/UIMA-uimaFIT_java8/ws/trunk/uimafit-parent/pom.xml>
to org.apache.uima/uimafit-parent/2.1.0-SNAPSHOT/uimafit-parent-2.1.0-SNAPSHOT.pom
[JENKINS] Archiving <https://builds.apache.org/job/UIMA-uimaFIT_java8/ws/trunk/uimafit-core/pom.xml>
to org.apache.uima/uimafit-core/2.1.0-SNAPSHOT/uimafit-core-2.1.0-SNAPSHOT.pom
[JENKINS] Archiving <https://builds.apache.org/job/UIMA-uimaFIT_java8/ws/trunk/uimafit-core/target/uimafit-core-2.1.0-SNAPSHOT.jar>
to org.apache.uima/uimafit-core/2.1.0-SNAPSHOT/uimafit-core-2.1.0-SNAPSHOT.jar
[JENKINS] Archiving <https://builds.apache.org/job/UIMA-uimaFIT_java8/ws/trunk/pom.xml>
to org.apache.uima/uimafit/2.1.0-SNAPSHOT/uimafit-2.1.0-SNAPSHOT.pom
Sending e-mails to: dev@uima.apache.org
channel stopped
[WARNINGS] Skipping publisher since build result is FAILURE
Skipping Cobertura coverage report as build was not UNSTABLE or better ...

Mime
View raw message