uima-dev mailing list archives

Site index · List index
Message view « Date » · « Thread »
Top « Date » · « Thread »
From Apache Jenkins Server <jenk...@builds.apache.org>
Subject Build failed in Jenkins: UIMA-uimaFIT_2_0_x » uimaFIT - Core #12
Date Sat, 26 Apr 2014 12:33:12 GMT
See <https://builds.apache.org/job/UIMA-uimaFIT_2_0_x/org.apache.uima$uimafit-core/12/>

------------------------------------------
[INFO]                                                                         
[INFO] ------------------------------------------------------------------------
[INFO] Building uimaFIT - Core 2.0.1-SNAPSHOT
[INFO] ------------------------------------------------------------------------
Downloading: http://repository.apache.org/snapshots/org/apache/uima/uimaj-core/2.6.0-SNAPSHOT/maven-metadata.xml
Downloaded: http://repository.apache.org/snapshots/org/apache/uima/uimaj-core/2.6.0-SNAPSHOT/maven-metadata.xml
(775 B at 0.5 KB/sec)
Downloading: http://repository.apache.org/snapshots/org/apache/uima/uimaj-core/2.6.0-SNAPSHOT/uimaj-core-2.6.0-20140426.043220-9.pom
Downloaded: http://repository.apache.org/snapshots/org/apache/uima/uimaj-core/2.6.0-SNAPSHOT/uimaj-core-2.6.0-20140426.043220-9.pom
(8 KB at 48.2 KB/sec)
Downloading: http://repository.apache.org/snapshots/org/apache/uima/uimaj-core/2.6.0-SNAPSHOT/uimaj-core-2.6.0-20140426.043220-9.jar
Downloaded: http://repository.apache.org/snapshots/org/apache/uima/uimaj-core/2.6.0-SNAPSHOT/uimaj-core-2.6.0-20140426.043220-9.jar
(1453 KB at 1617.6 KB/sec)
[INFO] 
[INFO] --- maven-clean-plugin:2.5:clean (default-clean) @ uimafit-core ---
[TASKS] Scanning folder '<https://builds.apache.org/job/UIMA-uimaFIT_2_0_x/org.apache.uima$uimafit-core/ws/'>
for files matching the pattern '**/*.java' - excludes: 
[TASKS] Found 145 files to scan for tasks
Found 3 open tasks.
[TASKS] Computing warning deltas based on reference build #11
[INFO] 
[INFO] --- maven-enforcer-plugin:1.3:enforce (enforce-versions) @ uimafit-core ---
[INFO] 
[INFO] --- build-helper-maven-plugin:1.7:parse-version (parse-project-version) @ uimafit-core
---
[INFO] 
[INFO] --- uima-build-helper-maven-plugin:7:parse-date-time (set buildYear and buildMonth)
@ uimafit-core ---
[INFO] 
[INFO] --- gmaven-plugin:1.5:execute (read-notice) @ uimafit-core ---
[INFO] 
[INFO] --- maven-remote-resources-plugin:1.4:process (default) @ uimafit-core ---
Downloading: http://repository.apache.org/snapshots/org/apache/uima/uimaj-parent/2.6.0-SNAPSHOT/maven-metadata.xml
Downloaded: http://repository.apache.org/snapshots/org/apache/uima/uimaj-parent/2.6.0-SNAPSHOT/maven-metadata.xml
(604 B at 1.2 KB/sec)
Downloading: http://repository.apache.org/snapshots/org/apache/uima/uimaj-parent/2.6.0-SNAPSHOT/uimaj-parent-2.6.0-20140426.043045-9.pom
Downloaded: http://repository.apache.org/snapshots/org/apache/uima/uimaj-parent/2.6.0-SNAPSHOT/uimaj-parent-2.6.0-20140426.043045-9.pom
(7 KB at 46.2 KB/sec)
[INFO] 
[INFO] --- maven-resources-plugin:2.6:resources (default-resources) @ uimafit-core ---
[INFO] Using 'UTF-8' encoding to copy filtered resources.
[INFO] Copying 1 resource
[INFO] Copying 3 resources
[INFO] 
[INFO] --- maven-compiler-plugin:2.5.1:compile (default-compile) @ uimafit-core ---
[INFO] Compiling 83 source files to <https://builds.apache.org/job/UIMA-uimaFIT_2_0_x/org.apache.uima$uimafit-core/ws/target/classes>
[INFO] -------------------------------------------------------------
[ERROR] COMPILATION ERROR : 
[INFO] -------------------------------------------------------------
[ERROR] <https://builds.apache.org/job/UIMA-uimaFIT_2_0_x/org.apache.uima$uimafit-core/ws/src/main/java/org/apache/uima/fit/component/CasCollectionReader_ImplBase.java>:[23,-1]
cannot access org.apache.uima.UimaContext
bad class file: /home/jenkins/jenkins-slave/maven-repositories/1/org/apache/uima/uimaj-core/2.6.0-SNAPSHOT/uimaj-core-2.6.0-SNAPSHOT.jar(org/apache/uima/UimaContext.class)
class file has wrong version 50.0, should be 49.0
[INFO] 1 error
[INFO] -------------------------------------------------------------
[INFO]                                                                         
[INFO] ------------------------------------------------------------------------
[INFO] Skipping uimaFIT
[INFO] This project has been banned from the build due to previous failures.
[INFO] ------------------------------------------------------------------------
[INFO] ------------------------------------------------------------------------
[INFO] Reactor Summary:
[INFO] 
[INFO] uimaFIT - Parent .................................. SUCCESS [50.956s]
[INFO] uimaFIT - Core .................................... FAILURE [14.597s]
[INFO] uimaFIT - Examples ................................ SKIPPED
[INFO] uimaFIT - Spring integration ...................... SKIPPED
[INFO] uimaFIT - Maven Plugin ............................ SKIPPED
[INFO] uimaFIT - Legacy uimaFIT support .................. SKIPPED
[INFO] uimaFIT - Documentation ........................... SKIPPED
[INFO] uimaFIT - Collection Processing Engine support .... SKIPPED
[INFO] uimaFIT ........................................... SKIPPED
[INFO] ------------------------------------------------------------------------
[INFO] BUILD FAILURE
[INFO] ------------------------------------------------------------------------
[INFO] Total time: 1:16.477s
[INFO] Finished at: Sat Apr 26 12:33:07 UTC 2014
[INFO] Final Memory: 34M/237M
[INFO] ------------------------------------------------------------------------
Waiting for Jenkins to finish collecting data
[ERROR] Failed to execute goal org.apache.maven.plugins:maven-compiler-plugin:2.5.1:compile
(default-compile) on project uimafit-core: Compilation failure
[ERROR] <https://builds.apache.org/job/UIMA-uimaFIT_2_0_x/org.apache.uima$uimafit-core/ws/src/main/java/org/apache/uima/fit/component/CasCollectionReader_ImplBase.java>:[23,-1]
cannot access org.apache.uima.UimaContext
[ERROR] bad class file: /home/jenkins/jenkins-slave/maven-repositories/1/org/apache/uima/uimaj-core/2.6.0-SNAPSHOT/uimaj-core-2.6.0-SNAPSHOT.jar(org/apache/uima/UimaContext.class)
[ERROR] class file has wrong version 50.0, should be 49.0
[ERROR] -> [Help 1]
[ERROR] 
[ERROR] To see the full stack trace of the errors, re-run Maven with the -e switch.
[ERROR] Re-run Maven using the -X switch to enable full debug logging.
[ERROR] 
[ERROR] For more information about the errors and possible solutions, please read the following
articles:
[ERROR] [Help 1] http://cwiki.apache.org/confluence/display/MAVEN/MojoFailureException
[ERROR] 
[ERROR] After correcting the problems, you can resume the build with the command
[ERROR]   mvn <goals> -rf :uimafit-core

Mime
View raw message