uima-dev mailing list archives

Site index · List index
Message view « Date » · « Thread »
Top « Date » · « Thread »
From Apache Jenkins Server <jenk...@builds.apache.org>
Subject Build failed in Jenkins: UIMA-uimaFIT_java8 #11
Date Mon, 28 Apr 2014 21:28:39 GMT
See <https://builds.apache.org/job/UIMA-uimaFIT_java8/11/changes>

Changes:

[rec] [UIMA-3692] Classloading inconsistencies
- Added an experimental API to control resource managers used by uimaFIT

[rec] [UIMA-3785] Upgrade to UIMA 2.6.0

[rec] [UIMA-3785] Upgrade to UIMA 2.6.0

------------------------------------------
[...truncated 2911 lines...]
[ERROR] ^
[ERROR] <https://builds.apache.org/job/UIMA-uimaFIT_java8/ws/trunk/uimafit-examples/src/main/java/org/apache/uima/fit/examples/tutorial/type/Meeting.java>:65:
warning: no @param for addr
[ERROR] public Meeting(int addr, TOP_Type type) {
[ERROR] ^
[ERROR] <https://builds.apache.org/job/UIMA-uimaFIT_java8/ws/trunk/uimafit-examples/src/main/java/org/apache/uima/fit/examples/tutorial/type/Meeting.java>:65:
warning: no @param for type
[ERROR] public Meeting(int addr, TOP_Type type) {
[ERROR] ^
[ERROR] <https://builds.apache.org/job/UIMA-uimaFIT_java8/ws/trunk/uimafit-examples/src/main/java/org/apache/uima/fit/examples/tutorial/type/Meeting.java>:71:
warning: no @param for jcas
[ERROR] public Meeting(JCas jcas) {
[ERROR] ^
[ERROR] <https://builds.apache.org/job/UIMA-uimaFIT_java8/ws/trunk/uimafit-examples/src/main/java/org/apache/uima/fit/examples/tutorial/type/Meeting.java>:77:
warning: no @param for jcas
[ERROR] public Meeting(JCas jcas, int begin, int end) {
[ERROR] ^
[ERROR] <https://builds.apache.org/job/UIMA-uimaFIT_java8/ws/trunk/uimafit-examples/src/main/java/org/apache/uima/fit/examples/tutorial/type/Meeting.java>:77:
warning: no @param for begin
[ERROR] public Meeting(JCas jcas, int begin, int end) {
[ERROR] ^
[ERROR] <https://builds.apache.org/job/UIMA-uimaFIT_java8/ws/trunk/uimafit-examples/src/main/java/org/apache/uima/fit/examples/tutorial/type/Meeting.java>:77:
warning: no @param for end
[ERROR] public Meeting(JCas jcas, int begin, int end) {
[ERROR] ^
[ERROR] <https://builds.apache.org/job/UIMA-uimaFIT_java8/ws/trunk/uimafit-examples/src/main/java/org/apache/uima/fit/examples/tutorial/type/Meeting_Type.java>:80:
warning: no @param for addr
[ERROR] public int getRoom(int addr) {
[ERROR] ^
[ERROR] <https://builds.apache.org/job/UIMA-uimaFIT_java8/ws/trunk/uimafit-examples/src/main/java/org/apache/uima/fit/examples/tutorial/type/Meeting_Type.java>:80:
warning: no @return
[ERROR] public int getRoom(int addr) {
[ERROR] ^
[ERROR] <https://builds.apache.org/job/UIMA-uimaFIT_java8/ws/trunk/uimafit-examples/src/main/java/org/apache/uima/fit/examples/tutorial/type/Meeting_Type.java>:88:
warning: no @param for addr
[ERROR] public void setRoom(int addr, int v) {
[ERROR] ^
[ERROR] <https://builds.apache.org/job/UIMA-uimaFIT_java8/ws/trunk/uimafit-examples/src/main/java/org/apache/uima/fit/examples/tutorial/type/Meeting_Type.java>:88:
warning: no @param for v
[ERROR] public void setRoom(int addr, int v) {
[ERROR] ^
[ERROR] <https://builds.apache.org/job/UIMA-uimaFIT_java8/ws/trunk/uimafit-examples/src/main/java/org/apache/uima/fit/examples/tutorial/type/Meeting_Type.java>:102:
warning: no @param for addr
[ERROR] public int getDate(int addr) {
[ERROR] ^
[ERROR] <https://builds.apache.org/job/UIMA-uimaFIT_java8/ws/trunk/uimafit-examples/src/main/java/org/apache/uima/fit/examples/tutorial/type/Meeting_Type.java>:102:
warning: no @return
[ERROR] public int getDate(int addr) {
[ERROR] ^
[ERROR] <https://builds.apache.org/job/UIMA-uimaFIT_java8/ws/trunk/uimafit-examples/src/main/java/org/apache/uima/fit/examples/tutorial/type/Meeting_Type.java>:110:
warning: no @param for addr
[ERROR] public void setDate(int addr, int v) {
[ERROR] ^
[ERROR] <https://builds.apache.org/job/UIMA-uimaFIT_java8/ws/trunk/uimafit-examples/src/main/java/org/apache/uima/fit/examples/tutorial/type/Meeting_Type.java>:110:
warning: no @param for v
[ERROR] public void setDate(int addr, int v) {
[ERROR] ^
[ERROR] <https://builds.apache.org/job/UIMA-uimaFIT_java8/ws/trunk/uimafit-examples/src/main/java/org/apache/uima/fit/examples/tutorial/type/Meeting_Type.java>:124:
warning: no @param for addr
[ERROR] public int getStartTime(int addr) {
[ERROR] ^
[ERROR] <https://builds.apache.org/job/UIMA-uimaFIT_java8/ws/trunk/uimafit-examples/src/main/java/org/apache/uima/fit/examples/tutorial/type/Meeting_Type.java>:124:
warning: no @return
[ERROR] public int getStartTime(int addr) {
[ERROR] ^
[ERROR] <https://builds.apache.org/job/UIMA-uimaFIT_java8/ws/trunk/uimafit-examples/src/main/java/org/apache/uima/fit/examples/tutorial/type/Meeting_Type.java>:132:
warning: no @param for addr
[ERROR] public void setStartTime(int addr, int v) {
[ERROR] ^
[ERROR] <https://builds.apache.org/job/UIMA-uimaFIT_java8/ws/trunk/uimafit-examples/src/main/java/org/apache/uima/fit/examples/tutorial/type/Meeting_Type.java>:132:
warning: no @param for v
[ERROR] public void setStartTime(int addr, int v) {
[ERROR] ^
[ERROR] <https://builds.apache.org/job/UIMA-uimaFIT_java8/ws/trunk/uimafit-examples/src/main/java/org/apache/uima/fit/examples/tutorial/type/Meeting_Type.java>:146:
warning: no @param for addr
[ERROR] public int getEndTime(int addr) {
[ERROR] ^
[ERROR] <https://builds.apache.org/job/UIMA-uimaFIT_java8/ws/trunk/uimafit-examples/src/main/java/org/apache/uima/fit/examples/tutorial/type/Meeting_Type.java>:146:
warning: no @return
[ERROR] public int getEndTime(int addr) {
[ERROR] ^
[ERROR] <https://builds.apache.org/job/UIMA-uimaFIT_java8/ws/trunk/uimafit-examples/src/main/java/org/apache/uima/fit/examples/tutorial/type/Meeting_Type.java>:154:
warning: no @param for addr
[ERROR] public void setEndTime(int addr, int v) {
[ERROR] ^
[ERROR] <https://builds.apache.org/job/UIMA-uimaFIT_java8/ws/trunk/uimafit-examples/src/main/java/org/apache/uima/fit/examples/tutorial/type/Meeting_Type.java>:154:
warning: no @param for v
[ERROR] public void setEndTime(int addr, int v) {
[ERROR] ^
[ERROR] <https://builds.apache.org/job/UIMA-uimaFIT_java8/ws/trunk/uimafit-examples/src/main/java/org/apache/uima/fit/examples/tutorial/type/Meeting_Type.java>:166:
warning: no @param for jcas
[ERROR] public Meeting_Type(JCas jcas, Type casType) {
[ERROR] ^
[ERROR] <https://builds.apache.org/job/UIMA-uimaFIT_java8/ws/trunk/uimafit-examples/src/main/java/org/apache/uima/fit/examples/tutorial/type/Meeting_Type.java>:166:
warning: no @param for casType
[ERROR] public Meeting_Type(JCas jcas, Type casType) {
[ERROR] ^
[ERROR] <https://builds.apache.org/job/UIMA-uimaFIT_java8/ws/trunk/uimafit-examples/src/main/java/org/apache/uima/fit/examples/tutorial/type/RoomNumber.java>:100:
warning: no @return
[ERROR] public String getBuilding() {
[ERROR] ^
[ERROR] <https://builds.apache.org/job/UIMA-uimaFIT_java8/ws/trunk/uimafit-examples/src/main/java/org/apache/uima/fit/examples/tutorial/type/RoomNumber.java>:114:
warning: no @param for v
[ERROR] public void setBuilding(String v) {
[ERROR] ^
[ERROR] <https://builds.apache.org/job/UIMA-uimaFIT_java8/ws/trunk/uimafit-examples/src/main/java/org/apache/uima/fit/examples/tutorial/type/RoomNumber.java>:65:
warning: no @param for addr
[ERROR] public RoomNumber(int addr, TOP_Type type) {
[ERROR] ^
[ERROR] <https://builds.apache.org/job/UIMA-uimaFIT_java8/ws/trunk/uimafit-examples/src/main/java/org/apache/uima/fit/examples/tutorial/type/RoomNumber.java>:65:
warning: no @param for type
[ERROR] public RoomNumber(int addr, TOP_Type type) {
[ERROR] ^
[ERROR] <https://builds.apache.org/job/UIMA-uimaFIT_java8/ws/trunk/uimafit-examples/src/main/java/org/apache/uima/fit/examples/tutorial/type/RoomNumber.java>:71:
warning: no @param for jcas
[ERROR] public RoomNumber(JCas jcas) {
[ERROR] ^
[ERROR] <https://builds.apache.org/job/UIMA-uimaFIT_java8/ws/trunk/uimafit-examples/src/main/java/org/apache/uima/fit/examples/tutorial/type/RoomNumber.java>:77:
warning: no @param for jcas
[ERROR] public RoomNumber(JCas jcas, int begin, int end) {
[ERROR] ^
[ERROR] <https://builds.apache.org/job/UIMA-uimaFIT_java8/ws/trunk/uimafit-examples/src/main/java/org/apache/uima/fit/examples/tutorial/type/RoomNumber.java>:77:
warning: no @param for begin
[ERROR] public RoomNumber(JCas jcas, int begin, int end) {
[ERROR] ^
[ERROR] <https://builds.apache.org/job/UIMA-uimaFIT_java8/ws/trunk/uimafit-examples/src/main/java/org/apache/uima/fit/examples/tutorial/type/RoomNumber.java>:77:
warning: no @param for end
[ERROR] public RoomNumber(JCas jcas, int begin, int end) {
[ERROR] ^
[ERROR] <https://builds.apache.org/job/UIMA-uimaFIT_java8/ws/trunk/uimafit-examples/src/main/java/org/apache/uima/fit/examples/tutorial/type/RoomNumber_Type.java>:80:
warning: no @param for addr
[ERROR] public String getBuilding(int addr) {
[ERROR] ^
[ERROR] <https://builds.apache.org/job/UIMA-uimaFIT_java8/ws/trunk/uimafit-examples/src/main/java/org/apache/uima/fit/examples/tutorial/type/RoomNumber_Type.java>:80:
warning: no @return
[ERROR] public String getBuilding(int addr) {
[ERROR] ^
[ERROR] <https://builds.apache.org/job/UIMA-uimaFIT_java8/ws/trunk/uimafit-examples/src/main/java/org/apache/uima/fit/examples/tutorial/type/RoomNumber_Type.java>:88:
warning: no @param for addr
[ERROR] public void setBuilding(int addr, String v) {
[ERROR] ^
[ERROR] <https://builds.apache.org/job/UIMA-uimaFIT_java8/ws/trunk/uimafit-examples/src/main/java/org/apache/uima/fit/examples/tutorial/type/RoomNumber_Type.java>:88:
warning: no @param for v
[ERROR] public void setBuilding(int addr, String v) {
[ERROR] ^
[ERROR] <https://builds.apache.org/job/UIMA-uimaFIT_java8/ws/trunk/uimafit-examples/src/main/java/org/apache/uima/fit/examples/tutorial/type/RoomNumber_Type.java>:100:
warning: no @param for jcas
[ERROR] public RoomNumber_Type(JCas jcas, Type casType) {
[ERROR] ^
[ERROR] <https://builds.apache.org/job/UIMA-uimaFIT_java8/ws/trunk/uimafit-examples/src/main/java/org/apache/uima/fit/examples/tutorial/type/RoomNumber_Type.java>:100:
warning: no @param for casType
[ERROR] public RoomNumber_Type(JCas jcas, Type casType) {
[ERROR] ^
[ERROR] <https://builds.apache.org/job/UIMA-uimaFIT_java8/ws/trunk/uimafit-examples/src/main/java/org/apache/uima/fit/examples/tutorial/type/TimeAnnotation.java>:64:
warning: no @param for addr
[ERROR] public TimeAnnotation(int addr, TOP_Type type) {
[ERROR] ^
[ERROR] <https://builds.apache.org/job/UIMA-uimaFIT_java8/ws/trunk/uimafit-examples/src/main/java/org/apache/uima/fit/examples/tutorial/type/TimeAnnotation.java>:64:
warning: no @param for type
[ERROR] public TimeAnnotation(int addr, TOP_Type type) {
[ERROR] ^
[ERROR] <https://builds.apache.org/job/UIMA-uimaFIT_java8/ws/trunk/uimafit-examples/src/main/java/org/apache/uima/fit/examples/tutorial/type/TimeAnnotation.java>:70:
warning: no @param for jcas
[ERROR] public TimeAnnotation(JCas jcas) {
[ERROR] ^
[ERROR] <https://builds.apache.org/job/UIMA-uimaFIT_java8/ws/trunk/uimafit-examples/src/main/java/org/apache/uima/fit/examples/tutorial/type/TimeAnnotation.java>:76:
warning: no @param for jcas
[ERROR] public TimeAnnotation(JCas jcas, int begin, int end) {
[ERROR] ^
[ERROR] <https://builds.apache.org/job/UIMA-uimaFIT_java8/ws/trunk/uimafit-examples/src/main/java/org/apache/uima/fit/examples/tutorial/type/TimeAnnotation.java>:76:
warning: no @param for begin
[ERROR] public TimeAnnotation(JCas jcas, int begin, int end) {
[ERROR] ^
[ERROR] <https://builds.apache.org/job/UIMA-uimaFIT_java8/ws/trunk/uimafit-examples/src/main/java/org/apache/uima/fit/examples/tutorial/type/TimeAnnotation.java>:76:
warning: no @param for end
[ERROR] public TimeAnnotation(JCas jcas, int begin, int end) {
[ERROR] ^
[ERROR] <https://builds.apache.org/job/UIMA-uimaFIT_java8/ws/trunk/uimafit-examples/src/main/java/org/apache/uima/fit/examples/tutorial/type/TimeAnnotation_Type.java>:75:
warning: no @param for jcas
[ERROR] public TimeAnnotation_Type(JCas jcas, Type casType) {
[ERROR] ^
[ERROR] <https://builds.apache.org/job/UIMA-uimaFIT_java8/ws/trunk/uimafit-examples/src/main/java/org/apache/uima/fit/examples/tutorial/type/TimeAnnotation_Type.java>:75:
warning: no @param for casType
[ERROR] public TimeAnnotation_Type(JCas jcas, Type casType) {
[ERROR] ^
[ERROR] <https://builds.apache.org/job/UIMA-uimaFIT_java8/ws/trunk/uimafit-examples/src/main/java/org/apache/uima/fit/examples/tutorial/type/UimaAcronym.java>:100:
warning: no @return
[ERROR] public String getExpandedForm() {
[ERROR] ^
[ERROR] <https://builds.apache.org/job/UIMA-uimaFIT_java8/ws/trunk/uimafit-examples/src/main/java/org/apache/uima/fit/examples/tutorial/type/UimaAcronym.java>:114:
warning: no @param for v
[ERROR] public void setExpandedForm(String v) {
[ERROR] ^
[ERROR] <https://builds.apache.org/job/UIMA-uimaFIT_java8/ws/trunk/uimafit-examples/src/main/java/org/apache/uima/fit/examples/tutorial/type/UimaAcronym.java>:65:
warning: no @param for addr
[ERROR] public UimaAcronym(int addr, TOP_Type type) {
[ERROR] ^
[ERROR] <https://builds.apache.org/job/UIMA-uimaFIT_java8/ws/trunk/uimafit-examples/src/main/java/org/apache/uima/fit/examples/tutorial/type/UimaAcronym.java>:65:
warning: no @param for type
[ERROR] public UimaAcronym(int addr, TOP_Type type) {
[ERROR] ^
[ERROR] <https://builds.apache.org/job/UIMA-uimaFIT_java8/ws/trunk/uimafit-examples/src/main/java/org/apache/uima/fit/examples/tutorial/type/UimaAcronym.java>:71:
warning: no @param for jcas
[ERROR] public UimaAcronym(JCas jcas) {
[ERROR] ^
[ERROR] <https://builds.apache.org/job/UIMA-uimaFIT_java8/ws/trunk/uimafit-examples/src/main/java/org/apache/uima/fit/examples/tutorial/type/UimaAcronym.java>:77:
warning: no @param for jcas
[ERROR] public UimaAcronym(JCas jcas, int begin, int end) {
[ERROR] ^
[ERROR] <https://builds.apache.org/job/UIMA-uimaFIT_java8/ws/trunk/uimafit-examples/src/main/java/org/apache/uima/fit/examples/tutorial/type/UimaAcronym.java>:77:
warning: no @param for begin
[ERROR] public UimaAcronym(JCas jcas, int begin, int end) {
[ERROR] ^
[ERROR] <https://builds.apache.org/job/UIMA-uimaFIT_java8/ws/trunk/uimafit-examples/src/main/java/org/apache/uima/fit/examples/tutorial/type/UimaAcronym.java>:77:
warning: no @param for end
[ERROR] public UimaAcronym(JCas jcas, int begin, int end) {
[ERROR] ^
[ERROR] <https://builds.apache.org/job/UIMA-uimaFIT_java8/ws/trunk/uimafit-examples/src/main/java/org/apache/uima/fit/examples/tutorial/type/UimaAcronym_Type.java>:80:
warning: no @param for addr
[ERROR] public String getExpandedForm(int addr) {
[ERROR] ^
[ERROR] <https://builds.apache.org/job/UIMA-uimaFIT_java8/ws/trunk/uimafit-examples/src/main/java/org/apache/uima/fit/examples/tutorial/type/UimaAcronym_Type.java>:80:
warning: no @return
[ERROR] public String getExpandedForm(int addr) {
[ERROR] ^
[ERROR] <https://builds.apache.org/job/UIMA-uimaFIT_java8/ws/trunk/uimafit-examples/src/main/java/org/apache/uima/fit/examples/tutorial/type/UimaAcronym_Type.java>:89:
warning: no @param for addr
[ERROR] public void setExpandedForm(int addr, String v) {
[ERROR] ^
[ERROR] <https://builds.apache.org/job/UIMA-uimaFIT_java8/ws/trunk/uimafit-examples/src/main/java/org/apache/uima/fit/examples/tutorial/type/UimaAcronym_Type.java>:89:
warning: no @param for v
[ERROR] public void setExpandedForm(int addr, String v) {
[ERROR] ^
[ERROR] <https://builds.apache.org/job/UIMA-uimaFIT_java8/ws/trunk/uimafit-examples/src/main/java/org/apache/uima/fit/examples/tutorial/type/UimaAcronym_Type.java>:102:
warning: no @param for jcas
[ERROR] public UimaAcronym_Type(JCas jcas, Type casType) {
[ERROR] ^
[ERROR] <https://builds.apache.org/job/UIMA-uimaFIT_java8/ws/trunk/uimafit-examples/src/main/java/org/apache/uima/fit/examples/tutorial/type/UimaAcronym_Type.java>:102:
warning: no @param for casType
[ERROR] public UimaAcronym_Type(JCas jcas, Type casType) {
[ERROR] ^
[ERROR] <https://builds.apache.org/job/UIMA-uimaFIT_java8/ws/trunk/uimafit-examples/src/main/java/org/apache/uima/fit/examples/tutorial/type/UimaMeeting.java>:64:
warning: no @param for addr
[ERROR] public UimaMeeting(int addr, TOP_Type type) {
[ERROR] ^
[ERROR] <https://builds.apache.org/job/UIMA-uimaFIT_java8/ws/trunk/uimafit-examples/src/main/java/org/apache/uima/fit/examples/tutorial/type/UimaMeeting.java>:64:
warning: no @param for type
[ERROR] public UimaMeeting(int addr, TOP_Type type) {
[ERROR] ^
[JENKINS] Archiving <https://builds.apache.org/job/UIMA-uimaFIT_java8/ws/trunk/uimafit-core/pom.xml>
to org.apache.uima/uimafit-core/2.1.0-SNAPSHOT/uimafit-core-2.1.0-SNAPSHOT.pom
[JENKINS] Archiving <https://builds.apache.org/job/UIMA-uimaFIT_java8/ws/trunk/uimafit-core/target/uimafit-core-2.1.0-SNAPSHOT.jar>
to org.apache.uima/uimafit-core/2.1.0-SNAPSHOT/uimafit-core-2.1.0-SNAPSHOT.jar
[ERROR] <https://builds.apache.org/job/UIMA-uimaFIT_java8/ws/trunk/uimafit-examples/src/main/java/org/apache/uima/fit/examples/tutorial/type/UimaMeeting.java>:70:
warning: no @param for jcas
[ERROR] public UimaMeeting(JCas jcas) {
[ERROR] ^
[ERROR] <https://builds.apache.org/job/UIMA-uimaFIT_java8/ws/trunk/uimafit-examples/src/main/java/org/apache/uima/fit/examples/tutorial/type/UimaMeeting.java>:76:
warning: no @param for jcas
[ERROR] public UimaMeeting(JCas jcas, int begin, int end) {
[ERROR] ^
[ERROR] <https://builds.apache.org/job/UIMA-uimaFIT_java8/ws/trunk/uimafit-examples/src/main/java/org/apache/uima/fit/examples/tutorial/type/UimaMeeting.java>:76:
warning: no @param for begin
[ERROR] public UimaMeeting(JCas jcas, int begin, int end) {
[ERROR] ^
[ERROR] <https://builds.apache.org/job/UIMA-uimaFIT_java8/ws/trunk/uimafit-examples/src/main/java/org/apache/uima/fit/examples/tutorial/type/UimaMeeting.java>:76:
warning: no @param for end
[ERROR] public UimaMeeting(JCas jcas, int begin, int end) {
[ERROR] ^
[ERROR] <https://builds.apache.org/job/UIMA-uimaFIT_java8/ws/trunk/uimafit-examples/src/main/java/org/apache/uima/fit/examples/tutorial/type/UimaMeeting_Type.java>:75:
warning: no @param for jcas
[ERROR] public UimaMeeting_Type(JCas jcas, Type casType) {
[ERROR] ^
[ERROR] <https://builds.apache.org/job/UIMA-uimaFIT_java8/ws/trunk/uimafit-examples/src/main/java/org/apache/uima/fit/examples/tutorial/type/UimaMeeting_Type.java>:75:
warning: no @param for casType
[ERROR] public UimaMeeting_Type(JCas jcas, Type casType) {
[ERROR] ^
[ERROR] <https://builds.apache.org/job/UIMA-uimaFIT_java8/ws/trunk/uimafit-examples/src/main/java/org/apache/uima/fit/examples/resource/ExternalResourceExample.java>:81:
warning: no @param for args
[ERROR] public static void main(String[] args) throws Exception {
[ERROR] ^
[ERROR] <https://builds.apache.org/job/UIMA-uimaFIT_java8/ws/trunk/uimafit-examples/src/main/java/org/apache/uima/fit/examples/resource/ExternalResourceExample.java>:81:
warning: no @throws for java.lang.Exception
[ERROR] public static void main(String[] args) throws Exception {
[ERROR] ^
[ERROR] <https://builds.apache.org/job/UIMA-uimaFIT_java8/ws/trunk/uimafit-maven-plugin/target/generated-sources/plugin/org/apache/uima/fit/maven/HelpMojo.java>:24:
error: self-closing element not allowed
[ERROR] * Display help information on uimafit-maven-plugin.<br/>
[ERROR] ^
[ERROR] 
[ERROR] Command line was: /home/jenkins/jenkins-slave/tools/hudson.model.JDK/jdk-1.8.0/jre/../bin/javadoc
@options @packages
[ERROR] 
[ERROR] Refer to the generated Javadoc files in '<https://builds.apache.org/job/UIMA-uimaFIT_java8/ws/trunk/target/site/apidocs'>
dir.
[ERROR] -> [Help 1]
[ERROR] 
[ERROR] To see the full stack trace of the errors, re-run Maven with the -e switch.
[ERROR] Re-run Maven using the -X switch to enable full debug logging.
[ERROR] 
[ERROR] For more information about the errors and possible solutions, please read the following
articles:
[ERROR] [Help 1] http://cwiki.apache.org/confluence/display/MAVEN/MojoExecutionException
[ERROR] 
[ERROR] After correcting the problems, you can resume the build with the command
[ERROR]   mvn <goals> -rf :uimafit
[JENKINS] Archiving <https://builds.apache.org/job/UIMA-uimaFIT_java8/ws/trunk/uimafit-docbook/pom.xml>
to org.apache.uima/uimafit-docbook/2.1.0-SNAPSHOT/uimafit-docbook-2.1.0-SNAPSHOT.pom
[JENKINS] Archiving <https://builds.apache.org/job/UIMA-uimaFIT_java8/ws/trunk/pom.xml>
to org.apache.uima/uimafit/2.1.0-SNAPSHOT/uimafit-2.1.0-SNAPSHOT.pom
[JENKINS] Archiving <https://builds.apache.org/job/UIMA-uimaFIT_java8/ws/trunk/target/uimafit-2.1.0-SNAPSHOT-bin.tar.gz>
to org.apache.uima/uimafit/2.1.0-SNAPSHOT/uimafit-2.1.0-SNAPSHOT-bin.tar.gz
[JENKINS] Archiving <https://builds.apache.org/job/UIMA-uimaFIT_java8/ws/trunk/target/uimafit-2.1.0-SNAPSHOT-bin.zip>
to org.apache.uima/uimafit/2.1.0-SNAPSHOT/uimafit-2.1.0-SNAPSHOT-bin.zip
[JENKINS] Archiving <https://builds.apache.org/job/UIMA-uimaFIT_java8/ws/trunk/uimafit-cpe/pom.xml>
to org.apache.uima/uimafit-cpe/2.1.0-SNAPSHOT/uimafit-cpe-2.1.0-SNAPSHOT.pom
[JENKINS] Archiving <https://builds.apache.org/job/UIMA-uimaFIT_java8/ws/trunk/uimafit-cpe/target/uimafit-cpe-2.1.0-SNAPSHOT.jar>
to org.apache.uima/uimafit-cpe/2.1.0-SNAPSHOT/uimafit-cpe-2.1.0-SNAPSHOT.jar
[JENKINS] Archiving <https://builds.apache.org/job/UIMA-uimaFIT_java8/ws/trunk/uimafit-maven-plugin/pom.xml>
to org.apache.uima/uimafit-maven-plugin/2.1.0-SNAPSHOT/uimafit-maven-plugin-2.1.0-SNAPSHOT.pom
[JENKINS] Archiving <https://builds.apache.org/job/UIMA-uimaFIT_java8/ws/trunk/uimafit-maven-plugin/target/uimafit-maven-plugin-2.1.0-SNAPSHOT.jar>
to org.apache.uima/uimafit-maven-plugin/2.1.0-SNAPSHOT/uimafit-maven-plugin-2.1.0-SNAPSHOT.jar
[JENKINS] Archiving <https://builds.apache.org/job/UIMA-uimaFIT_java8/ws/trunk/uimafit-legacy-support/pom.xml>
to org.apache.uima/uimafit-legacy-support/2.1.0-SNAPSHOT/uimafit-legacy-support-2.1.0-SNAPSHOT.pom
[JENKINS] Archiving <https://builds.apache.org/job/UIMA-uimaFIT_java8/ws/trunk/uimafit-legacy-support/target/uimafit-legacy-support-2.1.0-SNAPSHOT.jar>
to org.apache.uima/uimafit-legacy-support/2.1.0-SNAPSHOT/uimafit-legacy-support-2.1.0-SNAPSHOT.jar
[JENKINS] Archiving <https://builds.apache.org/job/UIMA-uimaFIT_java8/ws/trunk/uimafit-parent/pom.xml>
to org.apache.uima/uimafit-parent/2.1.0-SNAPSHOT/uimafit-parent-2.1.0-SNAPSHOT.pom
[JENKINS] Archiving <https://builds.apache.org/job/UIMA-uimaFIT_java8/ws/trunk/uimafit-examples/pom.xml>
to org.apache.uima/uimafit-examples/2.1.0-SNAPSHOT/uimafit-examples-2.1.0-SNAPSHOT.pom
[JENKINS] Archiving <https://builds.apache.org/job/UIMA-uimaFIT_java8/ws/trunk/uimafit-examples/target/uimafit-examples-2.1.0-SNAPSHOT.jar>
to org.apache.uima/uimafit-examples/2.1.0-SNAPSHOT/uimafit-examples-2.1.0-SNAPSHOT.jar
[JENKINS] Archiving <https://builds.apache.org/job/UIMA-uimaFIT_java8/ws/trunk/uimafit-spring/pom.xml>
to org.apache.uima/uimafit-spring/2.1.0-SNAPSHOT/uimafit-spring-2.1.0-SNAPSHOT.pom
[JENKINS] Archiving <https://builds.apache.org/job/UIMA-uimaFIT_java8/ws/trunk/uimafit-spring/target/uimafit-spring-2.1.0-SNAPSHOT.jar>
to org.apache.uima/uimafit-spring/2.1.0-SNAPSHOT/uimafit-spring-2.1.0-SNAPSHOT.jar
Sending e-mails to: dev@uima.apache.org
channel stopped
[WARNINGS] Skipping publisher since build result is FAILURE
Skipping Cobertura coverage report as build was not UNSTABLE or better ...

Mime
View raw message