uima-dev mailing list archives

Site index · List index
Message view « Date » · « Thread »
Top « Date » · « Thread »
From Apache Jenkins Server <jenk...@builds.apache.org>
Subject Build failed in Jenkins: UIMA-SDK #500
Date Thu, 03 Apr 2014 22:44:07 GMT
See <https://builds.apache.org/job/UIMA-SDK/500/changes>

Changes:

[schor] [UIMA-3722] fix JCasHashMap table expansion / shrinking, and remove faulty optimization

------------------------------------------
[...truncated 3523 lines...]
[INFO] 
[INFO] --- build-helper-maven-plugin:1.7:parse-version (parse-project-version) @ uimaj-test-util
---
[INFO] 
[INFO] --- uima-build-helper-maven-plugin:7:parse-date-time (set buildYear and buildMonth)
@ uimaj-test-util ---
[INFO] 
[INFO] --- maven-remote-resources-plugin:1.4:process (default) @ uimaj-test-util ---
[INFO] 
[INFO] --- maven-resources-plugin:2.6:resources (default-resources) @ uimaj-test-util ---
[INFO] Using 'UTF-8' encoding to copy filtered resources.
[INFO] Copying 0 resource
[INFO] Copying 3 resources
[INFO] 
[INFO] --- maven-compiler-plugin:2.5.1:compile (default-compile) @ uimaj-test-util ---
[INFO] Compiling 7 source files to <https://builds.apache.org/job/UIMA-SDK/ws/trunk/uimaj-test-util/target/classes>
[INFO] 
[INFO] --- maven-resources-plugin:2.6:testResources (default-testResources) @ uimaj-test-util
---
[INFO] Using 'UTF-8' encoding to copy filtered resources.
[INFO] skip non existing resourceDirectory <https://builds.apache.org/job/UIMA-SDK/ws/trunk/uimaj-test-util/src/test/resources>
[INFO] Copying 3 resources
[INFO] 
[INFO] --- maven-compiler-plugin:2.5.1:testCompile (default-testCompile) @ uimaj-test-util
---
[INFO] Nothing to compile - all classes are up to date
[INFO] 
[INFO] --- maven-surefire-plugin:2.12.4:test (default-test) @ uimaj-test-util ---
[INFO] 
[INFO] --- maven-antrun-plugin:1.7:run (dup-meta-jar-cleanup) @ uimaj-test-util ---
[JENKINS] Recording test results
[INFO] Executing tasks

main:
[INFO] Executed tasks
[INFO] 
[INFO] --- maven-jar-plugin:2.3.2:jar (default-jar) @ uimaj-test-util ---
[INFO] Building jar: <https://builds.apache.org/job/UIMA-SDK/ws/trunk/uimaj-test-util/target/uimaj-test-util-2.5.1-SNAPSHOT.jar>
[INFO] 
[INFO] --- maven-site-plugin:3.2:attach-descriptor (attach-descriptor) @ uimaj-test-util ---
[INFO] 
[INFO] --- maven-install-plugin:2.3.1:install (default-install) @ uimaj-test-util ---
[INFO] Installing <https://builds.apache.org/job/UIMA-SDK/ws/trunk/uimaj-test-util/target/uimaj-test-util-2.5.1-SNAPSHOT.jar>
to /home/jenkins/jenkins-slave/maven-repositories/0/org/apache/uima/uimaj-test-util/2.5.1-SNAPSHOT/uimaj-test-util-2.5.1-SNAPSHOT.jar
[INFO] Installing <https://builds.apache.org/job/UIMA-SDK/ws/trunk/uimaj-test-util/pom.xml>
to /home/jenkins/jenkins-slave/maven-repositories/0/org/apache/uima/uimaj-test-util/2.5.1-SNAPSHOT/uimaj-test-util-2.5.1-SNAPSHOT.pom
[INFO] 
[INFO] --- maven-pmd-plugin:3.1:pmd (default-cli) @ uimaj-test-util ---
[PMD] Finding all files that match the pattern pmd.xml
[PMD] Parsing 1 files in <https://builds.apache.org/job/UIMA-SDK/ws/trunk/uimaj-test-util/target>
[PMD] Successfully parsed file <https://builds.apache.org/job/UIMA-SDK/ws/trunk/uimaj-test-util/target/pmd.xml>
of module Apache UIMA Base: uimaj-test-util: JUnit utilities with 9 warnings.
[PMD] Computing warning deltas based on reference build #499
[INFO] 
[INFO] --- maven-pmd-plugin:3.1:cpd (default-cli) @ uimaj-test-util ---
[DRY] Finding all files that match the pattern cpd.xml
[DRY] Parsing 1 files in <https://builds.apache.org/job/UIMA-SDK/ws/trunk/uimaj-test-util/target>
[DRY] Successfully parsed file <https://builds.apache.org/job/UIMA-SDK/ws/trunk/uimaj-test-util/target/cpd.xml>
of module Apache UIMA Base: uimaj-test-util: JUnit utilities with 2 warnings.
[DRY] Computing warning deltas based on reference build #499
[INFO] 
[INFO] --- findbugs-maven-plugin:2.5.3:findbugs (default-cli) @ uimaj-test-util ---
[INFO] Fork Value is true
     [java] Warnings generated: 25
[INFO] Done FindBugs Analysis....
[FINDBUGS] Finding all files that match the pattern findbugsXml.xml
[FINDBUGS] Parsing 1 files in <https://builds.apache.org/job/UIMA-SDK/ws/trunk/uimaj-test-util/target>
[FINDBUGS] Successfully parsed file <https://builds.apache.org/job/UIMA-SDK/ws/trunk/uimaj-test-util/target/findbugsXml.xml>
of module Apache UIMA Base: uimaj-test-util: JUnit utilities with 25 warnings.
[FINDBUGS] Computing warning deltas based on reference build #499
[INFO] 
[INFO] --- maven-enforcer-plugin:1.3:enforce (enforce-versions) @ uimaj-test-util ---
[INFO] 
[INFO] --- build-helper-maven-plugin:1.7:parse-version (parse-project-version) @ uimaj-test-util
---
[INFO] 
[INFO] --- uima-build-helper-maven-plugin:7:parse-date-time (set buildYear and buildMonth)
@ uimaj-test-util ---
[INFO] 
[INFO] --- maven-remote-resources-plugin:1.4:process (default) @ uimaj-test-util ---
[INFO] 
[INFO] --- maven-resources-plugin:2.6:resources (default-resources) @ uimaj-test-util ---
[INFO] Using 'UTF-8' encoding to copy filtered resources.
[INFO] Copying 0 resource
[INFO] Copying 3 resources
[INFO] Copying 3 resources
[INFO] 
[INFO] --- maven-compiler-plugin:2.5.1:compile (default-compile) @ uimaj-test-util ---
[INFO] Nothing to compile - all classes are up to date
[INFO] 
[INFO] --- cobertura-maven-plugin:2.6:instrument (default-cli) @ uimaj-test-util ---
[INFO] Cobertura 2.0.3 - GNU GPL License (NO WARRANTY) - See COPYRIGHT file

[ERROR] Apr 3, 2014 10:41:07 PM net.sourceforge.cobertura.coveragedata.CoverageDataFileHandler
saveCoverageData
INFO: Cobertura: Saved information on 7 classes.

[INFO] Instrumentation was successful.
[INFO] NOT adding cobertura ser file to attached artifacts list.
[INFO] 
[INFO] --- maven-resources-plugin:2.6:testResources (default-testResources) @ uimaj-test-util
---
[INFO] Using 'UTF-8' encoding to copy filtered resources.
[INFO] skip non existing resourceDirectory <https://builds.apache.org/job/UIMA-SDK/ws/trunk/uimaj-test-util/src/test/resources>
[INFO] Copying 3 resources
[INFO] Copying 3 resources
[INFO] 
[INFO] --- maven-compiler-plugin:2.5.1:testCompile (default-testCompile) @ uimaj-test-util
---
[INFO] Nothing to compile - all classes are up to date
[INFO] 
[INFO] --- maven-surefire-plugin:2.12.4:test (default-test) @ uimaj-test-util ---
[JENKINS] Recording test results
[INFO] 
[INFO] --- cobertura-maven-plugin:2.6:cobertura (default-cli) @ uimaj-test-util ---
[INFO] Cobertura 2.0.3 - GNU GPL License (NO WARRANTY) - See COPYRIGHT file
Report time: 744ms

[ERROR] Apr 3, 2014 10:41:13 PM net.sourceforge.cobertura.coveragedata.CoverageDataFileHandler
loadCoverageData
INFO: Cobertura: Loaded information on 7 classes.

[INFO] Cobertura Report generation was successful.
[INFO] 
[INFO] --- maven-enforcer-plugin:1.3:enforce (enforce-versions) @ uimaj-test-util ---
[INFO] 
[INFO] --- build-helper-maven-plugin:1.7:parse-version (parse-project-version) @ uimaj-test-util
---
[INFO] 
[INFO] --- uima-build-helper-maven-plugin:7:parse-date-time (set buildYear and buildMonth)
@ uimaj-test-util ---
[WARNING] Failed to getClass for org.apache.maven.plugin.javadoc.JavadocReport
[INFO] 
[INFO] --- maven-javadoc-plugin:2.9.1:javadoc (default-cli) @ uimaj-test-util ---
[INFO] Fixed Javadoc frame injection vulnerability (CVE-2013-1571) in 1 files.
[JENKINS] Archiving  javadoc
[INFO]                                                                         
[INFO] ------------------------------------------------------------------------
[INFO] Building Apache UIMA Base: uimaj-core 2.5.1-SNAPSHOT
[INFO] ------------------------------------------------------------------------
[INFO] 
[INFO] --- maven-clean-plugin:2.5:clean (default-clean) @ uimaj-core ---
[TASKS] Scanning folder '<https://builds.apache.org/job/UIMA-SDK/ws/trunk/uimaj-core'>
for files matching the pattern '**/*.java' - excludes: 
[TASKS] Found 877 files to scan for tasks
Found 63 open tasks.
[TASKS] Computing warning deltas based on reference build #499
[INFO] 
[INFO] --- maven-enforcer-plugin:1.3:enforce (enforce-versions) @ uimaj-core ---
[INFO] 
[INFO] --- build-helper-maven-plugin:1.7:parse-version (parse-project-version) @ uimaj-core
---
[INFO] 
[INFO] --- uima-build-helper-maven-plugin:7:parse-date-time (set buildYear and buildMonth)
@ uimaj-core ---
[INFO] 
[INFO] --- maven-resources-plugin:2.6:copy-resources (setVersions) @ uimaj-core ---
[INFO] Using 'UTF-8' encoding to copy filtered resources.
[INFO] Copying 1 resource
[INFO] 
[INFO] --- build-helper-maven-plugin:1.7:add-source (addVersionSrc) @ uimaj-core ---
[INFO] Source directory: <https://builds.apache.org/job/UIMA-SDK/ws/trunk/uimaj-core/target/generated-sources/releaseVersion>
added.
[INFO] 
[INFO] --- maven-remote-resources-plugin:1.4:process (default) @ uimaj-core ---
[INFO] 
[INFO] --- maven-resources-plugin:2.6:resources (default-resources) @ uimaj-core ---
[INFO] Using 'UTF-8' encoding to copy filtered resources.
[INFO] Copying 15 resources
[INFO] Copying 3 resources
[INFO] 
[INFO] --- maven-compiler-plugin:2.5.1:compile (default-compile) @ uimaj-core ---
[INFO] Compiling 691 source files to <https://builds.apache.org/job/UIMA-SDK/ws/trunk/uimaj-core/target/classes>
[INFO] -------------------------------------------------------------
[ERROR] COMPILATION ERROR : 
[INFO] -------------------------------------------------------------
[ERROR] <https://builds.apache.org/job/UIMA-SDK/ws/trunk/uimaj-core/src/main/java/org/apache/uima/jcas/impl/JCasImpl.java>:[145,7]
org.apache.uima.jcas.impl.JCasImpl is not abstract and does not override abstract method putJfsFromCaddrNew(int,org.apache.uima.cas.FeatureStructure)
in org.apache.uima.jcas.JCas
[INFO] 1 error
[INFO] -------------------------------------------------------------
[INFO] ------------------------------------------------------------------------
[INFO] Reactor Summary:
[INFO] 
[INFO] Apache UIMA Java SDK: uimaj-parent ................ SUCCESS [1:46.899s]
[INFO] Apache UIMA Base: uimaj-test-util: JUnit utilities  SUCCESS [2:40.820s]
[INFO] Apache UIMA Base: uimaj-core ...................... FAILURE [44.363s]
[INFO] Apache UIMA Base: jVinci: Vinci Transport Library . SKIPPED
[INFO] Apache UIMA Base: uimaj-adapter-vinci: Vinci Adapter  SKIPPED
[INFO] Apache UIMA Base: uimaj-cpe: Collection Processing Engine  SKIPPED
[INFO] Apache UIMA Base: uimaj-document-annotation ....... SKIPPED
[INFO] Apache UIMA Base: uimaj-tools: Tools .............. SKIPPED
[INFO] Apache UIMA Base: uimaj-examples: SDK Examples .... SKIPPED
[INFO] Apache UIMA Base: uimaj-adapter-soap: SOAP Adapter  SKIPPED
[INFO] Apache UIMA Base: uimaj-component-test-util: for JUnit  SKIPPED
[INFO] Apache UIMA Eclipse: uimaj-ep-debug ............... SKIPPED
[INFO] Apache UIMA Eclipse: uimaj-ep-jcasgen ............. SKIPPED
[INFO] Apache UIMA Eclipse: uimaj-ep-configurator: Descriptor Editor  SKIPPED
[INFO] Apache UIMA Eclipse: uimaj-ep-pear-packager ....... SKIPPED
[INFO] Apache UIMA Eclipse: uimaj-ep-launcher ............ SKIPPED
[INFO] Apache UIMA Eclipse: uimaj-ep-cas-editor .......... SKIPPED
[INFO] Apache UIMA Eclipse: uimaj-ep-cas-editor-ide ...... SKIPPED
[INFO] Apache UIMA Eclipse: uimaj-ep-runtime ............. SKIPPED
[INFO] Apache UIMA Eclipse: uimaj-eclipse-feature-tools .. SKIPPED
[INFO] Apache UIMA Eclipse: uimaj-eclipse-feature-runtime  SKIPPED
[INFO] Apache UIMA Aggregate: aggregate-uimaj-eclipse-plugins  SKIPPED
[INFO] Apache UIMA SDK Documentation - overview and setup  SKIPPED
[INFO] Apache UIMA SDK Documentation - references ........ SKIPPED
[INFO] Apache UIMA SDK Documentation - tools ............. SKIPPED
[INFO] Apache UIMA SDK Documentation - tutorials and user's guides  SKIPPED
[INFO] Apache UIMA Aggregate: aggregate-uimaj-docbooks ... SKIPPED
[INFO] Apache UIMA Maven: PearPackagingMavenPlugin ....... SKIPPED
[INFO] Apache UIMA Maven: jcasgen-maven-plugin ........... SKIPPED
[INFO] Apache UIMA Base: uimaj-bootstrap ................. SKIPPED
[INFO] Apache UIMA Aggregate: aggregate-uimaj ............ SKIPPED
[INFO] Apache UIMA Java SDK: uimaj ....................... SKIPPED
[INFO] ------------------------------------------------------------------------
[INFO] BUILD FAILURE
[INFO] ------------------------------------------------------------------------
[INFO] Total time: 6:06.982s
[INFO] Finished at: Thu Apr 03 22:42:29 UTC 2014
[INFO] Final Memory: 51M/320M
[INFO] ------------------------------------------------------------------------
Waiting for Jenkins to finish collecting data[ERROR] Failed to execute goal org.apache.maven.plugins:maven-compiler-plugin:2.5.1:compile
(default-compile) on project uimaj-core: Compilation failure
[ERROR] <https://builds.apache.org/job/UIMA-SDK/ws/trunk/uimaj-core/src/main/java/org/apache/uima/jcas/impl/JCasImpl.java>:[145,7]
org.apache.uima.jcas.impl.JCasImpl is not abstract and does not override abstract method putJfsFromCaddrNew(int,org.apache.uima.cas.FeatureStructure)
in org.apache.uima.jcas.JCas
[ERROR] -> [Help 1]
[ERROR] 
[ERROR] To see the full stack trace of the errors, re-run Maven with the -e switch.
[ERROR] Re-run Maven using the -X switch to enable full debug logging.
[ERROR] 
[ERROR] For more information about the errors and possible solutions, please read the following
articles:
[ERROR] [Help 1] http://cwiki.apache.org/confluence/display/MAVEN/MojoFailureException
[ERROR] 
[ERROR] After correcting the problems, you can resume the build with the command
[ERROR]   mvn <goals> -rf :uimaj-core

[JENKINS] Archiving <https://builds.apache.org/job/UIMA-SDK/ws/trunk/uimaj-eclipse-feature-runtime/pom.xml>
to org.apache.uima/uimaj-eclipse-feature-runtime/2.5.1-SNAPSHOT/uimaj-eclipse-feature-runtime-2.5.1-SNAPSHOT.pom
[JENKINS] Archiving <https://builds.apache.org/job/UIMA-SDK/ws/trunk/uimaj-ep-launcher/pom.xml>
to org.apache.uima/uimaj-ep-launcher/2.5.1-SNAPSHOT/uimaj-ep-launcher-2.5.1-SNAPSHOT.pom
[JENKINS] Archiving <https://builds.apache.org/job/UIMA-SDK/ws/trunk/uimaj-eclipse-feature-tools/pom.xml>
to org.apache.uima/uimaj-eclipse-feature-tools/2.5.1-SNAPSHOT/uimaj-eclipse-feature-tools-2.5.1-SNAPSHOT.pom
[JENKINS] Archiving <https://builds.apache.org/job/UIMA-SDK/ws/trunk/uimaj-bootstrap/pom.xml>
to org.apache.uima/uimaj-bootstrap/2.5.1-SNAPSHOT/uimaj-bootstrap-2.5.1-SNAPSHOT.pom
[JENKINS] Archiving <https://builds.apache.org/job/UIMA-SDK/ws/trunk/aggregate-uimaj-eclipse-plugins/pom.xml>
to org.apache.uima/aggregate-uimaj-eclipse-plugins/2.5.1-SNAPSHOT/aggregate-uimaj-eclipse-plugins-2.5.1-SNAPSHOT.pom
[JENKINS] Archiving <https://builds.apache.org/job/UIMA-SDK/ws/trunk/uimaj-core/pom.xml>
to org.apache.uima/uimaj-core/2.5.1-SNAPSHOT/uimaj-core-2.5.1-SNAPSHOT.pom
[JENKINS] Archiving <https://builds.apache.org/job/UIMA-SDK/ws/trunk/uimaj-component-test-util/pom.xml>
to org.apache.uima/uimaj-component-test-util/2.5.1-SNAPSHOT/uimaj-component-test-util-2.5.1-SNAPSHOT.pom
[JENKINS] Archiving <https://builds.apache.org/job/UIMA-SDK/ws/trunk/aggregate-uimaj-docbooks/pom.xml>
to org.apache.uima/aggregate-uimaj-docbooks/2.5.1-SNAPSHOT/aggregate-uimaj-docbooks-2.5.1-SNAPSHOT.pom
[JENKINS] Archiving <https://builds.apache.org/job/UIMA-SDK/ws/trunk/uima-docbook-tools/pom.xml>
to org.apache.uima/uima-docbook-tools/2.5.1-SNAPSHOT/uima-docbook-tools-2.5.1-SNAPSHOT.pom
[JENKINS] Archiving <https://builds.apache.org/job/UIMA-SDK/ws/trunk/uimaj-document-annotation/pom.xml>
to org.apache.uima/uimaj-document-annotation/2.5.1-SNAPSHOT/uimaj-document-annotation-2.5.1-SNAPSHOT.pom
[JENKINS] Archiving <https://builds.apache.org/job/UIMA-SDK/ws/trunk/jVinci/pom.xml>
to org.apache.uima/jVinci/2.5.1-SNAPSHOT/jVinci-2.5.1-SNAPSHOT.pom
[JENKINS] Archiving <https://builds.apache.org/job/UIMA-SDK/ws/trunk/uimaj-ep-configurator/pom.xml>
to org.apache.uima/uimaj-ep-configurator/2.5.1-SNAPSHOT/uimaj-ep-configurator-2.5.1-SNAPSHOT.pom
[JENKINS] Archiving <https://builds.apache.org/job/UIMA-SDK/ws/trunk/uimaj-examples/pom.xml>
to org.apache.uima/uimaj-examples/2.5.1-SNAPSHOT/uimaj-examples-2.5.1-SNAPSHOT.pom
[JENKINS] Archiving <https://builds.apache.org/job/UIMA-SDK/ws/trunk/uimaj-adapter-vinci/pom.xml>
to org.apache.uima/uimaj-adapter-vinci/2.5.1-SNAPSHOT/uimaj-adapter-vinci-2.5.1-SNAPSHOT.pom
[JENKINS] Archiving <https://builds.apache.org/job/UIMA-SDK/ws/trunk/PearPackagingMavenPlugin/pom.xml>
to org.apache.uima/PearPackagingMavenPlugin/2.5.1-SNAPSHOT/PearPackagingMavenPlugin-2.5.1-SNAPSHOT.pom
[JENKINS] Archiving <https://builds.apache.org/job/UIMA-SDK/ws/trunk/uimaj-ep-cas-editor-ide/pom.xml>
to org.apache.uima/uimaj-ep-cas-editor-ide/2.5.1-SNAPSHOT/uimaj-ep-cas-editor-ide-2.5.1-SNAPSHOT.pom
[JENKINS] Archiving <https://builds.apache.org/job/UIMA-SDK/ws/trunk/uimaj-test-util/pom.xml>
to org.apache.uima/uimaj-test-util/2.5.1-SNAPSHOT/uimaj-test-util-2.5.1-SNAPSHOT.pom
[JENKINS] Archiving <https://builds.apache.org/job/UIMA-SDK/ws/trunk/uimaj-test-util/target/uimaj-test-util-2.5.1-SNAPSHOT.jar>
to org.apache.uima/uimaj-test-util/2.5.1-SNAPSHOT/uimaj-test-util-2.5.1-SNAPSHOT.jar
[JENKINS] Archiving <https://builds.apache.org/job/UIMA-SDK/ws/trunk/uimaj-ep-runtime/pom.xml>
to org.apache.uima/uimaj-ep-runtime/2.5.1-SNAPSHOT/uimaj-ep-runtime-2.5.1-SNAPSHOT.pom
[JENKINS] Archiving <https://builds.apache.org/job/UIMA-SDK/ws/trunk/uimaj-ep-debug/pom.xml>
to org.apache.uima/uimaj-ep-debug/2.5.1-SNAPSHOT/uimaj-ep-debug-2.5.1-SNAPSHOT.pom
[JENKINS] Archiving <https://builds.apache.org/job/UIMA-SDK/ws/trunk/uimaj-ep-cas-editor/pom.xml>
to org.apache.uima/uimaj-ep-cas-editor/2.5.1-SNAPSHOT/uimaj-ep-cas-editor-2.5.1-SNAPSHOT.pom
[JENKINS] Archiving <https://builds.apache.org/job/UIMA-SDK/ws/trunk/aggregate-uimaj/pom.xml>
to org.apache.uima/aggregate-uimaj/2.5.1-SNAPSHOT/aggregate-uimaj-2.5.1-SNAPSHOT.pom
[JENKINS] Archiving <https://builds.apache.org/job/UIMA-SDK/ws/trunk/uimaj-parent/pom.xml>
to org.apache.uima/uimaj-parent/2.5.1-SNAPSHOT/uimaj-parent-2.5.1-SNAPSHOT.pom
[JENKINS] Archiving <https://builds.apache.org/job/UIMA-SDK/ws/trunk/jcasgen-maven-plugin/pom.xml>
to org.apache.uima/jcasgen-maven-plugin/2.5.1-SNAPSHOT/jcasgen-maven-plugin-2.5.1-SNAPSHOT.pom
[JENKINS] Archiving <https://builds.apache.org/job/UIMA-SDK/ws/trunk/pom.xml> to org.apache.uima/uimaj/2.5.1-SNAPSHOT/uimaj-2.5.1-SNAPSHOT.pom
[JENKINS] Archiving <https://builds.apache.org/job/UIMA-SDK/ws/trunk/uimaj-ep-jcasgen/pom.xml>
to org.apache.uima/uimaj-ep-jcasgen/2.5.1-SNAPSHOT/uimaj-ep-jcasgen-2.5.1-SNAPSHOT.pom
[JENKINS] Archiving <https://builds.apache.org/job/UIMA-SDK/ws/trunk/uimaj-tools/pom.xml>
to org.apache.uima/uimaj-tools/2.5.1-SNAPSHOT/uimaj-tools-2.5.1-SNAPSHOT.pom
[JENKINS] Archiving <https://builds.apache.org/job/UIMA-SDK/ws/trunk/uima-docbook-tutorials-and-users-guides/pom.xml>
to org.apache.uima/uima-docbook-tutorials-and-users-guides/2.5.1-SNAPSHOT/uima-docbook-tutorials-and-users-guides-2.5.1-SNAPSHOT.pom
[JENKINS] Archiving <https://builds.apache.org/job/UIMA-SDK/ws/trunk/uimaj-adapter-soap/pom.xml>
to org.apache.uima/uimaj-adapter-soap/2.5.1-SNAPSHOT/uimaj-adapter-soap-2.5.1-SNAPSHOT.pom
[JENKINS] Archiving <https://builds.apache.org/job/UIMA-SDK/ws/trunk/uimaj-ep-pear-packager/pom.xml>
to org.apache.uima/uimaj-ep-pear-packager/2.5.1-SNAPSHOT/uimaj-ep-pear-packager-2.5.1-SNAPSHOT.pom
[JENKINS] Archiving <https://builds.apache.org/job/UIMA-SDK/ws/trunk/uima-docbook-overview-and-setup/pom.xml>
to org.apache.uima/uima-docbook-overview-and-setup/2.5.1-SNAPSHOT/uima-docbook-overview-and-setup-2.5.1-SNAPSHOT.pom
[JENKINS] Archiving <https://builds.apache.org/job/UIMA-SDK/ws/trunk/uima-docbook-references/pom.xml>
to org.apache.uima/uima-docbook-references/2.5.1-SNAPSHOT/uima-docbook-references-2.5.1-SNAPSHOT.pom
[JENKINS] Archiving <https://builds.apache.org/job/UIMA-SDK/ws/trunk/uimaj-cpe/pom.xml>
to org.apache.uima/uimaj-cpe/2.5.1-SNAPSHOT/uimaj-cpe-2.5.1-SNAPSHOT.pom
Sending e-mails to: dev@uima.apache.org
channel stopped
[WARNINGS] Skipping publisher since build result is FAILURE

Mime
View raw message