uima-dev mailing list archives

Site index · List index
Message view « Date » · « Thread »
Top « Date » · « Thread »
From Apache Jenkins Server <jenk...@builds.apache.org>
Subject Build failed in Jenkins: UIMA-DUCC #170
Date Wed, 09 Apr 2014 20:01:09 GMT
See <https://builds.apache.org/job/UIMA-DUCC/170/changes>

Changes:

[challngr] UIMA-3726 Dynamic modification of registration parameters.  Also support for process_debug
in services.

------------------------------------------
[...truncated 2546 lines...]

Tests run: 1, Failures: 0, Errors: 0, Skipped: 0

[JENKINS] Recording test results
[INFO] 
[INFO] --- maven-antrun-plugin:1.7:run (dup-meta-jar-cleanup) @ uima-ducc-transport ---
[INFO] Executing tasks

main:
[INFO] Executed tasks
[INFO] 
[INFO] --- maven-jar-plugin:2.3.2:jar (default-jar) @ uima-ducc-transport ---
[INFO] Building jar: F:\hudson\hudson-slave\workspace\UIMA-DUCC\trunk\uima-ducc-transport\target\uima-ducc-transport-1.0.1-SNAPSHOT.jar
[INFO] 
[INFO] --- maven-site-plugin:3.2:attach-descriptor (attach-descriptor) @ uima-ducc-transport
---
[INFO] 
[INFO] --- maven-install-plugin:2.3.1:install (default-install) @ uima-ducc-transport ---
[INFO] Installing F:\hudson\hudson-slave\workspace\UIMA-DUCC\trunk\uima-ducc-transport\target\uima-ducc-transport-1.0.1-SNAPSHOT.jar
to f:\hudson\hudson-slave\maven-repositories\1\org\apache\uima\uima-ducc-transport\1.0.1-SNAPSHOT\uima-ducc-transport-1.0.1-SNAPSHOT.jar
[INFO] Installing F:\hudson\hudson-slave\workspace\UIMA-DUCC\trunk\uima-ducc-transport\pom.xml
to f:\hudson\hudson-slave\maven-repositories\1\org\apache\uima\uima-ducc-transport\1.0.1-SNAPSHOT\uima-ducc-transport-1.0.1-SNAPSHOT.pom
[INFO] 
[INFO] --- maven-pmd-plugin:3.1:pmd (default-cli) @ uima-ducc-transport ---
[PMD] Finding all files that match the pattern pmd.xml
[PMD] Parsing 1 files in F:\hudson\hudson-slave\workspace\UIMA-DUCC\trunk\uima-ducc-transport\target
[PMD] Successfully parsed file F:\hudson\hudson-slave\workspace\UIMA-DUCC\trunk\uima-ducc-transport\target\pmd.xml
of module Apache UIMA DUCC: uima-ducc-transport with 594 warnings.
[PMD] Computing warning deltas based on reference build #169
[INFO] 
[INFO] --- maven-pmd-plugin:3.1:cpd (default-cli) @ uima-ducc-transport ---
[DRY] Finding all files that match the pattern cpd.xml
[DRY] Parsing 1 files in F:\hudson\hudson-slave\workspace\UIMA-DUCC\trunk\uima-ducc-transport\target
[DRY] Successfully parsed file F:\hudson\hudson-slave\workspace\UIMA-DUCC\trunk\uima-ducc-transport\target\cpd.xml
of module Apache UIMA DUCC: uima-ducc-transport with 4 warnings.
[DRY] Computing warning deltas based on reference build #169
[INFO] 
[INFO] --- findbugs-maven-plugin:2.5.3:findbugs (default-cli) @ uima-ducc-transport ---
[INFO] Fork Value is true
     [java] Warnings generated: 152
[INFO] Done FindBugs Analysis....
[FINDBUGS] Finding all files that match the pattern findbugsXml.xml
[FINDBUGS] Parsing 1 files in F:\hudson\hudson-slave\workspace\UIMA-DUCC\trunk\uima-ducc-transport\target
[FINDBUGS] Successfully parsed file F:\hudson\hudson-slave\workspace\UIMA-DUCC\trunk\uima-ducc-transport\target\findbugsXml.xml
of module Apache UIMA DUCC: uima-ducc-transport with 152 warnings.
[FINDBUGS] Computing warning deltas based on reference build #169
[INFO] 
[INFO] --- maven-enforcer-plugin:1.3:enforce (enforce-versions) @ uima-ducc-transport ---
[INFO] 
[INFO] --- build-helper-maven-plugin:1.7:parse-version (parse-project-version) @ uima-ducc-transport
---
[INFO] 
[INFO] --- uima-build-helper-maven-plugin:7:parse-date-time (set buildYear and buildMonth)
@ uima-ducc-transport ---
[INFO] 
[INFO] --- maven-remote-resources-plugin:1.4:process (default) @ uima-ducc-transport ---
[INFO] 
[INFO] --- maven-resources-plugin:2.6:resources (default-resources) @ uima-ducc-transport
---
[INFO] Using 'UTF-8' encoding to copy filtered resources.
[INFO] Copying 0 resource
[INFO] Copying 3 resources
[INFO] Copying 3 resources
[INFO] 
[INFO] --- maven-compiler-plugin:2.5.1:compile (default-compile) @ uima-ducc-transport ---
[INFO] Nothing to compile - all classes are up to date
[INFO] 
[INFO] --- cobertura-maven-plugin:2.6:instrument (default-cli) @ uima-ducc-transport ---
[INFO] Cobertura 2.0.3 - GNU GPL License (NO WARRANTY) - See COPYRIGHT file

[ERROR] Apr 9, 2014 8:57:45 PM net.sourceforge.cobertura.coveragedata.CoverageDataFileHandler
saveCoverageData
INFO: Cobertura: Saved information on 223 classes.

[INFO] Instrumentation was successful.
[INFO] NOT adding cobertura ser file to attached artifacts list.
[INFO] 
[INFO] --- maven-resources-plugin:2.6:testResources (default-testResources) @ uima-ducc-transport
---
[INFO] Using 'UTF-8' encoding to copy filtered resources.
[INFO] Copying 0 resource
[INFO] Copying 3 resources
[INFO] Copying 3 resources
[INFO] 
[INFO] --- maven-compiler-plugin:2.5.1:testCompile (default-testCompile) @ uima-ducc-transport
---
[INFO] Nothing to compile - all classes are up to date
[INFO] 
[INFO] --- maven-surefire-plugin:2.12.4:test (default-test) @ uima-ducc-transport ---
[INFO] Surefire report directory: F:\hudson\hudson-slave\workspace\UIMA-DUCC\trunk\uima-ducc-transport\target\surefire-reports

-------------------------------------------------------
 T E S T S
-------------------------------------------------------
Running org.apache.uima.ducc.transport.test.DuccProcessWorkItemsTest
     done: 2
    error: 9
    retry: 4
 dispatch: 1
avg(secs): 35
min(secs): 30
max(secs): 40
Tests run: 1, Failures: 0, Errors: 0, Skipped: 0, Time elapsed: 0.202 sec

Results :

Tests run: 1, Failures: 0, Errors: 0, Skipped: 0

[JENKINS] Recording test results
[INFO] 
[INFO] --- cobertura-maven-plugin:2.6:cobertura (default-cli) @ uima-ducc-transport ---
[INFO] Cobertura 2.0.3 - GNU GPL License (NO WARRANTY) - See COPYRIGHT file
Report time: 9311ms

[ERROR] Apr 9, 2014 8:57:53 PM net.sourceforge.cobertura.coveragedata.CoverageDataFileHandler
loadCoverageData
INFO: Cobertura: Loaded information on 223 classes.

[INFO] Cobertura Report generation was successful.
[INFO] 
[INFO] --- maven-enforcer-plugin:1.3:enforce (enforce-versions) @ uima-ducc-transport ---
[INFO] 
[INFO] --- build-helper-maven-plugin:1.7:parse-version (parse-project-version) @ uima-ducc-transport
---
[INFO] 
[INFO] --- uima-build-helper-maven-plugin:7:parse-date-time (set buildYear and buildMonth)
@ uima-ducc-transport ---
[WARNING] Failed to getClass for org.apache.maven.plugin.javadoc.JavadocReport
[INFO] 
[INFO] --- maven-javadoc-plugin:2.9.1:javadoc (default-cli) @ uima-ducc-transport ---
[INFO] 
15 warnings
[WARNING] Javadoc Warnings
[WARNING] F:\hudson\hudson-slave\workspace\UIMA-DUCC\trunk\uima-ducc-transport\src\main\java\org\apache\uima\ducc\transport\event\ProcessStateUpdateDuccEvent.java:67:
warning - @param argument "duccProcessId" is not a parameter name.
[WARNING] F:\hudson\hudson-slave\workspace\UIMA-DUCC\trunk\uima-ducc-transport\src\main\java\org\apache\uima\ducc\transport\event\common\IDuccJobDeployment.java:59:
warning - @return tag has no arguments.
[WARNING] F:\hudson\hudson-slave\workspace\UIMA-DUCC\trunk\uima-ducc-transport\src\main\java\org\apache\uima\ducc\transport\event\common\IDuccJobDeployment.java:65:
warning - @return tag has no arguments.
[WARNING] F:\hudson\hudson-slave\workspace\UIMA-DUCC\trunk\uima-ducc-transport\src\main\java\org\apache\uima\ducc\transport\event\common\IDuccJobDeployment.java:33:
warning - Tag @link: reference not found: JavaCommandLine
[WARNING] F:\hudson\hudson-slave\workspace\UIMA-DUCC\trunk\uima-ducc-transport\src\main\java\org\apache\uima\ducc\transport\event\common\IDuccJobDeployment.java:38:
warning - Tag @link: reference not found: JavaCommandLine
[WARNING] F:\hudson\hudson-slave\workspace\UIMA-DUCC\trunk\uima-ducc-transport\src\main\java\org\apache\uima\ducc\transport\event\common\DuccProcess.java:467:
warning - @param argument "ProcessGarbageCollectionStats" is not a parameter name.
[WARNING] F:\hudson\hudson-slave\workspace\UIMA-DUCC\trunk\uima-ducc-transport\src\main\java\org\apache\uima\ducc\transport\event\common\DuccProcess.java:473:
warning - @param argument "ProcessGarbageCollectionStats" is not a parameter name.
[WARNING] F:\hudson\hudson-slave\workspace\UIMA-DUCC\trunk\uima-ducc-transport\src\main\java\org\apache\uima\ducc\transport\event\common\IDuccJobDeployment.java:33:
warning - Tag @link: reference not found: JavaCommandLine
[WARNING] F:\hudson\hudson-slave\workspace\UIMA-DUCC\trunk\uima-ducc-transport\src\main\java\org\apache\uima\ducc\transport\event\common\IDuccJobDeployment.java:38:
warning - Tag @link: reference not found: JavaCommandLine
[WARNING] F:\hudson\hudson-slave\workspace\UIMA-DUCC\trunk\uima-ducc-transport\src\main\java\org\apache\uima\ducc\transport\event\common\JobManagerStateReconciler.java:103:
warning - @param argument "newJobsMap" is not a parameter name.
[WARNING] F:\hudson\hudson-slave\workspace\UIMA-DUCC\trunk\uima-ducc-transport\src\main\java\org\apache\uima\ducc\transport\event\common\JobManagerStateReconciler.java:110:
warning - @param argument "removedJobsMap" is not a parameter name.
[WARNING] F:\hudson\hudson-slave\workspace\UIMA-DUCC\trunk\uima-ducc-transport\src\main\java\org\apache\uima\ducc\transport\event\common\JobManagerStateReconciler.java:137:
warning - @param argument "newJobProcessMap" is not a parameter name.
[WARNING] F:\hudson\hudson-slave\workspace\UIMA-DUCC\trunk\uima-ducc-transport\src\main\java\org\apache\uima\ducc\transport\event\common\JobManagerStateReconciler.java:137:
warning - @param argument "newJobProcessMapToUpdate" is not a parameter name.
[WARNING] F:\hudson\hudson-slave\workspace\UIMA-DUCC\trunk\uima-ducc-transport\src\main\java\org\apache\uima\ducc\transport\event\common\JobManagerStateReconciler.java:145:
warning - @param argument "removedJobProcessMap" is not a parameter name.
[WARNING] F:\hudson\hudson-slave\workspace\UIMA-DUCC\trunk\uima-ducc-transport\src\main\java\org\apache\uima\ducc\transport\event\common\JobManagerStateReconciler.java:145:
warning - @param argument "newJobProcessMapToUpdate" is not a parameter name.
[INFO] Fixed Javadoc frame injection vulnerability (CVE-2013-1571) in 1 files.
[JENKINS] Archiving  javadoc
[INFO]                                                                         
[INFO] ------------------------------------------------------------------------
[INFO] Building Apache UIMA DUCC: uima-ducc-cli 1.0.1-SNAPSHOT
[INFO] ------------------------------------------------------------------------
[INFO] 
[INFO] --- maven-clean-plugin:2.5:clean (default-clean) @ uima-ducc-cli ---
[TASKS] Scanning folder 'F:\hudson\hudson-slave\workspace\UIMA-DUCC\trunk\uima-ducc-cli' for
files matching the pattern '**/*.java' - excludes: 
[TASKS] Found 45 files to scan for tasks
Found 8 open tasks.
[TASKS] Computing warning deltas based on reference build #169
[INFO] 
[INFO] --- maven-enforcer-plugin:1.3:enforce (enforce-versions) @ uima-ducc-cli ---
[INFO] 
[INFO] --- build-helper-maven-plugin:1.7:parse-version (parse-project-version) @ uima-ducc-cli
---
[INFO] 
[INFO] --- uima-build-helper-maven-plugin:7:parse-date-time (set buildYear and buildMonth)
@ uima-ducc-cli ---
[INFO] 
[INFO] --- maven-remote-resources-plugin:1.4:process (default) @ uima-ducc-cli ---
[INFO] 
[INFO] --- maven-resources-plugin:2.6:resources (default-resources) @ uima-ducc-cli ---
[INFO] Using 'UTF-8' encoding to copy filtered resources.
[INFO] Copying 0 resource
[INFO] Copying 3 resources
[INFO] 
[INFO] --- maven-compiler-plugin:2.5.1:compile (default-compile) @ uima-ducc-cli ---
[INFO] Compiling 43 source files to F:\hudson\hudson-slave\workspace\UIMA-DUCC\trunk\uima-ducc-cli\target\classes
[INFO] -------------------------------------------------------------
[ERROR] COMPILATION ERROR : 
[INFO] -------------------------------------------------------------
[ERROR] F:\hudson\hudson-slave\workspace\UIMA-DUCC\trunk\uima-ducc-cli\src\main\java\org\apache\uima\ducc\cli\DuccServiceApi.java:[261,58]
cannot find symbol
symbol  : variable ProcessDebugHost
location: class org.apache.uima.ducc.cli.IUiOptions.UiOption
[ERROR] F:\hudson\hudson-slave\workspace\UIMA-DUCC\trunk\uima-ducc-cli\src\main\java\org\apache\uima\ducc\cli\DuccServiceApi.java:[263,34]
cannot find symbol
symbol  : variable ProcessDebugHost
location: class org.apache.uima.ducc.cli.IUiOptions.UiOption
[ERROR] F:\hudson\hudson-slave\workspace\UIMA-DUCC\trunk\uima-ducc-cli\src\main\java\org\apache\uima\ducc\cli\DuccServiceSubmit.java:[62,16]
cannot find symbol
symbol  : variable ProcessDebugHost
location: class org.apache.uima.ducc.cli.IUiOptions.UiOption
[ERROR] F:\hudson\hudson-slave\workspace\UIMA-DUCC\trunk\uima-ducc-cli\src\main\java\org\apache\uima\ducc\cli\DuccServiceSubmit.java:[132,55]
cannot find symbol
symbol  : variable ProcessDebugHost
location: class org.apache.uima.ducc.cli.IUiOptions.UiOption
[INFO] 4 errors 
[INFO] -------------------------------------------------------------
[INFO] ------------------------------------------------------------------------
[INFO] Reactor Summary:
[INFO] 
[INFO] uima-ducc-parent .................................. SUCCESS [3:48.990s]
[INFO] Apache UIMA DUCC: uima-ducc-common ................ SUCCESS [3:28.722s]
[INFO] Apache UIMA DUCC: uima-ducc-transport ............. SUCCESS [3:01.460s]
[INFO] Apache UIMA DUCC: uima-ducc-cli ................... FAILURE [45.342s]
[INFO] Apache UIMA DUCC: uima-ducc-jd .................... SKIPPED
[INFO] Apache UIMA DUCC: uima-ducc-pm .................... SKIPPED
[INFO] Apache UIMA DUCC: uima-ducc-rm .................... SKIPPED
[INFO] Apache UIMA DUCC: uima-ducc-sm .................... SKIPPED
[INFO] Apache UIMA DUCC: uima-ducc-orchestrator .......... SKIPPED
[INFO] Apache UIMA DUCC: uima-ducc-agent ................. SKIPPED
[INFO] uima-ducc-duccdocs ................................ SKIPPED
[INFO] Apache UIMA DUCC: uima-ducc-web ................... SKIPPED
[INFO] Apache UIMA DUCC: uima-ducc-examples .............. SKIPPED
[INFO] Apache UIMA DUCC: uima-ducc-db .................... SKIPPED
[INFO] uima-ducc-spawn ................................... SKIPPED
[INFO] Apache UIMA-DUCC: uima-ducc ....................... SKIPPED
[INFO] ------------------------------------------------------------------------
[INFO] BUILD FAILURE
[INFO] ------------------------------------------------------------------------
[INFO] Total time: 11:29.549s
[INFO] Finished at: Wed Apr 09 20:59:29 BST 2014
[INFO] Final Memory: 64M/204M
[INFO] ------------------------------------------------------------------------
Waiting for Jenkins to finish collecting data
[ERROR] Failed to execute goal org.apache.maven.plugins:maven-compiler-plugin:2.5.1:compile
(default-compile) on project uima-ducc-cli: Compilation failure: Compilation failure:
[ERROR] F:\hudson\hudson-slave\workspace\UIMA-DUCC\trunk\uima-ducc-cli\src\main\java\org\apache\uima\ducc\cli\DuccServiceApi.java:[261,58]
cannot find symbol
[ERROR] symbol  : variable ProcessDebugHost
[ERROR] location: class org.apache.uima.ducc.cli.IUiOptions.UiOption
[ERROR] F:\hudson\hudson-slave\workspace\UIMA-DUCC\trunk\uima-ducc-cli\src\main\java\org\apache\uima\ducc\cli\DuccServiceApi.java:[263,34]
cannot find symbol
[ERROR] symbol  : variable ProcessDebugHost
[ERROR] location: class org.apache.uima.ducc.cli.IUiOptions.UiOption
[JENKINS] Archiving F:\hudson\hudson-slave\workspace\UIMA-DUCC\trunk\uima-ducc-jd\pom.xml
to org.apache.uima/uima-ducc-jd/1.0.1-SNAPSHOT/uima-ducc-jd-1.0.1-SNAPSHOT.pom
[ERROR] F:\hudson\hudson-slave\workspace\UIMA-DUCC\trunk\uima-ducc-cli\src\main\java\org\apache\uima\ducc\cli\DuccServiceSubmit.java:[62,16]
cannot find symbol
[ERROR] symbol  : variable ProcessDebugHost
[ERROR] location: class org.apache.uima.ducc.cli.IUiOptions.UiOption
[ERROR] F:\hudson\hudson-slave\workspace\UIMA-DUCC\trunk\uima-ducc-cli\src\main\java\org\apache\uima\ducc\cli\DuccServiceSubmit.java:[132,55]
cannot find symbol
[ERROR] symbol  : variable ProcessDebugHost
[ERROR] location: class org.apache.uima.ducc.cli.IUiOptions.UiOption
[ERROR] -> [Help 1]
[ERROR] 
[ERROR] To see the full stack trace of the errors, re-run Maven with the -e switch.
[ERROR] Re-run Maven using the -X switch to enable full debug logging.
[ERROR] 
[ERROR] For more information about the errors and possible solutions, please read the following
articles:
[ERROR] [Help 1] http://cwiki.apache.org/confluence/display/MAVEN/MojoFailureException
[ERROR] 
[ERROR] After correcting the problems, you can resume the build with the command
[ERROR]   mvn <goals> -rf :uima-ducc-cli
[JENKINS] Archiving F:\hudson\hudson-slave\workspace\UIMA-DUCC\trunk\uima-ducc-sm\pom.xml
to org.apache.uima/uima-ducc-sm/1.0.1-SNAPSHOT/uima-ducc-sm-1.0.1-SNAPSHOT.pom
[JENKINS] Archiving F:\hudson\hudson-slave\workspace\UIMA-DUCC\trunk\uima-ducc-parent\pom.xml
to org.apache.uima/uima-ducc-parent/1.0.1-SNAPSHOT/uima-ducc-parent-1.0.1-SNAPSHOT.pom
[JENKINS] Archiving F:\hudson\hudson-slave\workspace\UIMA-DUCC\trunk\uima-ducc-duccdocs\pom.xml
to org.apache.uima/uima-ducc-duccdocs/1.0.1-SNAPSHOT/uima-ducc-duccdocs-1.0.1-SNAPSHOT.pom
[JENKINS] Archiving F:\hudson\hudson-slave\workspace\UIMA-DUCC\trunk\uima-ducc-pm\pom.xml
to org.apache.uima/uima-ducc-pm/1.0.1-SNAPSHOT/uima-ducc-pm-1.0.1-SNAPSHOT.pom
[JENKINS] Archiving F:\hudson\hudson-slave\workspace\UIMA-DUCC\trunk\uima-ducc-db\pom.xml
to org.apache.uima/uima-ducc-db/1.0.1-SNAPSHOT/uima-ducc-db-1.0.1-SNAPSHOT.pom
[JENKINS] Archiving F:\hudson\hudson-slave\workspace\UIMA-DUCC\trunk\uima-ducc-rm\pom.xml
to org.apache.uima/uima-ducc-rm/1.0.1-SNAPSHOT/uima-ducc-rm-1.0.1-SNAPSHOT.pom
[JENKINS] Archiving F:\hudson\hudson-slave\workspace\UIMA-DUCC\trunk\uima-ducc-examples\pom.xml
to org.apache.uima/uima-ducc-examples/1.0.1-SNAPSHOT/uima-ducc-examples-1.0.1-SNAPSHOT.pom
[JENKINS] Archiving F:\hudson\hudson-slave\workspace\UIMA-DUCC\trunk\uima-ducc-web\pom.xml
to org.apache.uima/uima-ducc-web/1.0.1-SNAPSHOT/uima-ducc-web-1.0.1-SNAPSHOT.pom
[JENKINS] Archiving F:\hudson\hudson-slave\workspace\UIMA-DUCC\trunk\uima-ducc-spawn\pom.xml
to org.apache.uima/uima-ducc-spawn/1.0.1-SNAPSHOT/uima-ducc-spawn-1.0.1-SNAPSHOT.pom
[JENKINS] Archiving F:\hudson\hudson-slave\workspace\UIMA-DUCC\trunk\uima-ducc-common\pom.xml
to org.apache.uima/uima-ducc-common/1.0.1-SNAPSHOT/uima-ducc-common-1.0.1-SNAPSHOT.pom
[JENKINS] Archiving F:\hudson\hudson-slave\workspace\UIMA-DUCC\trunk\uima-ducc-common\target\uima-ducc-common-1.0.1-SNAPSHOT.jar
to org.apache.uima/uima-ducc-common/1.0.1-SNAPSHOT/uima-ducc-common-1.0.1-SNAPSHOT.jar
[JENKINS] Archiving <https://builds.apache.org/job/UIMA-DUCC/ws/trunk\pom.xml> to org.apache.uima/uima-ducc/1.0.1-SNAPSHOT/uima-ducc-1.0.1-SNAPSHOT.pom
[JENKINS] Archiving F:\hudson\hudson-slave\workspace\UIMA-DUCC\trunk\uima-ducc-agent\pom.xml
to org.apache.uima/uima-ducc-agent/1.0.1-SNAPSHOT/uima-ducc-agent-1.0.1-SNAPSHOT.pom
[JENKINS] Archiving F:\hudson\hudson-slave\workspace\UIMA-DUCC\trunk\uima-ducc-orchestrator\pom.xml
to org.apache.uima/uima-ducc-orchestrator/1.0.1-SNAPSHOT/uima-ducc-orchestrator-1.0.1-SNAPSHOT.pom
[JENKINS] Archiving F:\hudson\hudson-slave\workspace\UIMA-DUCC\trunk\uima-ducc-transport\pom.xml
to org.apache.uima/uima-ducc-transport/1.0.1-SNAPSHOT/uima-ducc-transport-1.0.1-SNAPSHOT.pom
[JENKINS] Archiving F:\hudson\hudson-slave\workspace\UIMA-DUCC\trunk\uima-ducc-transport\target\uima-ducc-transport-1.0.1-SNAPSHOT.jar
to org.apache.uima/uima-ducc-transport/1.0.1-SNAPSHOT/uima-ducc-transport-1.0.1-SNAPSHOT.jar
[JENKINS] Archiving F:\hudson\hudson-slave\workspace\UIMA-DUCC\trunk\uima-ducc-cli\pom.xml
to org.apache.uima/uima-ducc-cli/1.0.1-SNAPSHOT/uima-ducc-cli-1.0.1-SNAPSHOT.pom
Sending e-mails to: dev@uima.apache.org
channel stopped
[WARNINGS] Skipping publisher since build result is FAILURE

Mime
View raw message