uima-dev mailing list archives

Site index · List index
Message view « Date » · « Thread »
Top « Date » · « Thread »
From Apache Jenkins Server <jenk...@builds.apache.org>
Subject Build failed in Jenkins: UIMA-uimaFIT_java8 #22
Date Wed, 11 Jun 2014 22:04:00 GMT
See <https://builds.apache.org/job/UIMA-uimaFIT_java8/22/changes>

Changes:

[rec] [UIMA-3845] Prepare for release version 2.1.0
- Add standard boilerplate
- Remove unnecessary/redundant boilerplate from dependencies
- Removed passage about Spring Framework is licensed under Apache License, because this is
already in the LICENSE
- Removed passage inherited from Spring Framework NOTICE about inclusion of subcomponents
with separate copyright terms. According to Apache guidelines, all bundled copyright/license/notice
information must be aggregated in this file and the accompanying LICENSE file
- Removed mention of copyright.txt in section about AnnotationLiteral.java because we only
copied this one file and not the whole cdi-api/JBoss distribution. Copyright/author information
is present in the AnnotationLiteral.java file and in the present NOTICE file

[rec] [No Jira] Update Java level settings in Eclipse metadata

[rec] [UIMA-3885] Remove redundant configuration items
- buildnumber-maven-plugin was a stopgap while the UIMA build-helper plugin didn't work. No
longer required.

[rec] [UIMA-3885] Remove redundant configuration items

[rec] UIMA-3885 - Remove configuration items moved to parent-pom 10
- removed code quality profiles (cf. UIMA-2548)
- removed Java level settings

------------------------------------------
[...truncated 2286 lines...]
     [java]       At edu.umd.cs.findbugs.FindBugs2.setAppClassList(FindBugs2.java:997)
     [java]       At edu.umd.cs.findbugs.FindBugs2.execute(FindBugs2.java:225)
     [java]       At edu.umd.cs.findbugs.FindBugs.runMain(FindBugs.java:393)
     [java]       At edu.umd.cs.findbugs.FindBugs2.main(FindBugs2.java:1317)
     [java]   Couldn't get class info for java/util/function/BiConsumer
     [java]     java.lang.ArrayIndexOutOfBoundsException: 26947
     [java]       At org.objectweb.asm.ClassReader.readClass(Unknown Source)
     [java]       At org.objectweb.asm.ClassReader.accept(Unknown Source)
     [java]       At edu.umd.cs.findbugs.asm.FBClassReader.accept(FBClassReader.java:44)
     [java]       At org.objectweb.asm.ClassReader.accept(Unknown Source)
     [java]       At edu.umd.cs.findbugs.classfile.engine.ClassParserUsingASM.parse(ClassParserUsingASM.java:110)
     [java]       At edu.umd.cs.findbugs.classfile.engine.ClassParserUsingASM.parse(ClassParserUsingASM.java:587)
     [java]       At edu.umd.cs.findbugs.classfile.engine.ClassInfoAnalysisEngine.analyze(ClassInfoAnalysisEngine.java:76)
     [java]       At edu.umd.cs.findbugs.classfile.engine.ClassInfoAnalysisEngine.analyze(ClassInfoAnalysisEngine.java:38)
     [java]       At edu.umd.cs.findbugs.classfile.impl.AnalysisCache.getClassAnalysis(AnalysisCache.java:268)
     [java]       At edu.umd.cs.findbugs.ba.XFactory.getXClass(XFactory.java:652)
     [java]       At edu.umd.cs.findbugs.ba.AnalysisContext.setAppClassList(AnalysisContext.java:932)
     [java]       At edu.umd.cs.findbugs.FindBugs2.setAppClassList(FindBugs2.java:997)
     [java]       At edu.umd.cs.findbugs.FindBugs2.execute(FindBugs2.java:225)
     [java]       At edu.umd.cs.findbugs.FindBugs.runMain(FindBugs.java:393)
     [java]       At edu.umd.cs.findbugs.FindBugs2.main(FindBugs2.java:1317)
     [java]   Couldn't get class info for java/util/function/BiFunction
     [java]     java.lang.ArrayIndexOutOfBoundsException: 26950
     [java]       At org.objectweb.asm.ClassReader.readClass(Unknown Source)
     [java]       At org.objectweb.asm.ClassReader.accept(Unknown Source)
     [java]       At edu.umd.cs.findbugs.asm.FBClassReader.accept(FBClassReader.java:44)
     [java]       At org.objectweb.asm.ClassReader.accept(Unknown Source)
     [java]       At edu.umd.cs.findbugs.classfile.engine.ClassParserUsingASM.parse(ClassParserUsingASM.java:110)
     [java]       At edu.umd.cs.findbugs.classfile.engine.ClassParserUsingASM.parse(ClassParserUsingASM.java:587)
     [java]       At edu.umd.cs.findbugs.classfile.engine.ClassInfoAnalysisEngine.analyze(ClassInfoAnalysisEngine.java:76)
     [java]       At edu.umd.cs.findbugs.classfile.engine.ClassInfoAnalysisEngine.analyze(ClassInfoAnalysisEngine.java:38)
     [java]       At edu.umd.cs.findbugs.classfile.impl.AnalysisCache.getClassAnalysis(AnalysisCache.java:268)
     [java]       At edu.umd.cs.findbugs.ba.XFactory.getXClass(XFactory.java:652)
     [java]       At edu.umd.cs.findbugs.ba.AnalysisContext.setAppClassList(AnalysisContext.java:932)
     [java]       At edu.umd.cs.findbugs.FindBugs2.setAppClassList(FindBugs2.java:997)
     [java]       At edu.umd.cs.findbugs.FindBugs2.execute(FindBugs2.java:225)
     [java]       At edu.umd.cs.findbugs.FindBugs.runMain(FindBugs.java:393)
     [java]       At edu.umd.cs.findbugs.FindBugs2.main(FindBugs2.java:1317)
     [java]   Couldn't get class info for java/util/function/Predicate
     [java]     java.lang.ArrayIndexOutOfBoundsException: 512
     [java]       At org.objectweb.asm.ClassReader.readClass(Unknown Source)
     [java]       At org.objectweb.asm.ClassReader.accept(Unknown Source)
     [java]       At edu.umd.cs.findbugs.asm.FBClassReader.accept(FBClassReader.java:44)
     [java]       At org.objectweb.asm.ClassReader.accept(Unknown Source)
     [java]       At edu.umd.cs.findbugs.classfile.engine.ClassParserUsingASM.parse(ClassParserUsingASM.java:110)
     [java]       At edu.umd.cs.findbugs.classfile.engine.ClassParserUsingASM.parse(ClassParserUsingASM.java:587)
     [java]       At edu.umd.cs.findbugs.classfile.engine.ClassInfoAnalysisEngine.analyze(ClassInfoAnalysisEngine.java:76)
     [java]       At edu.umd.cs.findbugs.classfile.engine.ClassInfoAnalysisEngine.analyze(ClassInfoAnalysisEngine.java:38)
     [java]       At edu.umd.cs.findbugs.classfile.impl.AnalysisCache.getClassAnalysis(AnalysisCache.java:268)
     [java]       At edu.umd.cs.findbugs.ba.XFactory.getXClass(XFactory.java:652)
     [java]       At edu.umd.cs.findbugs.ba.AnalysisContext.setAppClassList(AnalysisContext.java:932)
     [java]       At edu.umd.cs.findbugs.FindBugs2.setAppClassList(FindBugs2.java:997)
     [java]       At edu.umd.cs.findbugs.FindBugs2.execute(FindBugs2.java:225)
     [java]       At edu.umd.cs.findbugs.FindBugs.runMain(FindBugs.java:393)
     [java]       At edu.umd.cs.findbugs.FindBugs2.main(FindBugs2.java:1317)
     [java]   Couldn't get class info for java/util/Map$Entry
     [java]     java.lang.ArrayIndexOutOfBoundsException: 9216
     [java]       At org.objectweb.asm.ClassReader.readClass(Unknown Source)
     [java]       At org.objectweb.asm.ClassReader.accept(Unknown Source)
     [java]       At edu.umd.cs.findbugs.asm.FBClassReader.accept(FBClassReader.java:44)
     [java]       At org.objectweb.asm.ClassReader.accept(Unknown Source)
     [java]       At edu.umd.cs.findbugs.classfile.engine.ClassParserUsingASM.parse(ClassParserUsingASM.java:110)
     [java]       At edu.umd.cs.findbugs.classfile.engine.ClassParserUsingASM.parse(ClassParserUsingASM.java:587)
     [java]       At edu.umd.cs.findbugs.classfile.engine.ClassInfoAnalysisEngine.analyze(ClassInfoAnalysisEngine.java:76)
     [java]       At edu.umd.cs.findbugs.classfile.engine.ClassInfoAnalysisEngine.analyze(ClassInfoAnalysisEngine.java:38)
     [java]       At edu.umd.cs.findbugs.classfile.impl.AnalysisCache.getClassAnalysis(AnalysisCache.java:268)
     [java]       At edu.umd.cs.findbugs.ba.XFactory.getXClass(XFactory.java:652)
     [java]       At edu.umd.cs.findbugs.ba.ch.Subtypes2.addInheritanceEdge(Subtypes2.java:1260)
     [java]       At edu.umd.cs.findbugs.ba.ch.Subtypes2.addSupertypeEdges(Subtypes2.java:1233)
     [java]       At edu.umd.cs.findbugs.ba.ch.Subtypes2.addClassAndGetClassVertex(Subtypes2.java:275)
     [java]       At edu.umd.cs.findbugs.ba.ch.Subtypes2.addClass(Subtypes2.java:244)
     [java]       At edu.umd.cs.findbugs.ba.AnalysisContext.setAppClassList(AnalysisContext.java:941)
     [java]       At edu.umd.cs.findbugs.FindBugs2.setAppClassList(FindBugs2.java:997)
     [java]       At edu.umd.cs.findbugs.FindBugs2.execute(FindBugs2.java:225)
     [java]       At edu.umd.cs.findbugs.FindBugs.runMain(FindBugs.java:393)
     [java]       At edu.umd.cs.findbugs.FindBugs2.main(FindBugs2.java:1317)
     [java]   Couldn't get class info for java/util/regex/Pattern
     [java]     java.lang.ArrayIndexOutOfBoundsException: 1875
     [java]       At org.objectweb.asm.ClassReader.readClass(Unknown Source)
     [java]       At org.objectweb.asm.ClassReader.accept(Unknown Source)
     [java]       At edu.umd.cs.findbugs.asm.FBClassReader.accept(FBClassReader.java:44)
     [java]       At org.objectweb.asm.ClassReader.accept(Unknown Source)
     [java]       At edu.umd.cs.findbugs.classfile.engine.ClassParserUsingASM.parse(ClassParserUsingASM.java:110)
     [java]       At edu.umd.cs.findbugs.classfile.engine.ClassParserUsingASM.parse(ClassParserUsingASM.java:587)
     [java]       At edu.umd.cs.findbugs.classfile.engine.ClassInfoAnalysisEngine.analyze(ClassInfoAnalysisEngine.java:76)
     [java]       At edu.umd.cs.findbugs.classfile.engine.ClassInfoAnalysisEngine.analyze(ClassInfoAnalysisEngine.java:38)
     [java]       At edu.umd.cs.findbugs.classfile.impl.AnalysisCache.getClassAnalysis(AnalysisCache.java:268)
     [java]       At edu.umd.cs.findbugs.ba.XFactory.getXClass(XFactory.java:652)
     [java]       At edu.umd.cs.findbugs.ba.AnalysisContext.setAppClassList(AnalysisContext.java:932)
     [java]       At edu.umd.cs.findbugs.FindBugs2.setAppClassList(FindBugs2.java:997)
     [java]       At edu.umd.cs.findbugs.FindBugs2.execute(FindBugs2.java:225)
     [java]       At edu.umd.cs.findbugs.FindBugs.runMain(FindBugs.java:393)
     [java]       At edu.umd.cs.findbugs.FindBugs2.main(FindBugs2.java:1317)
     [java]   Couldn't get class info for java/lang/CharSequence
     [java]     java.lang.ArrayIndexOutOfBoundsException: 26721
     [java]       At org.objectweb.asm.ClassReader.readClass(Unknown Source)
     [java]       At org.objectweb.asm.ClassReader.accept(Unknown Source)
     [java]       At edu.umd.cs.findbugs.asm.FBClassReader.accept(FBClassReader.java:44)
     [java]       At org.objectweb.asm.ClassReader.accept(Unknown Source)
     [java]       At edu.umd.cs.findbugs.classfile.engine.ClassParserUsingASM.parse(ClassParserUsingASM.java:110)
     [java]       At edu.umd.cs.findbugs.classfile.engine.ClassParserUsingASM.parse(ClassParserUsingASM.java:587)
     [java]       At edu.umd.cs.findbugs.classfile.engine.ClassInfoAnalysisEngine.analyze(ClassInfoAnalysisEngine.java:76)
     [java]       At edu.umd.cs.findbugs.classfile.engine.ClassInfoAnalysisEngine.analyze(ClassInfoAnalysisEngine.java:38)
     [java]       At edu.umd.cs.findbugs.classfile.impl.AnalysisCache.getClassAnalysis(AnalysisCache.java:268)
     [java]       At edu.umd.cs.findbugs.ba.XFactory.getXClass(XFactory.java:652)
     [java]       At edu.umd.cs.findbugs.ba.ch.Subtypes2.addInheritanceEdge(Subtypes2.java:1260)
     [java]       At edu.umd.cs.findbugs.ba.ch.Subtypes2.addSupertypeEdges(Subtypes2.java:1233)
     [java]       At edu.umd.cs.findbugs.ba.ch.Subtypes2.addClassAndGetClassVertex(Subtypes2.java:275)
     [java]       At edu.umd.cs.findbugs.ba.ch.Subtypes2.addClass(Subtypes2.java:244)
     [java]       At edu.umd.cs.findbugs.ba.AnalysisContext.setAppClassList(AnalysisContext.java:941)
     [java]       At edu.umd.cs.findbugs.FindBugs2.setAppClassList(FindBugs2.java:997)
     [java]       At edu.umd.cs.findbugs.FindBugs2.execute(FindBugs2.java:225)
     [java]       At edu.umd.cs.findbugs.FindBugs.runMain(FindBugs.java:393)
     [java]       At edu.umd.cs.findbugs.FindBugs2.main(FindBugs2.java:1317)
     [java]   Couldn't get class info for java/util/Arrays
     [java]     java.lang.ArrayIndexOutOfBoundsException: 35328
     [java]       At org.objectweb.asm.ClassReader.accept(Unknown Source)
     [java]       At edu.umd.cs.findbugs.asm.FBClassReader.accept(FBClassReader.java:44)
     [java]       At org.objectweb.asm.ClassReader.accept(Unknown Source)
     [java]       At edu.umd.cs.findbugs.classfile.engine.ClassParserUsingASM.parse(ClassParserUsingASM.java:110)
     [java]       At edu.umd.cs.findbugs.classfile.engine.ClassParserUsingASM.parse(ClassParserUsingASM.java:587)
     [java]       At edu.umd.cs.findbugs.classfile.engine.ClassInfoAnalysisEngine.analyze(ClassInfoAnalysisEngine.java:76)
     [java]       At edu.umd.cs.findbugs.classfile.engine.ClassInfoAnalysisEngine.analyze(ClassInfoAnalysisEngine.java:38)
     [java]       At edu.umd.cs.findbugs.classfile.impl.AnalysisCache.getClassAnalysis(AnalysisCache.java:268)
     [java]       At edu.umd.cs.findbugs.ba.XFactory.getXClass(XFactory.java:652)
     [java]       At edu.umd.cs.findbugs.ba.AnalysisContext.setAppClassList(AnalysisContext.java:932)
     [java]       At edu.umd.cs.findbugs.FindBugs2.setAppClassList(FindBugs2.java:997)
     [java]       At edu.umd.cs.findbugs.FindBugs2.execute(FindBugs2.java:225)
     [java]       At edu.umd.cs.findbugs.FindBugs.runMain(FindBugs.java:393)
     [java]       At edu.umd.cs.findbugs.FindBugs2.main(FindBugs2.java:1317)
     [java] Exception in thread "main" java.lang.ArrayIndexOutOfBoundsException: 35328
     [java] 	at org.objectweb.asm.ClassReader.accept(Unknown Source)
     [java] 	at edu.umd.cs.findbugs.asm.FBClassReader.accept(FBClassReader.java:44)
     [java] 	at org.objectweb.asm.ClassReader.accept(Unknown Source)
     [java] 	at edu.umd.cs.findbugs.classfile.engine.ClassParserUsingASM.parse(ClassParserUsingASM.java:110)
     [java] 	at edu.umd.cs.findbugs.classfile.engine.ClassParserUsingASM.parse(ClassParserUsingASM.java:587)
     [java] 	at edu.umd.cs.findbugs.classfile.engine.ClassInfoAnalysisEngine.analyze(ClassInfoAnalysisEngine.java:76)
     [java] 	at edu.umd.cs.findbugs.classfile.engine.ClassInfoAnalysisEngine.analyze(ClassInfoAnalysisEngine.java:38)
     [java] 	at edu.umd.cs.findbugs.classfile.impl.AnalysisCache.getClassAnalysis(AnalysisCache.java:268)
     [java] 	at edu.umd.cs.findbugs.ba.XFactory.getXClass(XFactory.java:652)
     [java] 	at edu.umd.cs.findbugs.ba.AnalysisContext.setAppClassList(AnalysisContext.java:932)
     [java] 	at edu.umd.cs.findbugs.FindBugs2.setAppClassList(FindBugs2.java:997)
     [java] 	at edu.umd.cs.findbugs.FindBugs2.execute(FindBugs2.java:225)
     [java] 	at edu.umd.cs.findbugs.FindBugs.runMain(FindBugs.java:393)
     [java] 	at edu.umd.cs.findbugs.FindBugs2.main(FindBugs2.java:1317)
[FINDBUGS] No report found for mojo findbugs
[INFO]                                                                         
[INFO] ------------------------------------------------------------------------
[INFO] Skipping Apache UIMA uimaFIT
[INFO] This project has been banned from the build due to previous failures.
[INFO] ------------------------------------------------------------------------
[INFO] ------------------------------------------------------------------------
[INFO] Reactor Summary:
[INFO] 
[INFO] Apache UIMA uimaFIT - Parent ...................... SUCCESS [43.815s]
[INFO] Apache UIMA uimaFIT - Core ........................ FAILURE [38.699s]
[INFO] Apache UIMA uimaFIT - Examples .................... SKIPPED
[INFO] Apache UIMA uimaFIT - Spring integration .......... SKIPPED
[INFO] Apache UIMA uimaFIT - Maven Plugin ................ SKIPPED
[INFO] Apache UIMA uimaFIT - Legacy uimaFIT support ...... SKIPPED
[INFO] Apache UIMA uimaFIT - Documentation ............... SKIPPED
[INFO] Apache UIMA uimaFIT - Collection Processing Engine support  SKIPPED
[INFO] Apache UIMA uimaFIT ............................... SKIPPED
[INFO] ------------------------------------------------------------------------
[INFO] BUILD FAILURE
[INFO] ------------------------------------------------------------------------
[INFO] Total time: 1:26.155s
[INFO] Finished at: Wed Jun 11 22:03:46 UTC 2014
[INFO] Final Memory: 49M/131M
[INFO] ------------------------------------------------------------------------
Waiting for Jenkins to finish collecting data
[ERROR] Failed to execute goal org.codehaus.mojo:findbugs-maven-plugin:2.5.4:findbugs (default)
on project uimafit-core: Execution default of goal org.codehaus.mojo:findbugs-maven-plugin:2.5.4:findbugs
failed: Java returned: 1 -> [Help 1]
[ERROR] 
[ERROR] To see the full stack trace of the errors, re-run Maven with the -e switch.
[ERROR] Re-run Maven using the -X switch to enable full debug logging.
[ERROR] 
[ERROR] For more information about the errors and possible solutions, please read the following
articles:
[ERROR] [Help 1] http://cwiki.apache.org/confluence/display/MAVEN/PluginExecutionException
[ERROR] 
[ERROR] After correcting the problems, you can resume the build with the command
[ERROR]   mvn <goals> -rf :uimafit-core
[JENKINS] Archiving <https://builds.apache.org/job/UIMA-uimaFIT_java8/ws/trunk/uimafit-maven-plugin/pom.xml>
to org.apache.uima/uimafit-maven-plugin/2.2.0-SNAPSHOT/uimafit-maven-plugin-2.2.0-SNAPSHOT.pom
Sending artifact delta relative to UIMA-uimaFIT_java8 ? Apache UIMA uimaFIT - Maven Plugin
#21
Archived 1 artifacts
Archive block size is 32768
Received 0 blocks and 5522 bytes
Compression is 0.0%
Took 25 ms
[JENKINS] Archiving <https://builds.apache.org/job/UIMA-uimaFIT_java8/ws/trunk/uimafit-spring/pom.xml>
to org.apache.uima/uimafit-spring/2.2.0-SNAPSHOT/uimafit-spring-2.2.0-SNAPSHOT.pom
Sending artifact delta relative to UIMA-uimaFIT_java8 ? Apache UIMA uimaFIT - Spring integration
#21
Archived 1 artifacts
Archive block size is 32768
Received 0 blocks and 2282 bytes
Compression is 0.0%
Took 28 ms
[JENKINS] Archiving <https://builds.apache.org/job/UIMA-uimaFIT_java8/ws/trunk/uimafit-examples/pom.xml>
to org.apache.uima/uimafit-examples/2.2.0-SNAPSHOT/uimafit-examples-2.2.0-SNAPSHOT.pom
Sending artifact delta relative to UIMA-uimaFIT_java8 ? Apache UIMA uimaFIT - Examples #21
Archived 1 artifacts
Archive block size is 32768
Received 0 blocks and 3753 bytes
Compression is 0.0%
Took 19 ms
[JENKINS] Archiving <https://builds.apache.org/job/UIMA-uimaFIT_java8/ws/trunk/uimafit-cpe/pom.xml>
to org.apache.uima/uimafit-cpe/2.2.0-SNAPSHOT/uimafit-cpe-2.2.0-SNAPSHOT.pom
Sending artifact delta relative to UIMA-uimaFIT_java8 ? Apache UIMA uimaFIT - Collection Processing
Engine support #21
Archived 1 artifacts
Archive block size is 32768
Received 0 blocks and 1942 bytes
Compression is 0.0%
Took 7 ms
[JENKINS] Archiving <https://builds.apache.org/job/UIMA-uimaFIT_java8/ws/trunk/uimafit-docbook/pom.xml>
to org.apache.uima/uimafit-docbook/2.2.0-SNAPSHOT/uimafit-docbook-2.2.0-SNAPSHOT.pom
Sending artifact delta relative to UIMA-uimaFIT_java8 ? Apache UIMA uimaFIT - Documentation
#21
Archived 1 artifacts
Archive block size is 32768
Received 0 blocks and 1597 bytes
Compression is 0.0%
Took 0.18 sec
[JENKINS] Archiving <https://builds.apache.org/job/UIMA-uimaFIT_java8/ws/trunk/uimafit-legacy-support/pom.xml>
to org.apache.uima/uimafit-legacy-support/2.2.0-SNAPSHOT/uimafit-legacy-support-2.2.0-SNAPSHOT.pom
Sending artifact delta relative to UIMA-uimaFIT_java8 ? Apache UIMA uimaFIT - Legacy uimaFIT
support #21
Archived 1 artifacts
Archive block size is 32768
Received 0 blocks and 5073 bytes
Compression is 0.0%
Took 14 ms
[JENKINS] Archiving <https://builds.apache.org/job/UIMA-uimaFIT_java8/ws/trunk/uimafit-parent/pom.xml>
to org.apache.uima/uimafit-parent/2.2.0-SNAPSHOT/uimafit-parent-2.2.0-SNAPSHOT.pom
Sending artifact delta relative to UIMA-uimaFIT_java8 ? Apache UIMA uimaFIT - Parent #21
Archived 1 artifacts
Archive block size is 32768
Received 0 blocks and 6236 bytes
Compression is 0.0%
Took 7 ms
[JENKINS] Archiving <https://builds.apache.org/job/UIMA-uimaFIT_java8/ws/trunk/uimafit-core/pom.xml>
to org.apache.uima/uimafit-core/2.2.0-SNAPSHOT/uimafit-core-2.2.0-SNAPSHOT.pom
[JENKINS] Archiving <https://builds.apache.org/job/UIMA-uimaFIT_java8/ws/trunk/uimafit-core/target/uimafit-core-2.2.0-SNAPSHOT.jar>
to org.apache.uima/uimafit-core/2.2.0-SNAPSHOT/uimafit-core-2.2.0-SNAPSHOT.jar
Sending artifact delta relative to UIMA-uimaFIT_java8 ? Apache UIMA uimaFIT - Core #21
Archived 2 artifacts
Archive block size is 32768
Received 0 blocks and 167820 bytes
Compression is 0.0%
Took 42 ms
[JENKINS] Archiving <https://builds.apache.org/job/UIMA-uimaFIT_java8/ws/trunk/pom.xml>
to org.apache.uima/uimafit/2.2.0-SNAPSHOT/uimafit-2.2.0-SNAPSHOT.pom
Sending artifact delta relative to UIMA-uimaFIT_java8 ? Apache UIMA uimaFIT #21
Archived 1 artifacts
Archive block size is 32768
Received 0 blocks and 5328 bytes
Compression is 0.0%
Took 0.25 sec
Sending e-mails to: dev@uima.apache.org
channel stopped
[WARNINGS] Skipping publisher since build result is FAILURE
Skipping Cobertura coverage report as build was not UNSTABLE or better ...

Mime
View raw message