uima-dev mailing list archives

Site index · List index
Message view « Date » · « Thread »
Top « Date » · « Thread »
From Apache Jenkins Server <jenk...@builds.apache.org>
Subject Build failed in Jenkins: UIMA-uimaFIT_java8 » Apache UIMA uimaFIT - Core #22
Date Wed, 11 Jun 2014 22:03:57 GMT
See <https://builds.apache.org/job/UIMA-uimaFIT_java8/org.apache.uima$uimafit-core/22/changes>

Changes:

[rec] [No Jira] Update Java level settings in Eclipse metadata

------------------------------------------
[...truncated 1436 lines...]
     [java]       At org.objectweb.asm.ClassReader.readClass(Unknown Source)
     [java]       At org.objectweb.asm.ClassReader.accept(Unknown Source)
     [java]       At edu.umd.cs.findbugs.asm.FBClassReader.accept(FBClassReader.java:44)
     [java]       At org.objectweb.asm.ClassReader.accept(Unknown Source)
     [java]       At edu.umd.cs.findbugs.classfile.engine.ClassParserUsingASM.parse(ClassParserUsingASM.java:110)
     [java]       At edu.umd.cs.findbugs.classfile.engine.ClassParserUsingASM.parse(ClassParserUsingASM.java:587)
     [java]       At edu.umd.cs.findbugs.classfile.engine.ClassInfoAnalysisEngine.analyze(ClassInfoAnalysisEngine.java:76)
     [java]       At edu.umd.cs.findbugs.classfile.engine.ClassInfoAnalysisEngine.analyze(ClassInfoAnalysisEngine.java:38)
     [java]       At edu.umd.cs.findbugs.classfile.impl.AnalysisCache.getClassAnalysis(AnalysisCache.java:268)
     [java]       At edu.umd.cs.findbugs.ba.XFactory.getXClass(XFactory.java:652)
     [java]       At edu.umd.cs.findbugs.ba.AnalysisContext.setAppClassList(AnalysisContext.java:932)
     [java]       At edu.umd.cs.findbugs.FindBugs2.setAppClassList(FindBugs2.java:997)
     [java]       At edu.umd.cs.findbugs.FindBugs2.execute(FindBugs2.java:225)
     [java]       At edu.umd.cs.findbugs.FindBugs.runMain(FindBugs.java:393)
     [java]       At edu.umd.cs.findbugs.FindBugs2.main(FindBugs2.java:1317)
     [java]   Unable to get XClass for java/lang/CharSequence
     [java]     java.lang.ArrayIndexOutOfBoundsException: 26721
     [java]       At org.objectweb.asm.ClassReader.readClass(Unknown Source)
     [java]       At org.objectweb.asm.ClassReader.accept(Unknown Source)
     [java]       At edu.umd.cs.findbugs.asm.FBClassReader.accept(FBClassReader.java:44)
     [java]       At org.objectweb.asm.ClassReader.accept(Unknown Source)
     [java]       At edu.umd.cs.findbugs.classfile.engine.ClassParserUsingASM.parse(ClassParserUsingASM.java:110)
     [java]       At edu.umd.cs.findbugs.classfile.engine.ClassParserUsingASM.parse(ClassParserUsingASM.java:587)
     [java]       At edu.umd.cs.findbugs.classfile.engine.ClassInfoAnalysisEngine.analyze(ClassInfoAnalysisEngine.java:76)
     [java]       At edu.umd.cs.findbugs.classfile.engine.ClassInfoAnalysisEngine.analyze(ClassInfoAnalysisEngine.java:38)
     [java]       At edu.umd.cs.findbugs.classfile.impl.AnalysisCache.getClassAnalysis(AnalysisCache.java:268)
     [java]       At edu.umd.cs.findbugs.ba.XFactory.getXClass(XFactory.java:652)
     [java]       At edu.umd.cs.findbugs.ba.ch.Subtypes2.addInheritanceEdge(Subtypes2.java:1260)
     [java]       At edu.umd.cs.findbugs.ba.ch.Subtypes2.addSupertypeEdges(Subtypes2.java:1233)
     [java]       At edu.umd.cs.findbugs.ba.ch.Subtypes2.addClassAndGetClassVertex(Subtypes2.java:275)
     [java]       At edu.umd.cs.findbugs.ba.ch.Subtypes2.addClass(Subtypes2.java:244)
     [java]       At edu.umd.cs.findbugs.ba.AnalysisContext.setAppClassList(AnalysisContext.java:941)
     [java]       At edu.umd.cs.findbugs.FindBugs2.setAppClassList(FindBugs2.java:997)
     [java]       At edu.umd.cs.findbugs.FindBugs2.execute(FindBugs2.java:225)
     [java]       At edu.umd.cs.findbugs.FindBugs.runMain(FindBugs.java:393)
     [java]       At edu.umd.cs.findbugs.FindBugs2.main(FindBugs2.java:1317)
     [java]   Unable to get XClass for java/lang/Class
     [java]     java.lang.ArrayIndexOutOfBoundsException: 2560
     [java]       At org.objectweb.asm.ClassReader.readClass(Unknown Source)
     [java]       At org.objectweb.asm.ClassReader.accept(Unknown Source)
     [java]       At edu.umd.cs.findbugs.asm.FBClassReader.accept(FBClassReader.java:44)
     [java]       At org.objectweb.asm.ClassReader.accept(Unknown Source)
     [java]       At edu.umd.cs.findbugs.classfile.engine.ClassParserUsingASM.parse(ClassParserUsingASM.java:110)
     [java]       At edu.umd.cs.findbugs.classfile.engine.ClassParserUsingASM.parse(ClassParserUsingASM.java:587)
     [java]       At edu.umd.cs.findbugs.classfile.engine.ClassInfoAnalysisEngine.analyze(ClassInfoAnalysisEngine.java:76)
     [java]       At edu.umd.cs.findbugs.classfile.engine.ClassInfoAnalysisEngine.analyze(ClassInfoAnalysisEngine.java:38)
     [java]       At edu.umd.cs.findbugs.classfile.impl.AnalysisCache.getClassAnalysis(AnalysisCache.java:268)
     [java]       At edu.umd.cs.findbugs.ba.XFactory.getXClass(XFactory.java:652)
     [java]       At edu.umd.cs.findbugs.ba.ch.Subtypes2.addInheritanceEdge(Subtypes2.java:1260)
     [java]       At edu.umd.cs.findbugs.ba.ch.Subtypes2.addSupertypeEdges(Subtypes2.java:1233)
     [java]       At edu.umd.cs.findbugs.ba.ch.Subtypes2.addClassAndGetClassVertex(Subtypes2.java:275)
     [java]       At edu.umd.cs.findbugs.ba.ch.Subtypes2.addClass(Subtypes2.java:244)
     [java]       At edu.umd.cs.findbugs.ba.AnalysisContext.setAppClassList(AnalysisContext.java:941)
     [java]       At edu.umd.cs.findbugs.FindBugs2.setAppClassList(FindBugs2.java:997)
     [java]       At edu.umd.cs.findbugs.FindBugs2.execute(FindBugs2.java:225)
     [java]       At edu.umd.cs.findbugs.FindBugs.runMain(FindBugs.java:393)
     [java]       At edu.umd.cs.findbugs.FindBugs2.main(FindBugs2.java:1317)
     [java]   Unable to get XClass for java/util/Arrays
     [java]     java.lang.ArrayIndexOutOfBoundsException: 35328
     [java]       At org.objectweb.asm.ClassReader.accept(Unknown Source)
     [java]       At edu.umd.cs.findbugs.asm.FBClassReader.accept(FBClassReader.java:44)
     [java]       At org.objectweb.asm.ClassReader.accept(Unknown Source)
     [java]       At edu.umd.cs.findbugs.classfile.engine.ClassParserUsingASM.parse(ClassParserUsingASM.java:110)
     [java]       At edu.umd.cs.findbugs.classfile.engine.ClassParserUsingASM.parse(ClassParserUsingASM.java:587)
     [java]       At edu.umd.cs.findbugs.classfile.engine.ClassInfoAnalysisEngine.analyze(ClassInfoAnalysisEngine.java:76)
     [java]       At edu.umd.cs.findbugs.classfile.engine.ClassInfoAnalysisEngine.analyze(ClassInfoAnalysisEngine.java:38)
     [java]       At edu.umd.cs.findbugs.classfile.impl.AnalysisCache.getClassAnalysis(AnalysisCache.java:268)
     [java]       At edu.umd.cs.findbugs.ba.XFactory.getXClass(XFactory.java:652)
     [java]       At edu.umd.cs.findbugs.ba.AnalysisContext.setAppClassList(AnalysisContext.java:932)
     [java]       At edu.umd.cs.findbugs.FindBugs2.setAppClassList(FindBugs2.java:997)
     [java]       At edu.umd.cs.findbugs.FindBugs2.execute(FindBugs2.java:225)
     [java]       At edu.umd.cs.findbugs.FindBugs.runMain(FindBugs.java:393)
     [java]       At edu.umd.cs.findbugs.FindBugs2.main(FindBugs2.java:1317)
     [java]   Couldn't get class info for java/util/function/Function
     [java]     java.lang.ArrayIndexOutOfBoundsException: 6031
     [java]       At org.objectweb.asm.ClassReader.<init>(Unknown Source)
     [java]       At org.objectweb.asm.ClassReader.<init>(Unknown Source)
     [java]       At edu.umd.cs.findbugs.asm.FBClassReader.<init>(FBClassReader.java:35)
     [java]       At edu.umd.cs.findbugs.classfile.engine.asm.ClassReaderAnalysisEngine.analyze(ClassReaderAnalysisEngine.java:47)
     [java]       At edu.umd.cs.findbugs.classfile.engine.asm.ClassReaderAnalysisEngine.analyze(ClassReaderAnalysisEngine.java:34)
     [java]       At edu.umd.cs.findbugs.classfile.impl.AnalysisCache.getClassAnalysis(AnalysisCache.java:268)
     [java]       At edu.umd.cs.findbugs.classfile.engine.ClassInfoAnalysisEngine.analyze(ClassInfoAnalysisEngine.java:72)
     [java]       At edu.umd.cs.findbugs.classfile.engine.ClassInfoAnalysisEngine.analyze(ClassInfoAnalysisEngine.java:38)
     [java]       At edu.umd.cs.findbugs.classfile.impl.AnalysisCache.getClassAnalysis(AnalysisCache.java:268)
     [java]       At edu.umd.cs.findbugs.ba.XFactory.getXClass(XFactory.java:652)
     [java]       At edu.umd.cs.findbugs.ba.AnalysisContext.setAppClassList(AnalysisContext.java:932)
     [java]       At edu.umd.cs.findbugs.FindBugs2.setAppClassList(FindBugs2.java:997)
     [java]       At edu.umd.cs.findbugs.FindBugs2.execute(FindBugs2.java:225)
     [java]       At edu.umd.cs.findbugs.FindBugs.runMain(FindBugs.java:393)
     [java]       At edu.umd.cs.findbugs.FindBugs2.main(FindBugs2.java:1317)
     [java]   Couldn't get class info for java/util/function/Consumer
     [java]     java.lang.ArrayIndexOutOfBoundsException: 28526
     [java]       At org.objectweb.asm.ClassReader.readClass(Unknown Source)
     [java]       At org.objectweb.asm.ClassReader.accept(Unknown Source)
     [java]       At edu.umd.cs.findbugs.asm.FBClassReader.accept(FBClassReader.java:44)
     [java]       At org.objectweb.asm.ClassReader.accept(Unknown Source)
     [java]       At edu.umd.cs.findbugs.classfile.engine.ClassParserUsingASM.parse(ClassParserUsingASM.java:110)
     [java]       At edu.umd.cs.findbugs.classfile.engine.ClassParserUsingASM.parse(ClassParserUsingASM.java:587)
     [java]       At edu.umd.cs.findbugs.classfile.engine.ClassInfoAnalysisEngine.analyze(ClassInfoAnalysisEngine.java:76)
     [java]       At edu.umd.cs.findbugs.classfile.engine.ClassInfoAnalysisEngine.analyze(ClassInfoAnalysisEngine.java:38)
     [java]       At edu.umd.cs.findbugs.classfile.impl.AnalysisCache.getClassAnalysis(AnalysisCache.java:268)
     [java]       At edu.umd.cs.findbugs.ba.XFactory.getXClass(XFactory.java:652)
     [java]       At edu.umd.cs.findbugs.ba.AnalysisContext.setAppClassList(AnalysisContext.java:932)
     [java]       At edu.umd.cs.findbugs.FindBugs2.setAppClassList(FindBugs2.java:997)
     [java]       At edu.umd.cs.findbugs.FindBugs2.execute(FindBugs2.java:225)
     [java]       At edu.umd.cs.findbugs.FindBugs.runMain(FindBugs.java:393)
     [java]       At edu.umd.cs.findbugs.FindBugs2.main(FindBugs2.java:1317)
     [java]   Couldn't get class info for java/util/function/BiConsumer
     [java]     java.lang.ArrayIndexOutOfBoundsException: 26947
     [java]       At org.objectweb.asm.ClassReader.readClass(Unknown Source)
     [java]       At org.objectweb.asm.ClassReader.accept(Unknown Source)
     [java]       At edu.umd.cs.findbugs.asm.FBClassReader.accept(FBClassReader.java:44)
     [java]       At org.objectweb.asm.ClassReader.accept(Unknown Source)
     [java]       At edu.umd.cs.findbugs.classfile.engine.ClassParserUsingASM.parse(ClassParserUsingASM.java:110)
     [java]       At edu.umd.cs.findbugs.classfile.engine.ClassParserUsingASM.parse(ClassParserUsingASM.java:587)
     [java]       At edu.umd.cs.findbugs.classfile.engine.ClassInfoAnalysisEngine.analyze(ClassInfoAnalysisEngine.java:76)
     [java]       At edu.umd.cs.findbugs.classfile.engine.ClassInfoAnalysisEngine.analyze(ClassInfoAnalysisEngine.java:38)
     [java]       At edu.umd.cs.findbugs.classfile.impl.AnalysisCache.getClassAnalysis(AnalysisCache.java:268)
     [java]       At edu.umd.cs.findbugs.ba.XFactory.getXClass(XFactory.java:652)
     [java]       At edu.umd.cs.findbugs.ba.AnalysisContext.setAppClassList(AnalysisContext.java:932)
     [java]       At edu.umd.cs.findbugs.FindBugs2.setAppClassList(FindBugs2.java:997)
     [java]       At edu.umd.cs.findbugs.FindBugs2.execute(FindBugs2.java:225)
     [java]       At edu.umd.cs.findbugs.FindBugs.runMain(FindBugs.java:393)
     [java]       At edu.umd.cs.findbugs.FindBugs2.main(FindBugs2.java:1317)
     [java]   Couldn't get class info for java/util/function/BiFunction
     [java]     java.lang.ArrayIndexOutOfBoundsException: 26950
     [java]       At org.objectweb.asm.ClassReader.readClass(Unknown Source)
     [java]       At org.objectweb.asm.ClassReader.accept(Unknown Source)
     [java]       At edu.umd.cs.findbugs.asm.FBClassReader.accept(FBClassReader.java:44)
     [java]       At org.objectweb.asm.ClassReader.accept(Unknown Source)
     [java]       At edu.umd.cs.findbugs.classfile.engine.ClassParserUsingASM.parse(ClassParserUsingASM.java:110)
     [java]       At edu.umd.cs.findbugs.classfile.engine.ClassParserUsingASM.parse(ClassParserUsingASM.java:587)
     [java]       At edu.umd.cs.findbugs.classfile.engine.ClassInfoAnalysisEngine.analyze(ClassInfoAnalysisEngine.java:76)
     [java]       At edu.umd.cs.findbugs.classfile.engine.ClassInfoAnalysisEngine.analyze(ClassInfoAnalysisEngine.java:38)
     [java]       At edu.umd.cs.findbugs.classfile.impl.AnalysisCache.getClassAnalysis(AnalysisCache.java:268)
     [java]       At edu.umd.cs.findbugs.ba.XFactory.getXClass(XFactory.java:652)
     [java]       At edu.umd.cs.findbugs.ba.AnalysisContext.setAppClassList(AnalysisContext.java:932)
     [java]       At edu.umd.cs.findbugs.FindBugs2.setAppClassList(FindBugs2.java:997)
     [java]       At edu.umd.cs.findbugs.FindBugs2.execute(FindBugs2.java:225)
     [java]       At edu.umd.cs.findbugs.FindBugs.runMain(FindBugs.java:393)
     [java]       At edu.umd.cs.findbugs.FindBugs2.main(FindBugs2.java:1317)
     [java]   Couldn't get class info for java/util/function/Predicate
     [java]     java.lang.ArrayIndexOutOfBoundsException: 512
     [java]       At org.objectweb.asm.ClassReader.readClass(Unknown Source)
     [java]       At org.objectweb.asm.ClassReader.accept(Unknown Source)
     [java]       At edu.umd.cs.findbugs.asm.FBClassReader.accept(FBClassReader.java:44)
     [java]       At org.objectweb.asm.ClassReader.accept(Unknown Source)
     [java]       At edu.umd.cs.findbugs.classfile.engine.ClassParserUsingASM.parse(ClassParserUsingASM.java:110)
     [java]       At edu.umd.cs.findbugs.classfile.engine.ClassParserUsingASM.parse(ClassParserUsingASM.java:587)
     [java]       At edu.umd.cs.findbugs.classfile.engine.ClassInfoAnalysisEngine.analyze(ClassInfoAnalysisEngine.java:76)
     [java]       At edu.umd.cs.findbugs.classfile.engine.ClassInfoAnalysisEngine.analyze(ClassInfoAnalysisEngine.java:38)
     [java]       At edu.umd.cs.findbugs.classfile.impl.AnalysisCache.getClassAnalysis(AnalysisCache.java:268)
     [java]       At edu.umd.cs.findbugs.ba.XFactory.getXClass(XFactory.java:652)
     [java]       At edu.umd.cs.findbugs.ba.AnalysisContext.setAppClassList(AnalysisContext.java:932)
     [java]       At edu.umd.cs.findbugs.FindBugs2.setAppClassList(FindBugs2.java:997)
     [java]       At edu.umd.cs.findbugs.FindBugs2.execute(FindBugs2.java:225)
     [java]       At edu.umd.cs.findbugs.FindBugs.runMain(FindBugs.java:393)
     [java]       At edu.umd.cs.findbugs.FindBugs2.main(FindBugs2.java:1317)
     [java]   Couldn't get class info for java/util/Map$Entry
     [java]     java.lang.ArrayIndexOutOfBoundsException: 9216
     [java]       At org.objectweb.asm.ClassReader.readClass(Unknown Source)
     [java]       At org.objectweb.asm.ClassReader.accept(Unknown Source)
     [java]       At edu.umd.cs.findbugs.asm.FBClassReader.accept(FBClassReader.java:44)
     [java]       At org.objectweb.asm.ClassReader.accept(Unknown Source)
     [java]       At edu.umd.cs.findbugs.classfile.engine.ClassParserUsingASM.parse(ClassParserUsingASM.java:110)
     [java]       At edu.umd.cs.findbugs.classfile.engine.ClassParserUsingASM.parse(ClassParserUsingASM.java:587)
     [java]       At edu.umd.cs.findbugs.classfile.engine.ClassInfoAnalysisEngine.analyze(ClassInfoAnalysisEngine.java:76)
     [java]       At edu.umd.cs.findbugs.classfile.engine.ClassInfoAnalysisEngine.analyze(ClassInfoAnalysisEngine.java:38)
     [java]       At edu.umd.cs.findbugs.classfile.impl.AnalysisCache.getClassAnalysis(AnalysisCache.java:268)
     [java]       At edu.umd.cs.findbugs.ba.XFactory.getXClass(XFactory.java:652)
     [java]       At edu.umd.cs.findbugs.ba.ch.Subtypes2.addInheritanceEdge(Subtypes2.java:1260)
     [java]       At edu.umd.cs.findbugs.ba.ch.Subtypes2.addSupertypeEdges(Subtypes2.java:1233)
     [java]       At edu.umd.cs.findbugs.ba.ch.Subtypes2.addClassAndGetClassVertex(Subtypes2.java:275)
     [java]       At edu.umd.cs.findbugs.ba.ch.Subtypes2.addClass(Subtypes2.java:244)
     [java]       At edu.umd.cs.findbugs.ba.AnalysisContext.setAppClassList(AnalysisContext.java:941)
     [java]       At edu.umd.cs.findbugs.FindBugs2.setAppClassList(FindBugs2.java:997)
     [java]       At edu.umd.cs.findbugs.FindBugs2.execute(FindBugs2.java:225)
     [java]       At edu.umd.cs.findbugs.FindBugs.runMain(FindBugs.java:393)
     [java]       At edu.umd.cs.findbugs.FindBugs2.main(FindBugs2.java:1317)
     [java]   Couldn't get class info for java/util/regex/Pattern
     [java]     java.lang.ArrayIndexOutOfBoundsException: 1875
     [java]       At org.objectweb.asm.ClassReader.readClass(Unknown Source)
     [java]       At org.objectweb.asm.ClassReader.accept(Unknown Source)
     [java]       At edu.umd.cs.findbugs.asm.FBClassReader.accept(FBClassReader.java:44)
     [java]       At org.objectweb.asm.ClassReader.accept(Unknown Source)
     [java]       At edu.umd.cs.findbugs.classfile.engine.ClassParserUsingASM.parse(ClassParserUsingASM.java:110)
     [java]       At edu.umd.cs.findbugs.classfile.engine.ClassParserUsingASM.parse(ClassParserUsingASM.java:587)
     [java]       At edu.umd.cs.findbugs.classfile.engine.ClassInfoAnalysisEngine.analyze(ClassInfoAnalysisEngine.java:76)
     [java]       At edu.umd.cs.findbugs.classfile.engine.ClassInfoAnalysisEngine.analyze(ClassInfoAnalysisEngine.java:38)
     [java]       At edu.umd.cs.findbugs.classfile.impl.AnalysisCache.getClassAnalysis(AnalysisCache.java:268)
     [java]       At edu.umd.cs.findbugs.ba.XFactory.getXClass(XFactory.java:652)
     [java]       At edu.umd.cs.findbugs.ba.AnalysisContext.setAppClassList(AnalysisContext.java:932)
     [java]       At edu.umd.cs.findbugs.FindBugs2.setAppClassList(FindBugs2.java:997)
     [java]       At edu.umd.cs.findbugs.FindBugs2.execute(FindBugs2.java:225)
     [java]       At edu.umd.cs.findbugs.FindBugs.runMain(FindBugs.java:393)
     [java]       At edu.umd.cs.findbugs.FindBugs2.main(FindBugs2.java:1317)
     [java]   Couldn't get class info for java/lang/CharSequence
     [java]     java.lang.ArrayIndexOutOfBoundsException: 26721
     [java]       At org.objectweb.asm.ClassReader.readClass(Unknown Source)
     [java]       At org.objectweb.asm.ClassReader.accept(Unknown Source)
     [java]       At edu.umd.cs.findbugs.asm.FBClassReader.accept(FBClassReader.java:44)
     [java]       At org.objectweb.asm.ClassReader.accept(Unknown Source)
     [java]       At edu.umd.cs.findbugs.classfile.engine.ClassParserUsingASM.parse(ClassParserUsingASM.java:110)
     [java]       At edu.umd.cs.findbugs.classfile.engine.ClassParserUsingASM.parse(ClassParserUsingASM.java:587)
     [java]       At edu.umd.cs.findbugs.classfile.engine.ClassInfoAnalysisEngine.analyze(ClassInfoAnalysisEngine.java:76)
     [java]       At edu.umd.cs.findbugs.classfile.engine.ClassInfoAnalysisEngine.analyze(ClassInfoAnalysisEngine.java:38)
     [java]       At edu.umd.cs.findbugs.classfile.impl.AnalysisCache.getClassAnalysis(AnalysisCache.java:268)
     [java]       At edu.umd.cs.findbugs.ba.XFactory.getXClass(XFactory.java:652)
     [java]       At edu.umd.cs.findbugs.ba.ch.Subtypes2.addInheritanceEdge(Subtypes2.java:1260)
     [java]       At edu.umd.cs.findbugs.ba.ch.Subtypes2.addSupertypeEdges(Subtypes2.java:1233)
     [java]       At edu.umd.cs.findbugs.ba.ch.Subtypes2.addClassAndGetClassVertex(Subtypes2.java:275)
     [java]       At edu.umd.cs.findbugs.ba.ch.Subtypes2.addClass(Subtypes2.java:244)
     [java]       At edu.umd.cs.findbugs.ba.AnalysisContext.setAppClassList(AnalysisContext.java:941)
     [java]       At edu.umd.cs.findbugs.FindBugs2.setAppClassList(FindBugs2.java:997)
     [java]       At edu.umd.cs.findbugs.FindBugs2.execute(FindBugs2.java:225)
     [java]       At edu.umd.cs.findbugs.FindBugs.runMain(FindBugs.java:393)
     [java]       At edu.umd.cs.findbugs.FindBugs2.main(FindBugs2.java:1317)
     [java]   Couldn't get class info for java/util/Arrays
     [java]     java.lang.ArrayIndexOutOfBoundsException: 35328
     [java]       At org.objectweb.asm.ClassReader.accept(Unknown Source)
     [java]       At edu.umd.cs.findbugs.asm.FBClassReader.accept(FBClassReader.java:44)
     [java]       At org.objectweb.asm.ClassReader.accept(Unknown Source)
     [java]       At edu.umd.cs.findbugs.classfile.engine.ClassParserUsingASM.parse(ClassParserUsingASM.java:110)
     [java]       At edu.umd.cs.findbugs.classfile.engine.ClassParserUsingASM.parse(ClassParserUsingASM.java:587)
     [java]       At edu.umd.cs.findbugs.classfile.engine.ClassInfoAnalysisEngine.analyze(ClassInfoAnalysisEngine.java:76)
     [java]       At edu.umd.cs.findbugs.classfile.engine.ClassInfoAnalysisEngine.analyze(ClassInfoAnalysisEngine.java:38)
     [java]       At edu.umd.cs.findbugs.classfile.impl.AnalysisCache.getClassAnalysis(AnalysisCache.java:268)
     [java]       At edu.umd.cs.findbugs.ba.XFactory.getXClass(XFactory.java:652)
     [java]       At edu.umd.cs.findbugs.ba.AnalysisContext.setAppClassList(AnalysisContext.java:932)
     [java]       At edu.umd.cs.findbugs.FindBugs2.setAppClassList(FindBugs2.java:997)
     [java]       At edu.umd.cs.findbugs.FindBugs2.execute(FindBugs2.java:225)
     [java]       At edu.umd.cs.findbugs.FindBugs.runMain(FindBugs.java:393)
     [java]       At edu.umd.cs.findbugs.FindBugs2.main(FindBugs2.java:1317)
     [java] Exception in thread "main" java.lang.ArrayIndexOutOfBoundsException: 35328
     [java] 	at org.objectweb.asm.ClassReader.accept(Unknown Source)
     [java] 	at edu.umd.cs.findbugs.asm.FBClassReader.accept(FBClassReader.java:44)
     [java] 	at org.objectweb.asm.ClassReader.accept(Unknown Source)
     [java] 	at edu.umd.cs.findbugs.classfile.engine.ClassParserUsingASM.parse(ClassParserUsingASM.java:110)
     [java] 	at edu.umd.cs.findbugs.classfile.engine.ClassParserUsingASM.parse(ClassParserUsingASM.java:587)
     [java] 	at edu.umd.cs.findbugs.classfile.engine.ClassInfoAnalysisEngine.analyze(ClassInfoAnalysisEngine.java:76)
     [java] 	at edu.umd.cs.findbugs.classfile.engine.ClassInfoAnalysisEngine.analyze(ClassInfoAnalysisEngine.java:38)
     [java] 	at edu.umd.cs.findbugs.classfile.impl.AnalysisCache.getClassAnalysis(AnalysisCache.java:268)
     [java] 	at edu.umd.cs.findbugs.ba.XFactory.getXClass(XFactory.java:652)
     [java] 	at edu.umd.cs.findbugs.ba.AnalysisContext.setAppClassList(AnalysisContext.java:932)
     [java] 	at edu.umd.cs.findbugs.FindBugs2.setAppClassList(FindBugs2.java:997)
     [java] 	at edu.umd.cs.findbugs.FindBugs2.execute(FindBugs2.java:225)
     [java] 	at edu.umd.cs.findbugs.FindBugs.runMain(FindBugs.java:393)
     [java] 	at edu.umd.cs.findbugs.FindBugs2.main(FindBugs2.java:1317)
[FINDBUGS] No report found for mojo findbugs

Mime
View raw message