uima-dev mailing list archives

Site index · List index
Message view « Date » · « Thread »
Top « Date » · « Thread »
From Apache Jenkins Server <jenk...@builds.apache.org>
Subject Build failed in Jenkins: UIMA-uimaFIT #189
Date Sat, 07 Jun 2014 17:15:03 GMT
See <https://builds.apache.org/job/UIMA-uimaFIT/189/changes>

Changes:

[rec] [UIMA-3868] Remove maven-plugin-plugin override after upgrading to UIMA parent pom 10

[rec] [UIMA-3870] Update to parent-pom 10
- Upgraded to 10-SNAPSHOT

------------------------------------------
[...truncated 1445 lines...]
[PMD] Finding all files that match the pattern pmd.xml
[PMD] Parsing 1 files in <https://builds.apache.org/job/UIMA-uimaFIT/ws/trunk/uimafit-spring/target>
[PMD] Successfully parsed file <https://builds.apache.org/job/UIMA-uimaFIT/ws/trunk/uimafit-spring/target/pmd.xml>
of module Apache UIMA uimaFIT - Spring integration with 2 warnings.
[PMD] Computing warning deltas based on reference build #188
[INFO] 
[INFO] --- maven-install-plugin:2.5.1:install (default-install) @ uimafit-spring ---
[INFO] Installing <https://builds.apache.org/job/UIMA-uimaFIT/ws/trunk/uimafit-spring/target/uimafit-spring-2.2.0-SNAPSHOT.jar>
to /home/jenkins/jenkins-slave/maven-repositories/0/org/apache/uima/uimafit-spring/2.2.0-SNAPSHOT/uimafit-spring-2.2.0-SNAPSHOT.jar
[INFO] Installing <https://builds.apache.org/job/UIMA-uimaFIT/ws/trunk/uimafit-spring/pom.xml>
to /home/jenkins/jenkins-slave/maven-repositories/0/org/apache/uima/uimafit-spring/2.2.0-SNAPSHOT/uimafit-spring-2.2.0-SNAPSHOT.pom
[INFO] 
[INFO] --- maven-enforcer-plugin:1.3.1:enforce (enforce-versions) @ uimafit-spring ---
[INFO] 
[INFO] --- build-helper-maven-plugin:1.8:parse-version (parse-project-version) @ uimafit-spring
---
[INFO] 
[INFO] --- uima-build-helper-maven-plugin:7:parse-date-time (set buildYear and buildMonth)
@ uimafit-spring ---
[INFO] 
[INFO] --- gmaven-plugin:1.5:execute (read-notice) @ uimafit-spring ---
[INFO] 
[INFO] --- maven-remote-resources-plugin:1.5:process (default) @ uimafit-spring ---
[INFO] 
[INFO] --- maven-resources-plugin:2.6:resources (default-resources) @ uimafit-spring ---
[INFO] Using 'UTF-8' encoding to copy filtered resources.
[INFO] Copying 0 resource
[INFO] Copying 3 resources
[INFO] Copying 3 resources
[INFO] 
[INFO] --- maven-compiler-plugin:3.1:compile (default-compile) @ uimafit-spring ---
[INFO] Nothing to compile - all classes are up to date
[INFO] 
[INFO] --- maven-resources-plugin:2.6:testResources (default-testResources) @ uimafit-spring
---
[INFO] Using 'UTF-8' encoding to copy filtered resources.
[INFO] Copying 0 resource
[INFO] Copying 3 resources
[INFO] Copying 3 resources
[INFO] 
[INFO] --- maven-compiler-plugin:3.1:testCompile (default-testCompile) @ uimafit-spring ---
[INFO] Nothing to compile - all classes are up to date
[WARNING] Failed to getClass for org.apache.maven.plugin.dependency.analyze.AnalyzeMojo
[INFO] 
[INFO] --- maven-dependency-plugin:2.8:analyze (default-cli) @ uimafit-spring ---
[INFO] No dependency problems found
[INFO] 
[INFO] --- maven-enforcer-plugin:1.3.1:enforce (enforce-versions) @ uimafit-spring ---
[INFO] 
[INFO] --- build-helper-maven-plugin:1.8:parse-version (parse-project-version) @ uimafit-spring
---
[INFO] 
[INFO] --- uima-build-helper-maven-plugin:7:parse-date-time (set buildYear and buildMonth)
@ uimafit-spring ---
[INFO] 
[INFO] --- gmaven-plugin:1.5:execute (read-notice) @ uimafit-spring ---
[INFO] 
[INFO] --- maven-remote-resources-plugin:1.5:process (default) @ uimafit-spring ---
[INFO] 
[INFO] --- maven-resources-plugin:2.6:resources (default-resources) @ uimafit-spring ---
[INFO] Using 'UTF-8' encoding to copy filtered resources.
[INFO] Copying 0 resource
[INFO] Copying 3 resources
[INFO] Copying 3 resources
[INFO] 
[INFO] --- maven-compiler-plugin:3.1:compile (default-compile) @ uimafit-spring ---
[INFO] Nothing to compile - all classes are up to date
[INFO] 
[INFO] --- cobertura-maven-plugin:2.6:instrument (default-cli) @ uimafit-spring ---
[INFO] Cobertura 2.0.3 - GNU GPL License (NO WARRANTY) - See COPYRIGHT file

[ERROR] Jun 7, 2014 5:14:33 PM net.sourceforge.cobertura.coveragedata.CoverageDataFileHandler
saveCoverageData
INFO: Cobertura: Saved information on 7 classes.

[INFO] Instrumentation was successful.
[INFO] NOT adding cobertura ser file to attached artifacts list.
[INFO] 
[INFO] --- maven-resources-plugin:2.6:testResources (default-testResources) @ uimafit-spring
---
[INFO] Using 'UTF-8' encoding to copy filtered resources.
[INFO] Copying 0 resource
[INFO] Copying 3 resources
[INFO] Copying 3 resources
[INFO] 
[INFO] --- maven-compiler-plugin:3.1:testCompile (default-testCompile) @ uimafit-spring ---
[INFO] Nothing to compile - all classes are up to date
[INFO] 
[INFO] --- maven-surefire-plugin:2.16:test (default-test) @ uimafit-spring ---
[INFO] Surefire report directory: <https://builds.apache.org/job/UIMA-uimaFIT/ws/trunk/uimafit-spring/target/surefire-reports>

-------------------------------------------------------
 T E S T S
-------------------------------------------------------
Running org.apache.uima.fit.spring.UimaFactoryInjectionTest
Jun 7, 2014 5:14:35 PM org.springframework.context.support.AbstractApplicationContext prepareRefresh
INFO: Refreshing org.springframework.context.support.GenericApplicationContext@b2a2d8: startup
date [Sat Jun 07 17:14:35 UTC 2014]; root of context hierarchy
Jun 7, 2014 5:14:35 PM org.springframework.beans.factory.support.DefaultListableBeanFactory
preInstantiateSingletons
INFO: Pre-instantiating singletons in org.springframework.beans.factory.support.DefaultListableBeanFactory@17e4ca:
defining beans [org.springframework.context.annotation.internalConfigurationAnnotationProcessor,org.springframework.context.annotation.internalAutowiredAnnotationProcessor,org.springframework.context.annotation.internalRequiredAnnotationProcessor,org.springframework.context.annotation.internalCommonAnnotationProcessor,otherBean,analysisEngineFactory,casConsumerFactory,casInitializerFactory,collectionReaderFactory,customResourceFactory,org.springframework.context.annotation.ConfigurationClassPostProcessor$ImportAwareBeanPostProcessor#0];
root of factory hierarchy
Tests run: 1, Failures: 0, Errors: 0, Skipped: 0, Time elapsed: 0.808 sec - in org.apache.uima.fit.spring.UimaFactoryInjectionTest
Running org.apache.uima.fit.spring.SpringContextResourceManagerTest
Jun 7, 2014 5:14:35 PM org.springframework.context.support.AbstractApplicationContext prepareRefresh
INFO: Refreshing org.springframework.context.support.GenericApplicationContext@15f1f9c: startup
date [Sat Jun 07 17:14:35 UTC 2014]; root of context hierarchy
Jun 7, 2014 5:14:35 PM org.springframework.beans.factory.support.DefaultListableBeanFactory
preInstantiateSingletons
INFO: Pre-instantiating singletons in org.springframework.beans.factory.support.DefaultListableBeanFactory@107bd0d:
defining beans [org.springframework.context.annotation.internalConfigurationAnnotationProcessor,org.springframework.context.annotation.internalAutowiredAnnotationProcessor,org.springframework.context.annotation.internalRequiredAnnotationProcessor,org.springframework.context.annotation.internalCommonAnnotationProcessor,springBean,org.springframework.context.annotation.ConfigurationClassPostProcessor$ImportAwareBeanPostProcessor#0];
root of factory hierarchy
Tests run: 1, Failures: 0, Errors: 0, Skipped: 0, Time elapsed: 0.053 sec - in org.apache.uima.fit.spring.SpringContextResourceManagerTest

Results :

Tests run: 2, Failures: 0, Errors: 0, Skipped: 0

[JENKINS] Recording test results
[INFO] 
[INFO] --- cobertura-maven-plugin:2.6:cobertura (default-cli) @ uimafit-spring ---
[INFO] Cobertura 2.0.3 - GNU GPL License (NO WARRANTY) - See COPYRIGHT file
Report time: 161ms

[ERROR] Jun 7, 2014 5:14:37 PM net.sourceforge.cobertura.coveragedata.CoverageDataFileHandler
loadCoverageData
INFO: Cobertura: Loaded information on 7 classes.

[INFO] Cobertura Report generation was successful.
[INFO]                                                                         
[INFO] ------------------------------------------------------------------------
[INFO] Building Apache UIMA uimaFIT - Maven Plugin 2.2.0-SNAPSHOT
[INFO] ------------------------------------------------------------------------
[INFO] 
[INFO] --- maven-clean-plugin:2.5:clean (default-clean) @ uimafit-maven-plugin ---
[TASKS] Scanning folder '<https://builds.apache.org/job/UIMA-uimaFIT/ws/trunk/uimafit-maven-plugin'>
for files matching the pattern '**/*.java' - excludes: 
[TASKS] Found 10 files to scan for tasks
Found 0 open tasks.
[TASKS] Computing warning deltas based on reference build #188
[INFO] 
[INFO] --- maven-enforcer-plugin:1.3.1:enforce (enforce-versions) @ uimafit-maven-plugin ---
[INFO] 
[INFO] --- build-helper-maven-plugin:1.8:parse-version (parse-project-version) @ uimafit-maven-plugin
---
[INFO] 
[INFO] --- uima-build-helper-maven-plugin:7:parse-date-time (set buildYear and buildMonth)
@ uimafit-maven-plugin ---
[INFO] 
[INFO] --- gmaven-plugin:1.5:execute (read-notice) @ uimafit-maven-plugin ---
[INFO] 
[INFO] --- maven-plugin-plugin:3.3:helpmojo (generated-helpmojo) @ uimafit-maven-plugin ---
[INFO] Using 'UTF-8' encoding to read mojo metadata.
[INFO] Applying mojo extractor for language: java-annotations
[INFO] Mojo extractor for language: java-annotations found 0 mojo descriptors.
[INFO] Applying mojo extractor for language: java
[INFO] Mojo extractor for language: java found 0 mojo descriptors.
[INFO] Applying mojo extractor for language: bsh
[INFO] Mojo extractor for language: bsh found 0 mojo descriptors.
[INFO]                                                                         
[INFO] ------------------------------------------------------------------------
[INFO] Skipping Apache UIMA uimaFIT
[INFO] This project has been banned from the build due to previous failures.
[INFO] ------------------------------------------------------------------------
[INFO] ------------------------------------------------------------------------
[INFO] Reactor Summary:
[INFO] 
[INFO] Apache UIMA uimaFIT - Parent ...................... SUCCESS [44.721s]
[INFO] Apache UIMA uimaFIT - Core ........................ SUCCESS [2:26.877s]
[INFO] Apache UIMA uimaFIT - Examples .................... SUCCESS [55.361s]
[INFO] Apache UIMA uimaFIT - Spring integration .......... SUCCESS [40.935s]
[INFO] Apache UIMA uimaFIT - Maven Plugin ................ FAILURE [5.155s]
[INFO] Apache UIMA uimaFIT - Legacy uimaFIT support ...... SKIPPED
[INFO] Apache UIMA uimaFIT - Documentation ............... SKIPPED
[INFO] Apache UIMA uimaFIT - Collection Processing Engine support  SKIPPED
[INFO] Apache UIMA uimaFIT ............................... SKIPPED
[INFO] ------------------------------------------------------------------------
[INFO] BUILD FAILURE
[INFO] ------------------------------------------------------------------------
[INFO] Total time: 5:01.708s
[INFO] Finished at: Sat Jun 07 17:14:46 UTC 2014
[INFO] Final Memory: 54M/131M
[INFO] ------------------------------------------------------------------------
[WARNING] The requested profile "javancss" could not be activated because it does not exist.
[WARNING] The requested profile "cobertura-aggregate" could not be activated because it does
not exist.
[WARNING] The requested profile "attach-source" could not be activated because it does not
exist.
[WARNING] The requested profile "attach-javadoc" could not be activated because it does not
exist.
[WARNING] The requested profile "attach-test" could not be activated because it does not exist.
Waiting for Jenkins to finish collecting data
[ERROR] Failed to execute goal org.apache.maven.plugins:maven-plugin-plugin:3.3:helpmojo (generated-helpmojo)
on project uimafit-maven-plugin: Error extracting plugin descriptor: 'No mojo definitions
were found for plugin: org.apache.uima:uimafit-maven-plugin.' -> [Help 1]
[ERROR] 
[ERROR] To see the full stack trace of the errors, re-run Maven with the -e switch.
[ERROR] Re-run Maven using the -X switch to enable full debug logging.
[ERROR] 
[ERROR] For more information about the errors and possible solutions, please read the following
articles:
[ERROR] [Help 1] http://cwiki.apache.org/confluence/display/MAVEN/MojoExecutionException
[ERROR] 
[ERROR] After correcting the problems, you can resume the build with the command
[ERROR]   mvn <goals> -rf :uimafit-maven-plugin
[JENKINS] Archiving <https://builds.apache.org/job/UIMA-uimaFIT/ws/trunk/uimafit-maven-plugin/pom.xml>
to org.apache.uima/uimafit-maven-plugin/2.2.0-SNAPSHOT/uimafit-maven-plugin-2.2.0-SNAPSHOT.pom
Sending artifact delta relative to UIMA-uimaFIT ? Apache UIMA uimaFIT - Maven Plugin #188
Archived 1 artifacts
Archive block size is 32768
Received 0 blocks and 6723 bytes
Compression is 0.0%
Took 0.19 sec
[JENKINS] Archiving <https://builds.apache.org/job/UIMA-uimaFIT/ws/trunk/uimafit-spring/pom.xml>
to org.apache.uima/uimafit-spring/2.2.0-SNAPSHOT/uimafit-spring-2.2.0-SNAPSHOT.pom
[JENKINS] Archiving <https://builds.apache.org/job/UIMA-uimaFIT/ws/trunk/uimafit-spring/target/uimafit-spring-2.2.0-SNAPSHOT.jar>
to org.apache.uima/uimafit-spring/2.2.0-SNAPSHOT/uimafit-spring-2.2.0-SNAPSHOT.jar
Sending artifact delta relative to UIMA-uimaFIT ? Apache UIMA uimaFIT - Spring integration
#188
Archived 2 artifacts
Archive block size is 32768
Received 0 blocks and 19190 bytes
Compression is 0.0%
Took 0.19 sec
[JENKINS] Archiving <https://builds.apache.org/job/UIMA-uimaFIT/ws/trunk/uimafit-examples/pom.xml>
to org.apache.uima/uimafit-examples/2.2.0-SNAPSHOT/uimafit-examples-2.2.0-SNAPSHOT.pom
[JENKINS] Archiving <https://builds.apache.org/job/UIMA-uimaFIT/ws/trunk/uimafit-examples/target/uimafit-examples-2.2.0-SNAPSHOT.jar>
to org.apache.uima/uimafit-examples/2.2.0-SNAPSHOT/uimafit-examples-2.2.0-SNAPSHOT.jar
Sending artifact delta relative to UIMA-uimaFIT ? Apache UIMA uimaFIT - Examples #188
Archived 2 artifacts
Archive block size is 32768
Received 0 blocks and 91386 bytes
Compression is 0.0%
Took 0.19 sec
[JENKINS] Archiving <https://builds.apache.org/job/UIMA-uimaFIT/ws/trunk/uimafit-cpe/pom.xml>
to org.apache.uima/uimafit-cpe/2.2.0-SNAPSHOT/uimafit-cpe-2.2.0-SNAPSHOT.pom
Sending artifact delta relative to UIMA-uimaFIT ? Apache UIMA uimaFIT - Collection Processing
Engine support #188
Archived 1 artifacts
Archive block size is 32768
Received 0 blocks and 1942 bytes
Compression is 0.0%
Took 0.12 sec
[JENKINS] Archiving <https://builds.apache.org/job/UIMA-uimaFIT/ws/trunk/uimafit-docbook/pom.xml>
to org.apache.uima/uimafit-docbook/2.2.0-SNAPSHOT/uimafit-docbook-2.2.0-SNAPSHOT.pom
Sending artifact delta relative to UIMA-uimaFIT ? Apache UIMA uimaFIT - Documentation #188
Archived 1 artifacts
Archive block size is 32768
Received 0 blocks and 1597 bytes
Compression is 0.0%
Took 90 ms
[JENKINS] Archiving <https://builds.apache.org/job/UIMA-uimaFIT/ws/trunk/uimafit-legacy-support/pom.xml>
to org.apache.uima/uimafit-legacy-support/2.2.0-SNAPSHOT/uimafit-legacy-support-2.2.0-SNAPSHOT.pom
Sending artifact delta relative to UIMA-uimaFIT ? Apache UIMA uimaFIT - Legacy uimaFIT support
#188
Archived 1 artifacts
Archive block size is 32768
Received 0 blocks and 5073 bytes
Compression is 0.0%
Took 1.5 sec
[JENKINS] Archiving <https://builds.apache.org/job/UIMA-uimaFIT/ws/trunk/uimafit-parent/pom.xml>
to org.apache.uima/uimafit-parent/2.2.0-SNAPSHOT/uimafit-parent-2.2.0-SNAPSHOT.pom
Sending artifact delta relative to UIMA-uimaFIT ? Apache UIMA uimaFIT - Parent #188
Archived 1 artifacts
Archive block size is 32768
Received 0 blocks and 9458 bytes
Compression is 0.0%
Took 0.15 sec
[JENKINS] Archiving <https://builds.apache.org/job/UIMA-uimaFIT/ws/trunk/uimafit-core/pom.xml>
to org.apache.uima/uimafit-core/2.2.0-SNAPSHOT/uimafit-core-2.2.0-SNAPSHOT.pom
[JENKINS] Archiving <https://builds.apache.org/job/UIMA-uimaFIT/ws/trunk/uimafit-core/target/uimafit-core-2.2.0-SNAPSHOT.jar>
to org.apache.uima/uimafit-core/2.2.0-SNAPSHOT/uimafit-core-2.2.0-SNAPSHOT.jar
Sending artifact delta relative to UIMA-uimaFIT ? Apache UIMA uimaFIT - Core #188
Archived 2 artifacts
Archive block size is 32768
Received 0 blocks and 163344 bytes
Compression is 0.0%
Took 0.35 sec
[JENKINS] Archiving <https://builds.apache.org/job/UIMA-uimaFIT/ws/trunk/pom.xml> to
org.apache.uima/uimafit/2.2.0-SNAPSHOT/uimafit-2.2.0-SNAPSHOT.pom
Sending artifact delta relative to UIMA-uimaFIT ? Apache UIMA uimaFIT #188
Archived 1 artifacts
Archive block size is 32768
Received 0 blocks and 5328 bytes
Compression is 0.0%
Took 0.29 sec
Sending e-mails to: dev@uima.apache.org
channel stopped
[WARNINGS] Skipping publisher since build result is FAILURE
Archiving artifacts
Skipping Cobertura coverage report as build was not UNSTABLE or better ...

Mime
View raw message