uima-dev mailing list archives

Site index · List index
Message view « Date » · « Thread »
Top « Date » · « Thread »
From Apache Jenkins Server <jenk...@builds.apache.org>
Subject Build failed in Jenkins: UIMA-SDK » Apache UIMA Base: uimaj-json: JSON #566
Date Fri, 26 Sep 2014 18:41:16 GMT
See <https://builds.apache.org/job/UIMA-SDK/org.apache.uima$uimaj-json/566/changes>

Changes:

[schor] [UIMA-4024] repackage json support for uimaj sdk with that project, but keep it separated
from uimaj-core (so uimaj-core has no dependencies on it).  Clean up javadoc formatting.

[schor] Initial import.

------------------------------------------
[INFO]                                                                         
[INFO] ------------------------------------------------------------------------
[INFO] Building Apache UIMA Base: uimaj-json: JSON 2.6.1-SNAPSHOT
[INFO] ------------------------------------------------------------------------
[INFO] 
[INFO] --- maven-clean-plugin:2.5:clean (default-clean) @ uimaj-json ---
[TASKS] Scanning folder 'F:\jenkins\jenkins-slave\workspace\UIMA-SDK\trunk\uimaj-json' for
files matching the pattern '**/*.java' - excludes: 
[TASKS] Found 6 files to scan for tasks
Found 0 open tasks.
[INFO] 
[INFO] --- maven-enforcer-plugin:1.3.1:enforce (enforce-versions) @ uimaj-json ---
[INFO] 
[INFO] --- build-helper-maven-plugin:1.8:parse-version (parse-project-version) @ uimaj-json
---
[INFO] 
[INFO] --- uima-build-helper-maven-plugin:7:parse-date-time (set buildYear and buildMonth)
@ uimaj-json ---
[INFO] 
[INFO] --- maven-remote-resources-plugin:1.5:process (default) @ uimaj-json ---
[INFO] 
[INFO] --- maven-resources-plugin:2.6:resources (default-resources) @ uimaj-json ---
[INFO] Using 'UTF-8' encoding to copy filtered resources.
[INFO] skip non existing resourceDirectory F:\jenkins\jenkins-slave\workspace\UIMA-SDK\trunk\uimaj-json\src\main\resources
[INFO] Copying 3 resources
[INFO] 
[INFO] --- maven-compiler-plugin:3.1:compile (default-compile) @ uimaj-json ---
[INFO] Changes detected - recompiling the module!
[INFO] Compiling 4 source files to F:\jenkins\jenkins-slave\workspace\UIMA-SDK\trunk\uimaj-json\target\classes
[INFO] 
[INFO] --- maven-resources-plugin:2.6:testResources (default-testResources) @ uimaj-json ---
[INFO] Using 'UTF-8' encoding to copy filtered resources.
[INFO] Copying 28 resources
[INFO] Copying 3 resources
[INFO] 
[INFO] --- maven-compiler-plugin:3.1:testCompile (default-testCompile) @ uimaj-json ---
[INFO] Changes detected - recompiling the module!
[INFO] Compiling 2 source files to F:\jenkins\jenkins-slave\workspace\UIMA-SDK\trunk\uimaj-json\target\test-classes
[INFO] -------------------------------------------------------------
[ERROR] COMPILATION ERROR : 
[INFO] -------------------------------------------------------------
[ERROR] /F:/jenkins/jenkins-slave/workspace/UIMA-SDK/trunk/uimaj-json/src/test/java/org/apache/uima/json/JsonMetaDataObjectTest.java:[33,46]
F:\jenkins\jenkins-slave\workspace\UIMA-SDK\trunk\uimaj-json\src\test\java\org\apache\uima\json\JsonMetaDataObjectTest.java:33:
cannot find symbol
symbol  : class TestFruitBagObject
location: package org.apache.uima.resource.metadata.impl
[ERROR] /F:/jenkins/jenkins-slave/workspace/UIMA-SDK/trunk/uimaj-json/src/test/java/org/apache/uima/json/JsonMetaDataObjectTest.java:[34,46]
F:\jenkins\jenkins-slave\workspace\UIMA-SDK\trunk\uimaj-json\src\test\java\org\apache\uima\json\JsonMetaDataObjectTest.java:34:
cannot find symbol
symbol  : class TestFruitObject
location: package org.apache.uima.resource.metadata.impl
[ERROR] /F:/jenkins/jenkins-slave/workspace/UIMA-SDK/trunk/uimaj-json/src/test/java/org/apache/uima/json/JsonMetaDataObjectTest.java:[41,11]
F:\jenkins\jenkins-slave\workspace\UIMA-SDK\trunk\uimaj-json\src\test\java\org\apache\uima\json\JsonMetaDataObjectTest.java:41:
cannot find symbol
symbol  : class TestFruitObject
location: class org.apache.uima.json.JsonMetaDataObjectTest
[ERROR] /F:/jenkins/jenkins-slave/workspace/UIMA-SDK/trunk/uimaj-json/src/test/java/org/apache/uima/json/JsonMetaDataObjectTest.java:[42,11]
F:\jenkins\jenkins-slave\workspace\UIMA-SDK\trunk\uimaj-json\src\test\java\org\apache\uima\json\JsonMetaDataObjectTest.java:42:
cannot find symbol
symbol  : class TestFruitObject
location: class org.apache.uima.json.JsonMetaDataObjectTest
[ERROR] /F:/jenkins/jenkins-slave/workspace/UIMA-SDK/trunk/uimaj-json/src/test/java/org/apache/uima/json/JsonMetaDataObjectTest.java:[43,11]
F:\jenkins\jenkins-slave\workspace\UIMA-SDK\trunk\uimaj-json\src\test\java\org\apache\uima\json\JsonMetaDataObjectTest.java:43:
cannot find symbol
symbol  : class TestFruitObject
location: class org.apache.uima.json.JsonMetaDataObjectTest
[ERROR] /F:/jenkins/jenkins-slave/workspace/UIMA-SDK/trunk/uimaj-json/src/test/java/org/apache/uima/json/JsonMetaDataObjectTest.java:[44,11]
F:\jenkins\jenkins-slave\workspace\UIMA-SDK\trunk\uimaj-json\src\test\java\org\apache\uima\json\JsonMetaDataObjectTest.java:44:
cannot find symbol
symbol  : class TestFruitBagObject
location: class org.apache.uima.json.JsonMetaDataObjectTest
[ERROR] /F:/jenkins/jenkins-slave/workspace/UIMA-SDK/trunk/uimaj-json/src/test/java/org/apache/uima/json/JsonMetaDataObjectTest.java:[50,18]
F:\jenkins\jenkins-slave\workspace\UIMA-SDK\trunk\uimaj-json\src\test\java\org\apache\uima\json\JsonMetaDataObjectTest.java:50:
cannot find symbol
symbol  : class TestFruitObject
location: class org.apache.uima.json.JsonMetaDataObjectTest
[ERROR] /F:/jenkins/jenkins-slave/workspace/UIMA-SDK/trunk/uimaj-json/src/test/java/org/apache/uima/json/JsonMetaDataObjectTest.java:[58,18]
F:\jenkins\jenkins-slave\workspace\UIMA-SDK\trunk\uimaj-json\src\test\java\org\apache\uima\json\JsonMetaDataObjectTest.java:58:
cannot find symbol
symbol  : class TestFruitObject
location: class org.apache.uima.json.JsonMetaDataObjectTest
[ERROR] /F:/jenkins/jenkins-slave/workspace/UIMA-SDK/trunk/uimaj-json/src/test/java/org/apache/uima/json/JsonMetaDataObjectTest.java:[66,18]
F:\jenkins\jenkins-slave\workspace\UIMA-SDK\trunk\uimaj-json\src\test\java\org\apache\uima\json\JsonMetaDataObjectTest.java:66:
cannot find symbol
symbol  : class TestFruitObject
location: class org.apache.uima.json.JsonMetaDataObjectTest
[ERROR] /F:/jenkins/jenkins-slave/workspace/UIMA-SDK/trunk/uimaj-json/src/test/java/org/apache/uima/json/JsonMetaDataObjectTest.java:[75,20]
F:\jenkins\jenkins-slave\workspace\UIMA-SDK\trunk\uimaj-json\src\test\java\org\apache\uima\json\JsonMetaDataObjectTest.java:75:
cannot find symbol
symbol  : class TestFruitBagObject
location: class org.apache.uima.json.JsonMetaDataObjectTest
[ERROR] /F:/jenkins/jenkins-slave/workspace/UIMA-SDK/trunk/uimaj-json/src/test/java/org/apache/uima/json/JsonMetaDataObjectTest.java:[76,5]
F:\jenkins\jenkins-slave\workspace\UIMA-SDK\trunk\uimaj-json\src\test\java\org\apache\uima\json\JsonMetaDataObjectTest.java:76:
cannot find symbol
symbol  : class TestFruitObject
location: class org.apache.uima.json.JsonMetaDataObjectTest
[INFO] 11 errors 
[INFO] -------------------------------------------------------------

Mime
View raw message