uima-dev mailing list archives

Site index · List index
Message view « Date » · « Thread »
Top « Date » · « Thread »
From Apache Jenkins Server <jenk...@builds.apache.org>
Subject Build failed in Jenkins: UIMA-Ruta » Apache UIMA Ruta: ruta-core #480
Date Fri, 16 Jan 2015 14:00:21 GMT
See <https://builds.apache.org/job/UIMA-Ruta/org.apache.uima$ruta-core/480/changes>

Changes:

[pkluegl] UIMA-3866
- converted next two analysis engines

------------------------------------------
[...truncated 389 lines...]
	at sun.reflect.NativeMethodAccessorImpl.invoke0(Native Method)
	at sun.reflect.NativeMethodAccessorImpl.invoke(NativeMethodAccessorImpl.java:57)
	at sun.reflect.DelegatingMethodAccessorImpl.invoke(DelegatingMethodAccessorImpl.java:43)
	at java.lang.reflect.Method.invoke(Method.java:601)
	at org.junit.runners.model.FrameworkMethod$1.runReflectiveCall(FrameworkMethod.java:44)
	at org.junit.internal.runners.model.ReflectiveCallable.run(ReflectiveCallable.java:15)
	at org.junit.runners.model.FrameworkMethod.invokeExplosively(FrameworkMethod.java:41)
	at org.junit.internal.runners.statements.InvokeMethod.evaluate(InvokeMethod.java:20)
	at org.junit.internal.runners.statements.RunBefores.evaluate(RunBefores.java:28)
	at org.junit.internal.runners.statements.RunAfters.evaluate(RunAfters.java:31)
	at org.junit.runners.BlockJUnit4ClassRunner.runChild(BlockJUnit4ClassRunner.java:73)
	at org.junit.runners.BlockJUnit4ClassRunner.runChild(BlockJUnit4ClassRunner.java:46)
	at org.junit.runners.ParentRunner.runChildren(ParentRunner.java:180)
	at org.junit.runners.ParentRunner.access$000(ParentRunner.java:41)
	at org.junit.runners.ParentRunner$1.evaluate(ParentRunner.java:173)
	at org.junit.internal.runners.statements.RunBefores.evaluate(RunBefores.java:28)
	at org.junit.internal.runners.statements.RunAfters.evaluate(RunAfters.java:31)
	at org.junit.runners.ParentRunner.run(ParentRunner.java:220)
	at org.apache.maven.surefire.junit4.JUnit4Provider.execute(JUnit4Provider.java:264)
	at org.apache.maven.surefire.junit4.JUnit4Provider.executeTestSet(JUnit4Provider.java:153)
	at org.apache.maven.surefire.junit4.JUnit4Provider.invoke(JUnit4Provider.java:124)
	at org.apache.maven.surefire.booter.ForkedBooter.invokeProviderInSameClassLoader(ForkedBooter.java:200)
	at org.apache.maven.surefire.booter.ForkedBooter.runSuitesInProcess(ForkedBooter.java:153)
	at org.apache.maven.surefire.booter.ForkedBooter.main(ForkedBooter.java:103)
Caused by: java.lang.IllegalArgumentException: Not able to resolve type: Type2
	at org.apache.uima.ruta.expression.type.SimpleTypeExpression.getType(SimpleTypeExpression.java:47)
	at org.apache.uima.ruta.action.AbstractMarkAction.createAnnotation(AbstractMarkAction.java:42)
	at org.apache.uima.ruta.action.MarkAction.execute(MarkAction.java:57)
	at org.apache.uima.ruta.rule.AbstractRuleElement.apply(AbstractRuleElement.java:130)
	at org.apache.uima.ruta.rule.RuleElementCaretaker.applyRuleElements(RuleElementCaretaker.java:111)
	at org.apache.uima.ruta.rule.ComposedRuleElement.applyRuleElements(ComposedRuleElement.java:593)
	at org.apache.uima.ruta.rule.AbstractRuleElement.doneMatching(AbstractRuleElement.java:84)
	at org.apache.uima.ruta.rule.ComposedRuleElement.fallback(ComposedRuleElement.java:514)
	at org.apache.uima.ruta.rule.ComposedRuleElement.fallbackContinue(ComposedRuleElement.java:415)
	at org.apache.uima.ruta.rule.RutaRuleElement.startMatch(RutaRuleElement.java:102)
	at org.apache.uima.ruta.rule.ComposedRuleElement.startMatch(ComposedRuleElement.java:74)
	at org.apache.uima.ruta.rule.RutaRule.apply(RutaRule.java:47)
	at org.apache.uima.ruta.rule.RutaRule.apply(RutaRule.java:40)
	at org.apache.uima.ruta.rule.RutaRule.apply(RutaRule.java:29)
	at org.apache.uima.ruta.RutaScriptBlock.apply(RutaScriptBlock.java:63)
	at org.apache.uima.ruta.RutaModule.apply(RutaModule.java:48)
	at org.apache.uima.ruta.engine.RutaEngine.process(RutaEngine.java:533)
	... 29 more

Tests run: 13, Failures: 0, Errors: 0, Skipped: 0, Time elapsed: 0.854 sec - in org.apache.uima.ruta.ImportStatementsTest
Running org.apache.uima.ruta.IncompletePartitioningTest
Tests run: 1, Failures: 0, Errors: 0, Skipped: 0, Time elapsed: 0.032 sec - in org.apache.uima.ruta.IncompletePartitioningTest
Running org.apache.uima.ruta.InlinedRulesTest
Tests run: 1, Failures: 0, Errors: 0, Skipped: 0, Time elapsed: 0.346 sec - in org.apache.uima.ruta.InlinedRulesTest
Running org.apache.uima.ruta.InvisibleWildcardMatchTest
Tests run: 1, Failures: 0, Errors: 0, Skipped: 0, Time elapsed: 0.044 sec - in org.apache.uima.ruta.InvisibleWildcardMatchTest
Running org.apache.uima.ruta.LiteralStringMatchTest
Tests run: 1, Failures: 0, Errors: 0, Skipped: 0, Time elapsed: 0.137 sec - in org.apache.uima.ruta.LiteralStringMatchTest
Running org.apache.uima.ruta.LoadResourceFromClassPathTest
Tests run: 2, Failures: 0, Errors: 0, Skipped: 0, Time elapsed: 0.081 sec - in org.apache.uima.ruta.LoadResourceFromClassPathTest
Running org.apache.uima.ruta.LoadScriptFromClassPathTest
Tests run: 1, Failures: 0, Errors: 0, Skipped: 0, Time elapsed: 0.134 sec - in org.apache.uima.ruta.LoadScriptFromClassPathTest
Running org.apache.uima.ruta.LongGreedy1Test
Tests run: 1, Failures: 0, Errors: 0, Skipped: 0, Time elapsed: 0.001 sec - in org.apache.uima.ruta.LongGreedy1Test
Running org.apache.uima.ruta.LongGreedy2Test
Tests run: 1, Failures: 0, Errors: 0, Skipped: 0, Time elapsed: 0.001 sec - in org.apache.uima.ruta.LongGreedy2Test
Running org.apache.uima.ruta.ManualAnchoringTest
Tests run: 1, Failures: 0, Errors: 0, Skipped: 0, Time elapsed: 0.082 sec - in org.apache.uima.ruta.ManualAnchoringTest
Running org.apache.uima.ruta.MarkInGreedyComposedTest
Tests run: 6, Failures: 0, Errors: 0, Skipped: 0, Time elapsed: 0.303 sec - in org.apache.uima.ruta.MarkInGreedyComposedTest
Running org.apache.uima.ruta.NBSPWSTest
Tests run: 1, Failures: 0, Errors: 0, Skipped: 0, Time elapsed: 0.043 sec - in org.apache.uima.ruta.NBSPWSTest
Running org.apache.uima.ruta.NestedDisjunctiveTest
Tests run: 1, Failures: 0, Errors: 0, Skipped: 0, Time elapsed: 0.037 sec - in org.apache.uima.ruta.NestedDisjunctiveTest
Running org.apache.uima.ruta.NewCASPipelineTest
Tests run: 1, Failures: 0, Errors: 0, Skipped: 0, Time elapsed: 0.135 sec - in org.apache.uima.ruta.NewCASPipelineTest
Running org.apache.uima.ruta.NullExpressionTest
Tests run: 1, Failures: 0, Errors: 0, Skipped: 0, Time elapsed: 0.039 sec - in org.apache.uima.ruta.NullExpressionTest
Running org.apache.uima.ruta.OptionalComposedEndTest
Tests run: 2, Failures: 0, Errors: 0, Skipped: 0, Time elapsed: 0.076 sec - in org.apache.uima.ruta.OptionalComposedEndTest
Running org.apache.uima.ruta.OptionalDisjunctiveBeforeAnchoringTest
Tests run: 1, Failures: 0, Errors: 0, Skipped: 0, Time elapsed: 0.074 sec - in org.apache.uima.ruta.OptionalDisjunctiveBeforeAnchoringTest
Running org.apache.uima.ruta.OutOfWindowTest
Tests run: 1, Failures: 0, Errors: 0, Skipped: 0, Time elapsed: 0.072 sec - in org.apache.uima.ruta.OutOfWindowTest
Running org.apache.uima.ruta.Quantifier1Test
Tests run: 1, Failures: 0, Errors: 0, Skipped: 0, Time elapsed: 0.209 sec - in org.apache.uima.ruta.Quantifier1Test
Running org.apache.uima.ruta.Quantifier2Test
Tests run: 1, Failures: 0, Errors: 0, Skipped: 0, Time elapsed: 0.056 sec - in org.apache.uima.ruta.Quantifier2Test
Running org.apache.uima.ruta.Quantifier3Test
Tests run: 1, Failures: 0, Errors: 0, Skipped: 0, Time elapsed: 0.028 sec - in org.apache.uima.ruta.Quantifier3Test
Running org.apache.uima.ruta.Quantifier4Test
Tests run: 1, Failures: 0, Errors: 0, Skipped: 0, Time elapsed: 0.026 sec - in org.apache.uima.ruta.Quantifier4Test
Running org.apache.uima.ruta.Quantifier5Test
Tests run: 1, Failures: 0, Errors: 0, Skipped: 0, Time elapsed: 0.077 sec - in org.apache.uima.ruta.Quantifier5Test
Running org.apache.uima.ruta.Quantifier6Test
Tests run: 1, Failures: 0, Errors: 0, Skipped: 0, Time elapsed: 0.26 sec - in org.apache.uima.ruta.Quantifier6Test
Running org.apache.uima.ruta.Quantifier7Test
Tests run: 1, Failures: 0, Errors: 0, Skipped: 0, Time elapsed: 0.145 sec - in org.apache.uima.ruta.Quantifier7Test
Running org.apache.uima.ruta.Quantifier8Test
Tests run: 1, Failures: 0, Errors: 0, Skipped: 0, Time elapsed: 0.038 sec - in org.apache.uima.ruta.Quantifier8Test
Running org.apache.uima.ruta.RegExpRuleTest
Tests run: 1, Failures: 0, Errors: 0, Skipped: 0, Time elapsed: 0.042 sec - in org.apache.uima.ruta.RegExpRuleTest
Running org.apache.uima.ruta.RemoveDocumentAnnotationTest
Tests run: 1, Failures: 0, Errors: 0, Skipped: 0, Time elapsed: 0.039 sec - in org.apache.uima.ruta.RemoveDocumentAnnotationTest
Running org.apache.uima.ruta.ReverseQuantifierTest
Tests run: 1, Failures: 0, Errors: 0, Skipped: 0, Time elapsed: 0.033 sec - in org.apache.uima.ruta.ReverseQuantifierTest
Running org.apache.uima.ruta.RuleInference1Test
Tests run: 1, Failures: 0, Errors: 0, Skipped: 0, Time elapsed: 0.147 sec - in org.apache.uima.ruta.RuleInference1Test
Running org.apache.uima.ruta.RuleInference2Test
Tests run: 1, Failures: 0, Errors: 0, Skipped: 0, Time elapsed: 0.082 sec - in org.apache.uima.ruta.RuleInference2Test
Running org.apache.uima.ruta.RuleInference3Test
Tests run: 1, Failures: 0, Errors: 0, Skipped: 0, Time elapsed: 0.042 sec - in org.apache.uima.ruta.RuleInference3Test
Running org.apache.uima.ruta.seed.DefaultSeederTest
Tests run: 1, Failures: 0, Errors: 0, Skipped: 0, Time elapsed: 0.015 sec - in org.apache.uima.ruta.seed.DefaultSeederTest
Running org.apache.uima.ruta.ShiftWithLowMemoryProfileTest
Tests run: 1, Failures: 0, Errors: 0, Skipped: 0, Time elapsed: 0.025 sec - in org.apache.uima.ruta.ShiftWithLowMemoryProfileTest
Running org.apache.uima.ruta.StrictImportTest
Jan 16, 2015 5:59:12 AM org.apache.uima.analysis_engine.impl.PrimitiveAnalysisEngine_impl
callAnalysisComponentProcess(417)
SEVERE: Exception occurred
org.apache.uima.analysis_engine.AnalysisEngineProcessException: Annotator processing failed.
   
	at org.apache.uima.ruta.engine.RutaEngine.process(RutaEngine.java:535)
	at org.apache.uima.analysis_component.JCasAnnotator_ImplBase.process(JCasAnnotator_ImplBase.java:48)
	at org.apache.uima.analysis_engine.impl.PrimitiveAnalysisEngine_impl.callAnalysisComponentProcess(PrimitiveAnalysisEngine_impl.java:385)
	at org.apache.uima.analysis_engine.impl.PrimitiveAnalysisEngine_impl.processAndOutputNewCASes(PrimitiveAnalysisEngine_impl.java:309)
	at org.apache.uima.analysis_engine.impl.AnalysisEngineImplBase.process(AnalysisEngineImplBase.java:267)
	at org.apache.uima.ruta.StrictImportTest.testUndeclaredTypeSystem(StrictImportTest.java:80)
	at sun.reflect.NativeMethodAccessorImpl.invoke0(Native Method)
	at sun.reflect.NativeMethodAccessorImpl.invoke(NativeMethodAccessorImpl.java:57)
	at sun.reflect.DelegatingMethodAccessorImpl.invoke(DelegatingMethodAccessorImpl.java:43)
	at java.lang.reflect.Method.invoke(Method.java:601)
	at org.junit.runners.model.FrameworkMethod$1.runReflectiveCall(FrameworkMethod.java:44)
	at org.junit.internal.runners.model.ReflectiveCallable.run(ReflectiveCallable.java:15)
	at org.junit.runners.model.FrameworkMethod.invokeExplosively(FrameworkMethod.java:41)
	at org.junit.internal.runners.statements.InvokeMethod.evaluate(InvokeMethod.java:20)
	at org.junit.internal.runners.statements.RunBefores.evaluate(RunBefores.java:28)
	at org.junit.internal.runners.statements.RunAfters.evaluate(RunAfters.java:31)
	at org.junit.runners.BlockJUnit4ClassRunner.runChild(BlockJUnit4ClassRunner.java:73)
	at org.junit.runners.BlockJUnit4ClassRunner.runChild(BlockJUnit4ClassRunner.java:46)
	at org.junit.runners.ParentRunner.runChildren(ParentRunner.java:180)
	at org.junit.runners.ParentRunner.access$000(ParentRunner.java:41)
	at org.junit.runners.ParentRunner$1.evaluate(ParentRunner.java:173)
	at org.junit.internal.runners.statements.RunBefores.evaluate(RunBefores.java:28)
	at org.junit.internal.runners.statements.RunAfters.evaluate(RunAfters.java:31)
	at org.junit.runners.ParentRunner.run(ParentRunner.java:220)
	at org.apache.maven.surefire.junit4.JUnit4Provider.execute(JUnit4Provider.java:264)
	at org.apache.maven.surefire.junit4.JUnit4Provider.executeTestSet(JUnit4Provider.java:153)
	at org.apache.maven.surefire.junit4.JUnit4Provider.invoke(JUnit4Provider.java:124)
	at org.apache.maven.surefire.booter.ForkedBooter.invokeProviderInSameClassLoader(ForkedBooter.java:200)
	at org.apache.maven.surefire.booter.ForkedBooter.runSuitesInProcess(ForkedBooter.java:153)
	at org.apache.maven.surefire.booter.ForkedBooter.main(ForkedBooter.java:103)
Caused by: java.lang.IllegalArgumentException: Not able to resolve type: MyType
	at org.apache.uima.ruta.expression.type.SimpleTypeExpression.getType(SimpleTypeExpression.java:47)
	at org.apache.uima.ruta.action.AbstractMarkAction.createAnnotation(AbstractMarkAction.java:42)
	at org.apache.uima.ruta.action.MarkAction.execute(MarkAction.java:57)
	at org.apache.uima.ruta.rule.AbstractRuleElement.apply(AbstractRuleElement.java:130)
	at org.apache.uima.ruta.rule.RuleElementCaretaker.applyRuleElements(RuleElementCaretaker.java:111)
	at org.apache.uima.ruta.rule.ComposedRuleElement.applyRuleElements(ComposedRuleElement.java:593)
	at org.apache.uima.ruta.rule.AbstractRuleElement.doneMatching(AbstractRuleElement.java:84)
	at org.apache.uima.ruta.rule.ComposedRuleElement.fallback(ComposedRuleElement.java:514)
	at org.apache.uima.ruta.rule.ComposedRuleElement.fallbackContinue(ComposedRuleElement.java:415)
	at org.apache.uima.ruta.rule.RutaRuleElement.startMatch(RutaRuleElement.java:102)
	at org.apache.uima.ruta.rule.ComposedRuleElement.startMatch(ComposedRuleElement.java:74)
	at org.apache.uima.ruta.rule.RutaRule.apply(RutaRule.java:47)
	at org.apache.uima.ruta.rule.RutaRule.apply(RutaRule.java:40)
	at org.apache.uima.ruta.rule.RutaRule.apply(RutaRule.java:29)
	at org.apache.uima.ruta.RutaScriptBlock.apply(RutaScriptBlock.java:63)
	at org.apache.uima.ruta.RutaModule.apply(RutaModule.java:48)
	at org.apache.uima.ruta.engine.RutaEngine.process(RutaEngine.java:533)
	... 29 more

Tests run: 3, Failures: 0, Errors: 0, Skipped: 0, Time elapsed: 0.095 sec - in org.apache.uima.ruta.StrictImportTest
Running org.apache.uima.ruta.SubAtomicTest
Tests run: 1, Failures: 0, Errors: 0, Skipped: 0, Time elapsed: 0.14 sec - in org.apache.uima.ruta.SubAtomicTest
Running org.apache.uima.ruta.TypeAliasTest
Tests run: 1, Failures: 0, Errors: 0, Skipped: 0, Time elapsed: 0.026 sec - in org.apache.uima.ruta.TypeAliasTest
Running org.apache.uima.ruta.verbalizer.ActionVerbalizerTest
Tests run: 1, Failures: 0, Errors: 0, Skipped: 0, Time elapsed: 0.002 sec - in org.apache.uima.ruta.verbalizer.ActionVerbalizerTest
Running org.apache.uima.ruta.verbalizer.ConditionVerbalizerTest
Tests run: 1, Failures: 0, Errors: 0, Skipped: 0, Time elapsed: 0.002 sec - in org.apache.uima.ruta.verbalizer.ConditionVerbalizerTest
Running org.apache.uima.ruta.verbalizer.ExpressionVerbalizerTest
Tests run: 1, Failures: 0, Errors: 0, Skipped: 0, Time elapsed: 0.001 sec - in org.apache.uima.ruta.verbalizer.ExpressionVerbalizerTest
Running org.apache.uima.ruta.WildCard1Test
Tests run: 1, Failures: 0, Errors: 0, Skipped: 0, Time elapsed: 0.568 sec - in org.apache.uima.ruta.WildCard1Test
Running org.apache.uima.ruta.WildCard2Test
Tests run: 1, Failures: 0, Errors: 0, Skipped: 0, Time elapsed: 0.09 sec - in org.apache.uima.ruta.WildCard2Test
Running org.apache.uima.ruta.WildCard3Test
Tests run: 1, Failures: 0, Errors: 0, Skipped: 0, Time elapsed: 0.036 sec - in org.apache.uima.ruta.WildCard3Test
Running org.apache.uima.ruta.WSDictionaryTest
Tests run: 3, Failures: 0, Errors: 0, Skipped: 0, Time elapsed: 0.218 sec - in org.apache.uima.ruta.WSDictionaryTest

Results :

Tests run: 176, Failures: 0, Errors: 0, Skipped: 0

[JENKINS] Recording test results
[INFO] 
[INFO] --- maven-antrun-plugin:1.7:run (dup-meta-jar-cleanup) @ ruta-core ---
[INFO] Executing tasks

main:
[INFO] Executed tasks
[INFO] 
[INFO] --- maven-resources-plugin:2.6:copy-resources (copy customized bin LICENSE file) @
ruta-core ---
[INFO] Using 'UTF-8' encoding to copy filtered resources.
[INFO] skip non existing resourceDirectory F:\jenkins\jenkins-slave\workspace\UIMA-Ruta\trunk\ruta-core\src\main\readme_bin
[INFO] 
[INFO] --- maven-jar-plugin:2.3.2:jar (default-jar) @ ruta-core ---
[INFO] Building jar: F:\jenkins\jenkins-slave\workspace\UIMA-Ruta\trunk\ruta-core\target\ruta-core-2.3.0-SNAPSHOT.jar
[INFO] 
[INFO] --- maven-site-plugin:3.3:attach-descriptor (attach-descriptor) @ ruta-core ---
[INFO] 
[INFO] --- maven-install-plugin:2.5.1:install (default-install) @ ruta-core ---
[INFO] Installing F:\jenkins\jenkins-slave\workspace\UIMA-Ruta\trunk\ruta-core\target\ruta-core-2.3.0-SNAPSHOT.jar
to f:\jenkins\jenkins-slave\maven-repositories\0\org\apache\uima\ruta-core\2.3.0-SNAPSHOT\ruta-core-2.3.0-SNAPSHOT.jar
[INFO] Installing F:\jenkins\jenkins-slave\workspace\UIMA-Ruta\trunk\ruta-core\pom.xml to
f:\jenkins\jenkins-slave\maven-repositories\0\org\apache\uima\ruta-core\2.3.0-SNAPSHOT\ruta-core-2.3.0-SNAPSHOT.pom
[INFO] 
[INFO] --- maven-pmd-plugin:3.3:pmd (default-cli) @ ruta-core ---
[PMD] Finding all files that match the pattern pmd.xml
[PMD] Parsing 1 files in F:\jenkins\jenkins-slave\workspace\UIMA-Ruta\trunk\ruta-core\target
[PMD] Successfully parsed file F:\jenkins\jenkins-slave\workspace\UIMA-Ruta\trunk\ruta-core\target\pmd.xml
of module Apache UIMA Ruta: ruta-core with 138 warnings.
[PMD] Computing warning deltas based on reference build #479
[INFO] 
[INFO] --- maven-pmd-plugin:3.3:cpd (default-cli) @ ruta-core ---
[DRY] Finding all files that match the pattern cpd.xml
[DRY] Parsing 1 files in F:\jenkins\jenkins-slave\workspace\UIMA-Ruta\trunk\ruta-core\target
[DRY] Successfully parsed file F:\jenkins\jenkins-slave\workspace\UIMA-Ruta\trunk\ruta-core\target\cpd.xml
of module Apache UIMA Ruta: ruta-core with 77 warnings.
[DRY] Computing warning deltas based on reference build #479
[INFO] 
[INFO] --- maven-enforcer-plugin:1.3.1:enforce (enforce-versions) @ ruta-core ---
[INFO] 
[INFO] --- build-helper-maven-plugin:1.8:parse-version (parse-project-version) @ ruta-core
---
[INFO] 
[INFO] --- uima-build-helper-maven-plugin:7:parse-date-time (set buildYear and buildMonth)
@ ruta-core ---
[INFO] 
[INFO] --- antlr3-maven-plugin:3.5.2:antlr (run antlr) @ ruta-core ---
[INFO] ANTLR: Processing source directory F:\jenkins\jenkins-slave\workspace\UIMA-Ruta\trunk\ruta-core\src\main\antlr3
ANTLR Parser Generator  Version 3.5.2
Grammar F:\jenkins\jenkins-slave\workspace\UIMA-Ruta\trunk\ruta-core\src\main\antlr3\org\apache\uima\ruta\parser\RutaLexer.g
is up to date - build skipped
Grammar F:\jenkins\jenkins-slave\workspace\UIMA-Ruta\trunk\ruta-core\src\main\antlr3\org\apache\uima\ruta\parser\RutaParser.g
is up to date - build skipped
[INFO] 
[INFO] --- build-helper-maven-plugin:1.8:add-source (add-source) @ ruta-core ---
[INFO] Source directory: F:\jenkins\jenkins-slave\workspace\UIMA-Ruta\trunk\ruta-core\target\generated-sources\antlr3
added.
[INFO] 
[INFO] --- maven-remote-resources-plugin:1.5:process (default) @ ruta-core ---
[INFO] 
[INFO] --- maven-resources-plugin:2.6:resources (default-resources) @ ruta-core ---
[INFO] Using 'UTF-8' encoding to copy filtered resources.
[INFO] Copying 20 resources
[INFO] Copying 3 resources
[INFO] Copying 3 resources
[INFO] 
[INFO] --- maven-compiler-plugin:3.1:compile (default-compile) @ ruta-core ---
[INFO] Nothing to compile - all classes are up to date
[INFO] 
[INFO] --- cobertura-maven-plugin:2.6:instrument (default-cli) @ ruta-core ---

Mime
View raw message