uima-dev mailing list archives

Site index · List index
Message view « Date » · « Thread »
Top « Date » · « Thread »
From Apache Jenkins Server <jenk...@builds.apache.org>
Subject Build failed in Jenkins: UIMA-Ruta #481
Date Fri, 16 Jan 2015 15:00:43 GMT
See <https://builds.apache.org/job/UIMA-Ruta/481/changes>

Changes:

[pkluegl] no jira - fixed Br. -> Am. english

------------------------------------------
[...truncated 3171 lines...]
	at org.junit.runners.ParentRunner.run(ParentRunner.java:220)
	at org.apache.maven.surefire.junit4.JUnit4Provider.execute(JUnit4Provider.java:264)
	at org.apache.maven.surefire.junit4.JUnit4Provider.executeTestSet(JUnit4Provider.java:153)
	at org.apache.maven.surefire.junit4.JUnit4Provider.invoke(JUnit4Provider.java:124)
	at org.apache.maven.surefire.booter.ForkedBooter.invokeProviderInSameClassLoader(ForkedBooter.java:200)
	at org.apache.maven.surefire.booter.ForkedBooter.runSuitesInProcess(ForkedBooter.java:153)
	at org.apache.maven.surefire.booter.ForkedBooter.main(ForkedBooter.java:103)
Caused by: java.lang.IllegalArgumentException: Not able to resolve type: MyType
	at org.apache.uima.ruta.expression.type.SimpleTypeExpression.getType(SimpleTypeExpression.java:47)
	at org.apache.uima.ruta.action.AbstractMarkAction.createAnnotation(AbstractMarkAction.java:42)
	at org.apache.uima.ruta.action.MarkAction.execute(MarkAction.java:57)
	at org.apache.uima.ruta.rule.AbstractRuleElement.apply(AbstractRuleElement.java:130)
	at org.apache.uima.ruta.rule.RuleElementCaretaker.applyRuleElements(RuleElementCaretaker.java:111)
	at org.apache.uima.ruta.rule.ComposedRuleElement.applyRuleElements(ComposedRuleElement.java:593)
	at org.apache.uima.ruta.rule.AbstractRuleElement.doneMatching(AbstractRuleElement.java:84)
	at org.apache.uima.ruta.rule.ComposedRuleElement.fallback(ComposedRuleElement.java:514)
	at org.apache.uima.ruta.rule.ComposedRuleElement.fallbackContinue(ComposedRuleElement.java:415)
	at org.apache.uima.ruta.rule.RutaRuleElement.startMatch(RutaRuleElement.java:102)
	at org.apache.uima.ruta.rule.ComposedRuleElement.startMatch(ComposedRuleElement.java:74)
	at org.apache.uima.ruta.rule.RutaRule.apply(RutaRule.java:47)
	at org.apache.uima.ruta.rule.RutaRule.apply(RutaRule.java:40)
	at org.apache.uima.ruta.rule.RutaRule.apply(RutaRule.java:29)
	at org.apache.uima.ruta.RutaScriptBlock.apply(RutaScriptBlock.java:63)
	at org.apache.uima.ruta.RutaModule.apply(RutaModule.java:48)
	at org.apache.uima.ruta.engine.RutaEngine.process(RutaEngine.java:533)
	... 29 more

Tests run: 3, Failures: 0, Errors: 0, Skipped: 0, Time elapsed: 0.096 sec - in org.apache.uima.ruta.StrictImportTest
Running org.apache.uima.ruta.SubAtomicTest
Tests run: 1, Failures: 0, Errors: 0, Skipped: 0, Time elapsed: 0.045 sec - in org.apache.uima.ruta.SubAtomicTest
Running org.apache.uima.ruta.TypeAliasTest
Tests run: 1, Failures: 0, Errors: 0, Skipped: 0, Time elapsed: 0.051 sec - in org.apache.uima.ruta.TypeAliasTest
Running org.apache.uima.ruta.verbalizer.ActionVerbalizerTest
Tests run: 1, Failures: 0, Errors: 0, Skipped: 0, Time elapsed: 0.003 sec - in org.apache.uima.ruta.verbalizer.ActionVerbalizerTest
Running org.apache.uima.ruta.verbalizer.ConditionVerbalizerTest
Tests run: 1, Failures: 0, Errors: 0, Skipped: 0, Time elapsed: 0.002 sec - in org.apache.uima.ruta.verbalizer.ConditionVerbalizerTest
Running org.apache.uima.ruta.verbalizer.ExpressionVerbalizerTest
Tests run: 1, Failures: 0, Errors: 0, Skipped: 0, Time elapsed: 0.001 sec - in org.apache.uima.ruta.verbalizer.ExpressionVerbalizerTest
Running org.apache.uima.ruta.WildCard1Test
Tests run: 1, Failures: 0, Errors: 0, Skipped: 0, Time elapsed: 0.561 sec - in org.apache.uima.ruta.WildCard1Test
Running org.apache.uima.ruta.WildCard2Test
Tests run: 1, Failures: 0, Errors: 0, Skipped: 0, Time elapsed: 0.093 sec - in org.apache.uima.ruta.WildCard2Test
Running org.apache.uima.ruta.WildCard3Test
Tests run: 1, Failures: 0, Errors: 0, Skipped: 0, Time elapsed: 0.036 sec - in org.apache.uima.ruta.WildCard3Test
Running org.apache.uima.ruta.WSDictionaryTest
Tests run: 3, Failures: 0, Errors: 0, Skipped: 0, Time elapsed: 0.227 sec - in org.apache.uima.ruta.WSDictionaryTest

Results :

Tests run: 176, Failures: 0, Errors: 0, Skipped: 0

[JENKINS] Recording test results
[INFO] 
[INFO] --- maven-antrun-plugin:1.7:run (dup-meta-jar-cleanup) @ ruta-core ---
[INFO] Executing tasks

main:
[INFO] Executed tasks
[INFO] 
[INFO] --- maven-resources-plugin:2.6:copy-resources (copy customized bin LICENSE file) @
ruta-core ---
[INFO] Using 'UTF-8' encoding to copy filtered resources.
[INFO] skip non existing resourceDirectory F:\jenkins\jenkins-slave\workspace\UIMA-Ruta\trunk\ruta-core\src\main\readme_bin
[INFO] 
[INFO] --- maven-jar-plugin:2.3.2:jar (default-jar) @ ruta-core ---
[INFO] Building jar: F:\jenkins\jenkins-slave\workspace\UIMA-Ruta\trunk\ruta-core\target\ruta-core-2.3.0-SNAPSHOT.jar
[INFO] 
[INFO] --- maven-site-plugin:3.3:attach-descriptor (attach-descriptor) @ ruta-core ---
[INFO] 
[INFO] --- maven-install-plugin:2.5.1:install (default-install) @ ruta-core ---
[INFO] Installing F:\jenkins\jenkins-slave\workspace\UIMA-Ruta\trunk\ruta-core\target\ruta-core-2.3.0-SNAPSHOT.jar
to f:\jenkins\jenkins-slave\maven-repositories\1\org\apache\uima\ruta-core\2.3.0-SNAPSHOT\ruta-core-2.3.0-SNAPSHOT.jar
[INFO] Installing F:\jenkins\jenkins-slave\workspace\UIMA-Ruta\trunk\ruta-core\pom.xml to
f:\jenkins\jenkins-slave\maven-repositories\1\org\apache\uima\ruta-core\2.3.0-SNAPSHOT\ruta-core-2.3.0-SNAPSHOT.pom
[INFO] 
[INFO] --- maven-pmd-plugin:3.3:pmd (default-cli) @ ruta-core ---
[PMD] Finding all files that match the pattern pmd.xml
[PMD] Parsing 1 files in F:\jenkins\jenkins-slave\workspace\UIMA-Ruta\trunk\ruta-core\target
[PMD] Successfully parsed file F:\jenkins\jenkins-slave\workspace\UIMA-Ruta\trunk\ruta-core\target\pmd.xml
of module Apache UIMA Ruta: ruta-core with 138 warnings.
[PMD] Computing warning deltas based on reference build #479
[INFO] 
[INFO] --- maven-pmd-plugin:3.3:cpd (default-cli) @ ruta-core ---
[DRY] Finding all files that match the pattern cpd.xml
[DRY] Parsing 1 files in F:\jenkins\jenkins-slave\workspace\UIMA-Ruta\trunk\ruta-core\target
[DRY] Successfully parsed file F:\jenkins\jenkins-slave\workspace\UIMA-Ruta\trunk\ruta-core\target\cpd.xml
of module Apache UIMA Ruta: ruta-core with 77 warnings.
[DRY] Computing warning deltas based on reference build #479
[INFO] 
[INFO] --- maven-enforcer-plugin:1.3.1:enforce (enforce-versions) @ ruta-core ---
[INFO] 
[INFO] --- build-helper-maven-plugin:1.8:parse-version (parse-project-version) @ ruta-core
---
[INFO] 
[INFO] --- uima-build-helper-maven-plugin:7:parse-date-time (set buildYear and buildMonth)
@ ruta-core ---
[INFO] 
[INFO] --- antlr3-maven-plugin:3.5.2:antlr (run antlr) @ ruta-core ---
[INFO] ANTLR: Processing source directory F:\jenkins\jenkins-slave\workspace\UIMA-Ruta\trunk\ruta-core\src\main\antlr3
ANTLR Parser Generator  Version 3.5.2
Grammar F:\jenkins\jenkins-slave\workspace\UIMA-Ruta\trunk\ruta-core\src\main\antlr3\org\apache\uima\ruta\parser\RutaLexer.g
is up to date - build skipped
Grammar F:\jenkins\jenkins-slave\workspace\UIMA-Ruta\trunk\ruta-core\src\main\antlr3\org\apache\uima\ruta\parser\RutaParser.g
is up to date - build skipped
[INFO] 
[INFO] --- build-helper-maven-plugin:1.8:add-source (add-source) @ ruta-core ---
[INFO] Source directory: F:\jenkins\jenkins-slave\workspace\UIMA-Ruta\trunk\ruta-core\target\generated-sources\antlr3
added.
[INFO] 
[INFO] --- maven-remote-resources-plugin:1.5:process (default) @ ruta-core ---
[INFO] 
[INFO] --- maven-resources-plugin:2.6:resources (default-resources) @ ruta-core ---
[INFO] Using 'UTF-8' encoding to copy filtered resources.
[INFO] Copying 20 resources
[INFO] Copying 3 resources
[INFO] Copying 3 resources
[INFO] 
[INFO] --- maven-compiler-plugin:3.1:compile (default-compile) @ ruta-core ---
[INFO] Nothing to compile - all classes are up to date
[INFO] 
[INFO] --- cobertura-maven-plugin:2.6:instrument (default-cli) @ ruta-core ---
[INFO] ------------------------------------------------------------------------
[INFO] Reactor Summary:
[INFO] 
[INFO] Apache UIMA Ruta: ruta-parent ..................... SUCCESS [51.958s]
[INFO] Apache UIMA Ruta: ruta-core ....................... FAILURE [1:36.391s]
[INFO] Apache UIMA Ruta: ruta-core-ext ................... SKIPPED
[INFO] Apache UIMA Ruta Eclipse: ruta-ep-engine .......... SKIPPED
[INFO] Apache UIMA Ruta Eclipse: ruta-ep-ide ............. SKIPPED
[INFO] Apache UIMA Ruta Eclipse: ruta-ep-ide-ui .......... SKIPPED
[INFO] Apache UIMA Ruta Eclipse: ruta-ep-caseditor ....... SKIPPED
[INFO] Apache UIMA Ruta Eclipse: ruta-ep-addons .......... SKIPPED
[INFO] Apache UIMA Ruta Eclipse: ruta-ep-textruler ....... SKIPPED
[INFO] Apache UIMA Ruta Eclipse: ruta-ep-core-ext ........ SKIPPED
[INFO] Apache UIMA Ruta Documentation .................... SKIPPED
[INFO] Apache UIMA Ruta Eclipse: ruta-eclipse-feature .... SKIPPED
[INFO] Apache UIMA Ruta: ruta-ep-example-extensions ...... SKIPPED
[INFO] Apache UIMA Ruta: ruta ............................ SKIPPED
[INFO] ------------------------------------------------------------------------
[INFO] BUILD FAILURE
[INFO] ------------------------------------------------------------------------
[INFO] Total time: 2:51.303s
[INFO] Finished at: Fri Jan 16 07:00:05 PST 2015
[INFO] Final Memory: 55M/226M
[INFO] ------------------------------------------------------------------------
Waiting for Jenkins to finish collecting data
[ERROR] Failed to execute goal org.codehaus.mojo:cobertura-maven-plugin:2.6:instrument (default-cli)
on project ruta-core: Unable to obtain CommandsFile location. There is not enough space on
the disk -> [Help 1]
[ERROR] 
[ERROR] To see the full stack trace of the errors, re-run Maven with the -e switch.
[ERROR] Re-run Maven using the -X switch to enable full debug logging.
[ERROR] 
[ERROR] For more information about the errors and possible solutions, please read the following
articles:
[ERROR] [Help 1] http://cwiki.apache.org/confluence/display/MAVEN/MojoExecutionException
[ERROR] 
[ERROR] After correcting the problems, you can resume the build with the command
[ERROR]   mvn <goals> -rf :ruta-core
[JENKINS] Archiving F:\jenkins\jenkins-slave\workspace\UIMA-Ruta\trunk\ruta-ep-textruler\pom.xml
to org.apache.uima/ruta-ep-textruler/2.3.0-SNAPSHOT/ruta-ep-textruler-2.3.0-SNAPSHOT.pom
Sending artifact delta relative to UIMA-Ruta » Apache UIMA Ruta Eclipse: ruta-ep-textruler
#479
Archived 1 artifacts
Archive block size is 32768
Received 0 blocks and 8782 bytes
Compression is 0.0%
Took 72 ms
[JENKINS] Archiving F:\jenkins\jenkins-slave\workspace\UIMA-Ruta\trunk\ruta-eclipse-feature\pom.xml
to org.apache.uima/ruta-eclipse-feature/2.3.0-SNAPSHOT/ruta-eclipse-feature-2.3.0-SNAPSHOT.pom
Sending artifact delta relative to UIMA-Ruta » Apache UIMA Ruta Eclipse: ruta-eclipse-feature
#479
Archived 1 artifacts
Archive block size is 32768
Received 0 blocks and 4246 bytes
Compression is 0.0%
Took 51 ms
[JENKINS] Archiving F:\jenkins\jenkins-slave\workspace\UIMA-Ruta\trunk\ruta-docbook\pom.xml
to org.apache.uima/ruta-docbook/2.3.0-SNAPSHOT/ruta-docbook-2.3.0-SNAPSHOT.pom
Sending artifact delta relative to UIMA-Ruta » Apache UIMA Ruta Documentation #479
Archived 1 artifacts
Archive block size is 32768
Received 0 blocks and 2096 bytes
Compression is 0.0%
Took 15 ms
[JENKINS] Archiving F:\jenkins\jenkins-slave\workspace\UIMA-Ruta\trunk\example-projects\ruta-ep-example-extensions\pom.xml
to org.apache.uima/ruta-ep-example-extensions/2.3.0-SNAPSHOT/ruta-ep-example-extensions-2.3.0-SNAPSHOT.pom
Sending artifact delta relative to UIMA-Ruta » Apache UIMA Ruta: ruta-ep-example-extensions
#479
Archived 1 artifacts
Archive block size is 32768
Received 0 blocks and 6122 bytes
Compression is 0.0%
Took 29 ms
[JENKINS] Archiving F:\jenkins\jenkins-slave\workspace\UIMA-Ruta\trunk\ruta-ep-core-ext\pom.xml
to org.apache.uima/ruta-ep-core-ext/2.3.0-SNAPSHOT/ruta-ep-core-ext-2.3.0-SNAPSHOT.pom
Sending artifact delta relative to UIMA-Ruta » Apache UIMA Ruta Eclipse: ruta-ep-core-ext
#479
Archived 1 artifacts
Archive block size is 32768
Received 0 blocks and 6081 bytes
Compression is 0.0%
Took 38 ms
[JENKINS] Archiving F:\jenkins\jenkins-slave\workspace\UIMA-Ruta\trunk\ruta-core\pom.xml to
org.apache.uima/ruta-core/2.3.0-SNAPSHOT/ruta-core-2.3.0-SNAPSHOT.pom
[JENKINS] Archiving F:\jenkins\jenkins-slave\workspace\UIMA-Ruta\trunk\ruta-core\target\ruta-core-2.3.0-SNAPSHOT.jar
to org.apache.uima/ruta-core/2.3.0-SNAPSHOT/ruta-core-2.3.0-SNAPSHOT.jar
Sending artifact delta relative to UIMA-Ruta » Apache UIMA Ruta: ruta-core #479
Archived 2 artifacts
Archive block size is 32768
Received 3 blocks and 782320 bytes
Compression is 11.2%
Took 0.25 sec
[JENKINS] Archiving F:\jenkins\jenkins-slave\workspace\UIMA-Ruta\trunk\ruta-parent\pom.xml
to org.apache.uima/ruta-parent/2.3.0-SNAPSHOT/ruta-parent-2.3.0-SNAPSHOT.pom
Sending artifact delta relative to UIMA-Ruta » Apache UIMA Ruta: ruta-parent #480
Archived 1 artifacts
Archive block size is 32768
Received 0 blocks and 7952 bytes
Compression is 0.0%
Took 47 ms
[JENKINS] Archiving F:\jenkins\jenkins-slave\workspace\UIMA-Ruta\trunk\ruta-ep-caseditor\pom.xml
to org.apache.uima/ruta-ep-caseditor/2.3.0-SNAPSHOT/ruta-ep-caseditor-2.3.0-SNAPSHOT.pom
Sending artifact delta relative to UIMA-Ruta » Apache UIMA Ruta Eclipse: ruta-ep-caseditor
#479
Archived 1 artifacts
Archive block size is 32768
Received 0 blocks and 7536 bytes
Compression is 0.0%
Took 57 ms
[JENKINS] Archiving F:\jenkins\jenkins-slave\workspace\UIMA-Ruta\trunk\ruta-ep-ide\pom.xml
to org.apache.uima/ruta-ep-ide/2.3.0-SNAPSHOT/ruta-ep-ide-2.3.0-SNAPSHOT.pom
Sending artifact delta relative to UIMA-Ruta » Apache UIMA Ruta Eclipse: ruta-ep-ide #479
Archived 1 artifacts
Archive block size is 32768
Received 0 blocks and 9561 bytes
Compression is 0.0%
Took 52 ms
[JENKINS] Archiving F:\jenkins\jenkins-slave\workspace\UIMA-Ruta\trunk\ruta-ep-addons\pom.xml
to org.apache.uima/ruta-ep-addons/2.3.0-SNAPSHOT/ruta-ep-addons-2.3.0-SNAPSHOT.pom
Sending artifact delta relative to UIMA-Ruta » Apache UIMA Ruta Eclipse: ruta-ep-addons #479
Archived 1 artifacts
Archive block size is 32768
Received 0 blocks and 9616 bytes
Compression is 0.0%
Took 0.11 sec
[JENKINS] Archiving <https://builds.apache.org/job/UIMA-Ruta/ws/trunk\pom.xml> to org.apache.uima/ruta/2.3.0-SNAPSHOT/ruta-2.3.0-SNAPSHOT.pom
Sending artifact delta relative to UIMA-Ruta » Apache UIMA Ruta: ruta #479
Archived 1 artifacts
Archive block size is 32768
Received 0 blocks and 9499 bytes
Compression is 0.0%
Took 0.83 sec
[JENKINS] Archiving F:\jenkins\jenkins-slave\workspace\UIMA-Ruta\trunk\ruta-ep-engine\pom.xml
to org.apache.uima/ruta-ep-engine/2.3.0-SNAPSHOT/ruta-ep-engine-2.3.0-SNAPSHOT.pom
Sending artifact delta relative to UIMA-Ruta » Apache UIMA Ruta Eclipse: ruta-ep-engine #479
Archived 1 artifacts
Archive block size is 32768
Received 0 blocks and 14534 bytes
Compression is 0.0%
Took 0.24 sec
[JENKINS] Archiving F:\jenkins\jenkins-slave\workspace\UIMA-Ruta\trunk\ruta-core-ext\pom.xml
to org.apache.uima/ruta-core-ext/2.3.0-SNAPSHOT/ruta-core-ext-2.3.0-SNAPSHOT.pom
Sending artifact delta relative to UIMA-Ruta » Apache UIMA Ruta: ruta-core-ext #479
Archived 1 artifacts
Archive block size is 32768
Received 0 blocks and 3143 bytes
Compression is 0.0%
Took 67 ms
[JENKINS] Archiving F:\jenkins\jenkins-slave\workspace\UIMA-Ruta\trunk\ruta-ep-ide-ui\pom.xml
to org.apache.uima/ruta-ep-ide-ui/2.3.0-SNAPSHOT/ruta-ep-ide-ui-2.3.0-SNAPSHOT.pom
Sending artifact delta relative to UIMA-Ruta » Apache UIMA Ruta Eclipse: ruta-ep-ide-ui #479
Archived 1 artifacts
Archive block size is 32768
Received 0 blocks and 13097 bytes
Compression is 0.0%
Took 80 ms
Sending e-mails to: dev@uima.apache.org
channel stopped
[WARNINGS] Skipping publisher since build result is FAILURE
Skipping Cobertura coverage report as build was not UNSTABLE or better ...

Mime
View raw message