uima-dev mailing list archives

Site index · List index
Message view « Date » · « Thread »
Top « Date » · « Thread »
From Apache Jenkins Server <jenk...@builds.apache.org>
Subject Build failed in Jenkins: UIMA-Ruta » Apache UIMA Ruta: ruta-core #470
Date Thu, 08 Jan 2015 18:00:38 GMT
See <https://builds.apache.org/job/UIMA-Ruta/org.apache.uima$ruta-core/470/changes>

Changes:

[pkluegl] UIMA-4165
- added NullExpression
- adapted parser
- added test
- refactored FeatureCondition

------------------------------------------
[...truncated 928 lines...]
	at org.apache.uima.ruta.expression.type.SimpleTypeExpression.getType(SimpleTypeExpression.java:45)
	at org.apache.uima.ruta.action.AbstractMarkAction.createAnnotation(AbstractMarkAction.java:42)
	at org.apache.uima.ruta.action.MarkAction.execute(MarkAction.java:57)
	at org.apache.uima.ruta.rule.AbstractRuleElement.apply(AbstractRuleElement.java:130)
	at org.apache.uima.ruta.rule.RuleElementCaretaker.applyRuleElements(RuleElementCaretaker.java:111)
	at org.apache.uima.ruta.rule.ComposedRuleElement.applyRuleElements(ComposedRuleElement.java:592)
	at org.apache.uima.ruta.rule.AbstractRuleElement.doneMatching(AbstractRuleElement.java:84)
	at org.apache.uima.ruta.rule.ComposedRuleElement.fallback(ComposedRuleElement.java:513)
	at org.apache.uima.ruta.rule.ComposedRuleElement.fallbackContinue(ComposedRuleElement.java:414)
	at org.apache.uima.ruta.rule.RutaRuleElement.startMatch(RutaRuleElement.java:102)
	at org.apache.uima.ruta.rule.ComposedRuleElement.startMatch(ComposedRuleElement.java:73)
	at org.apache.uima.ruta.rule.RutaRule.apply(RutaRule.java:47)
	at org.apache.uima.ruta.rule.RutaRule.apply(RutaRule.java:40)
	at org.apache.uima.ruta.rule.RutaRule.apply(RutaRule.java:29)
	at org.apache.uima.ruta.RutaScriptBlock.apply(RutaScriptBlock.java:63)
	at org.apache.uima.ruta.RutaModule.apply(RutaModule.java:48)
	at org.apache.uima.ruta.engine.RutaEngine.process(RutaEngine.java:503)
	... 29 more

Jan 08, 2015 10:00:01 AM org.apache.uima.analysis_engine.impl.PrimitiveAnalysisEngine_impl
callAnalysisComponentProcess(417)
SEVERE: Exception occurred
org.apache.uima.analysis_engine.AnalysisEngineProcessException: Annotator processing failed.
   
	at org.apache.uima.ruta.engine.RutaEngine.process(RutaEngine.java:505)
	at org.apache.uima.analysis_component.JCasAnnotator_ImplBase.process(JCasAnnotator_ImplBase.java:48)
	at org.apache.uima.analysis_engine.impl.PrimitiveAnalysisEngine_impl.callAnalysisComponentProcess(PrimitiveAnalysisEngine_impl.java:385)
	at org.apache.uima.analysis_engine.impl.PrimitiveAnalysisEngine_impl.processAndOutputNewCASes(PrimitiveAnalysisEngine_impl.java:309)
	at org.apache.uima.analysis_engine.impl.AnalysisEngineImplBase.process(AnalysisEngineImplBase.java:267)
	at org.apache.uima.ruta.ImportStatementsTest.testUnimportedTypesAreNotResolved(ImportStatementsTest.java:108)
	at sun.reflect.NativeMethodAccessorImpl.invoke0(Native Method)
	at sun.reflect.NativeMethodAccessorImpl.invoke(NativeMethodAccessorImpl.java:57)
	at sun.reflect.DelegatingMethodAccessorImpl.invoke(DelegatingMethodAccessorImpl.java:43)
	at java.lang.reflect.Method.invoke(Method.java:601)
	at org.junit.runners.model.FrameworkMethod$1.runReflectiveCall(FrameworkMethod.java:44)
	at org.junit.internal.runners.model.ReflectiveCallable.run(ReflectiveCallable.java:15)
	at org.junit.runners.model.FrameworkMethod.invokeExplosively(FrameworkMethod.java:41)
	at org.junit.internal.runners.statements.InvokeMethod.evaluate(InvokeMethod.java:20)
	at org.junit.internal.runners.statements.RunBefores.evaluate(RunBefores.java:28)
	at org.junit.internal.runners.statements.RunAfters.evaluate(RunAfters.java:31)
	at org.junit.runners.BlockJUnit4ClassRunner.runChild(BlockJUnit4ClassRunner.java:73)
	at org.junit.runners.BlockJUnit4ClassRunner.runChild(BlockJUnit4ClassRunner.java:46)
	at org.junit.runners.ParentRunner.runChildren(ParentRunner.java:180)
	at org.junit.runners.ParentRunner.access$000(ParentRunner.java:41)
	at org.junit.runners.ParentRunner$1.evaluate(ParentRunner.java:173)
	at org.junit.internal.runners.statements.RunBefores.evaluate(RunBefores.java:28)
	at org.junit.internal.runners.statements.RunAfters.evaluate(RunAfters.java:31)
	at org.junit.runners.ParentRunner.run(ParentRunner.java:220)
	at org.apache.maven.surefire.junit4.JUnit4Provider.execute(JUnit4Provider.java:264)
	at org.apache.maven.surefire.junit4.JUnit4Provider.executeTestSet(JUnit4Provider.java:153)
	at org.apache.maven.surefire.junit4.JUnit4Provider.invoke(JUnit4Provider.java:124)
	at org.apache.maven.surefire.booter.ForkedBooter.invokeProviderInSameClassLoader(ForkedBooter.java:200)
	at org.apache.maven.surefire.booter.ForkedBooter.runSuitesInProcess(ForkedBooter.java:153)
	at org.apache.maven.surefire.booter.ForkedBooter.main(ForkedBooter.java:103)
Caused by: java.lang.IllegalArgumentException: Not able to resolve type: Type2
	at org.apache.uima.ruta.expression.type.SimpleTypeExpression.getType(SimpleTypeExpression.java:47)
	at org.apache.uima.ruta.action.AbstractMarkAction.createAnnotation(AbstractMarkAction.java:42)
	at org.apache.uima.ruta.action.MarkAction.execute(MarkAction.java:57)
	at org.apache.uima.ruta.rule.AbstractRuleElement.apply(AbstractRuleElement.java:130)
	at org.apache.uima.ruta.rule.RuleElementCaretaker.applyRuleElements(RuleElementCaretaker.java:111)
	at org.apache.uima.ruta.rule.ComposedRuleElement.applyRuleElements(ComposedRuleElement.java:592)
	at org.apache.uima.ruta.rule.AbstractRuleElement.doneMatching(AbstractRuleElement.java:84)
	at org.apache.uima.ruta.rule.ComposedRuleElement.fallback(ComposedRuleElement.java:513)
	at org.apache.uima.ruta.rule.ComposedRuleElement.fallbackContinue(ComposedRuleElement.java:414)
	at org.apache.uima.ruta.rule.RutaRuleElement.startMatch(RutaRuleElement.java:102)
	at org.apache.uima.ruta.rule.ComposedRuleElement.startMatch(ComposedRuleElement.java:73)
	at org.apache.uima.ruta.rule.RutaRule.apply(RutaRule.java:47)
	at org.apache.uima.ruta.rule.RutaRule.apply(RutaRule.java:40)
	at org.apache.uima.ruta.rule.RutaRule.apply(RutaRule.java:29)
	at org.apache.uima.ruta.RutaScriptBlock.apply(RutaScriptBlock.java:63)
	at org.apache.uima.ruta.RutaModule.apply(RutaModule.java:48)
	at org.apache.uima.ruta.engine.RutaEngine.process(RutaEngine.java:503)
	... 29 more

Tests run: 13, Failures: 0, Errors: 0, Skipped: 0, Time elapsed: 1.007 sec - in org.apache.uima.ruta.ImportStatementsTest
Running org.apache.uima.ruta.IncompletePartitioningTest
Tests run: 1, Failures: 0, Errors: 0, Skipped: 0, Time elapsed: 0.052 sec - in org.apache.uima.ruta.IncompletePartitioningTest
Running org.apache.uima.ruta.InlinedRulesTest
Tests run: 1, Failures: 0, Errors: 0, Skipped: 0, Time elapsed: 0.186 sec - in org.apache.uima.ruta.InlinedRulesTest
Running org.apache.uima.ruta.InvisibleWildcardMatchTest
Tests run: 1, Failures: 0, Errors: 0, Skipped: 0, Time elapsed: 0.138 sec - in org.apache.uima.ruta.InvisibleWildcardMatchTest
Running org.apache.uima.ruta.LiteralStringMatchTest
Tests run: 1, Failures: 0, Errors: 0, Skipped: 0, Time elapsed: 0.131 sec - in org.apache.uima.ruta.LiteralStringMatchTest
Running org.apache.uima.ruta.LoadResourceFromClassPathTest
Tests run: 2, Failures: 0, Errors: 0, Skipped: 0, Time elapsed: 0.112 sec - in org.apache.uima.ruta.LoadResourceFromClassPathTest
Running org.apache.uima.ruta.LoadScriptFromClassPathTest
Tests run: 1, Failures: 0, Errors: 0, Skipped: 0, Time elapsed: 0.752 sec - in org.apache.uima.ruta.LoadScriptFromClassPathTest
Running org.apache.uima.ruta.LongGreedy1Test
Tests run: 1, Failures: 0, Errors: 0, Skipped: 0, Time elapsed: 0.001 sec - in org.apache.uima.ruta.LongGreedy1Test
Running org.apache.uima.ruta.LongGreedy2Test
Tests run: 1, Failures: 0, Errors: 0, Skipped: 0, Time elapsed: 0.001 sec - in org.apache.uima.ruta.LongGreedy2Test
Running org.apache.uima.ruta.ManualAnchoringTest
Tests run: 1, Failures: 0, Errors: 0, Skipped: 0, Time elapsed: 0.171 sec - in org.apache.uima.ruta.ManualAnchoringTest
Running org.apache.uima.ruta.MarkInGreedyComposedTest
Tests run: 6, Failures: 0, Errors: 0, Skipped: 0, Time elapsed: 0.372 sec - in org.apache.uima.ruta.MarkInGreedyComposedTest
Running org.apache.uima.ruta.NBSPWSTest
Tests run: 1, Failures: 0, Errors: 0, Skipped: 0, Time elapsed: 0.052 sec - in org.apache.uima.ruta.NBSPWSTest
Running org.apache.uima.ruta.NestedDisjunctiveTest
Tests run: 1, Failures: 0, Errors: 0, Skipped: 0, Time elapsed: 0.049 sec - in org.apache.uima.ruta.NestedDisjunctiveTest
Running org.apache.uima.ruta.NewCASPipelineTest
Tests run: 1, Failures: 0, Errors: 0, Skipped: 0, Time elapsed: 0.142 sec - in org.apache.uima.ruta.NewCASPipelineTest
Running org.apache.uima.ruta.NullExpressionTest
Tests run: 1, Failures: 0, Errors: 0, Skipped: 0, Time elapsed: 0.071 sec - in org.apache.uima.ruta.NullExpressionTest
Running org.apache.uima.ruta.OptionalComposedEndTest
Tests run: 2, Failures: 0, Errors: 0, Skipped: 0, Time elapsed: 0.13 sec - in org.apache.uima.ruta.OptionalComposedEndTest
Running org.apache.uima.ruta.OptionalDisjunctiveBeforeAnchoringTest
Tests run: 1, Failures: 0, Errors: 0, Skipped: 0, Time elapsed: 0.046 sec - in org.apache.uima.ruta.OptionalDisjunctiveBeforeAnchoringTest
Running org.apache.uima.ruta.OutOfWindowTest
Tests run: 1, Failures: 0, Errors: 0, Skipped: 0, Time elapsed: 0.037 sec - in org.apache.uima.ruta.OutOfWindowTest
Running org.apache.uima.ruta.Quantifier1Test
Tests run: 1, Failures: 0, Errors: 0, Skipped: 0, Time elapsed: 0.11 sec - in org.apache.uima.ruta.Quantifier1Test
Running org.apache.uima.ruta.Quantifier2Test
Tests run: 1, Failures: 0, Errors: 0, Skipped: 0, Time elapsed: 0.074 sec - in org.apache.uima.ruta.Quantifier2Test
Running org.apache.uima.ruta.Quantifier3Test
Tests run: 1, Failures: 0, Errors: 0, Skipped: 0, Time elapsed: 0.052 sec - in org.apache.uima.ruta.Quantifier3Test
Running org.apache.uima.ruta.Quantifier4Test
Tests run: 1, Failures: 0, Errors: 0, Skipped: 0, Time elapsed: 0.071 sec - in org.apache.uima.ruta.Quantifier4Test
Running org.apache.uima.ruta.Quantifier5Test
Tests run: 1, Failures: 0, Errors: 0, Skipped: 0, Time elapsed: 0.033 sec - in org.apache.uima.ruta.Quantifier5Test
Running org.apache.uima.ruta.Quantifier6Test
Tests run: 1, Failures: 0, Errors: 0, Skipped: 0, Time elapsed: 0.302 sec - in org.apache.uima.ruta.Quantifier6Test
Running org.apache.uima.ruta.Quantifier7Test
Tests run: 1, Failures: 0, Errors: 0, Skipped: 0, Time elapsed: 0.062 sec - in org.apache.uima.ruta.Quantifier7Test
Running org.apache.uima.ruta.Quantifier8Test
Tests run: 1, Failures: 0, Errors: 0, Skipped: 0, Time elapsed: 0.064 sec - in org.apache.uima.ruta.Quantifier8Test
Running org.apache.uima.ruta.RegExpRuleTest
Tests run: 1, Failures: 0, Errors: 0, Skipped: 0, Time elapsed: 0.033 sec - in org.apache.uima.ruta.RegExpRuleTest
Running org.apache.uima.ruta.RemoveDocumentAnnotationTest
Tests run: 1, Failures: 0, Errors: 0, Skipped: 0, Time elapsed: 0.043 sec - in org.apache.uima.ruta.RemoveDocumentAnnotationTest
Running org.apache.uima.ruta.ReverseQuantifierTest
Tests run: 1, Failures: 0, Errors: 0, Skipped: 0, Time elapsed: 0.051 sec - in org.apache.uima.ruta.ReverseQuantifierTest
Running org.apache.uima.ruta.RuleInference1Test
Tests run: 1, Failures: 0, Errors: 0, Skipped: 0, Time elapsed: 0.11 sec - in org.apache.uima.ruta.RuleInference1Test
Running org.apache.uima.ruta.RuleInference2Test
Tests run: 1, Failures: 0, Errors: 0, Skipped: 0, Time elapsed: 0.222 sec - in org.apache.uima.ruta.RuleInference2Test
Running org.apache.uima.ruta.RuleInference3Test
Tests run: 1, Failures: 0, Errors: 0, Skipped: 0, Time elapsed: 0.049 sec - in org.apache.uima.ruta.RuleInference3Test
Running org.apache.uima.ruta.seed.DefaultSeederTest
Tests run: 1, Failures: 0, Errors: 0, Skipped: 0, Time elapsed: 0.021 sec - in org.apache.uima.ruta.seed.DefaultSeederTest
Running org.apache.uima.ruta.ShiftWithLowMemoryProfileTest
Tests run: 1, Failures: 0, Errors: 0, Skipped: 0, Time elapsed: 0.03 sec - in org.apache.uima.ruta.ShiftWithLowMemoryProfileTest
Running org.apache.uima.ruta.StrictImportTest
Jan 08, 2015 10:00:05 AM org.apache.uima.analysis_engine.impl.PrimitiveAnalysisEngine_impl
callAnalysisComponentProcess(417)
SEVERE: Exception occurred
org.apache.uima.analysis_engine.AnalysisEngineProcessException: Annotator processing failed.
   
	at org.apache.uima.ruta.engine.RutaEngine.process(RutaEngine.java:505)
	at org.apache.uima.analysis_component.JCasAnnotator_ImplBase.process(JCasAnnotator_ImplBase.java:48)
	at org.apache.uima.analysis_engine.impl.PrimitiveAnalysisEngine_impl.callAnalysisComponentProcess(PrimitiveAnalysisEngine_impl.java:385)
	at org.apache.uima.analysis_engine.impl.PrimitiveAnalysisEngine_impl.processAndOutputNewCASes(PrimitiveAnalysisEngine_impl.java:309)
	at org.apache.uima.analysis_engine.impl.AnalysisEngineImplBase.process(AnalysisEngineImplBase.java:267)
	at org.apache.uima.ruta.StrictImportTest.testUndeclaredTypeSystem(StrictImportTest.java:80)
	at sun.reflect.NativeMethodAccessorImpl.invoke0(Native Method)
	at sun.reflect.NativeMethodAccessorImpl.invoke(NativeMethodAccessorImpl.java:57)
	at sun.reflect.DelegatingMethodAccessorImpl.invoke(DelegatingMethodAccessorImpl.java:43)
	at java.lang.reflect.Method.invoke(Method.java:601)
	at org.junit.runners.model.FrameworkMethod$1.runReflectiveCall(FrameworkMethod.java:44)
	at org.junit.internal.runners.model.ReflectiveCallable.run(ReflectiveCallable.java:15)
	at org.junit.runners.model.FrameworkMethod.invokeExplosively(FrameworkMethod.java:41)
	at org.junit.internal.runners.statements.InvokeMethod.evaluate(InvokeMethod.java:20)
	at org.junit.internal.runners.statements.RunBefores.evaluate(RunBefores.java:28)
	at org.junit.internal.runners.statements.RunAfters.evaluate(RunAfters.java:31)
	at org.junit.runners.BlockJUnit4ClassRunner.runChild(BlockJUnit4ClassRunner.java:73)
	at org.junit.runners.BlockJUnit4ClassRunner.runChild(BlockJUnit4ClassRunner.java:46)
	at org.junit.runners.ParentRunner.runChildren(ParentRunner.java:180)
	at org.junit.runners.ParentRunner.access$000(ParentRunner.java:41)
	at org.junit.runners.ParentRunner$1.evaluate(ParentRunner.java:173)
	at org.junit.internal.runners.statements.RunBefores.evaluate(RunBefores.java:28)
	at org.junit.internal.runners.statements.RunAfters.evaluate(RunAfters.java:31)
	at org.junit.runners.ParentRunner.run(ParentRunner.java:220)
	at org.apache.maven.surefire.junit4.JUnit4Provider.execute(JUnit4Provider.java:264)
	at org.apache.maven.surefire.junit4.JUnit4Provider.executeTestSet(JUnit4Provider.java:153)
	at org.apache.maven.surefire.junit4.JUnit4Provider.invoke(JUnit4Provider.java:124)
	at org.apache.maven.surefire.booter.ForkedBooter.invokeProviderInSameClassLoader(ForkedBooter.java:200)
	at org.apache.maven.surefire.booter.ForkedBooter.runSuitesInProcess(ForkedBooter.java:153)
	at org.apache.maven.surefire.booter.ForkedBooter.main(ForkedBooter.java:103)
Caused by: java.lang.IllegalArgumentException: Not able to resolve type: MyType
	at org.apache.uima.ruta.expression.type.SimpleTypeExpression.getType(SimpleTypeExpression.java:47)
	at org.apache.uima.ruta.action.AbstractMarkAction.createAnnotation(AbstractMarkAction.java:42)
	at org.apache.uima.ruta.action.MarkAction.execute(MarkAction.java:57)
	at org.apache.uima.ruta.rule.AbstractRuleElement.apply(AbstractRuleElement.java:130)
	at org.apache.uima.ruta.rule.RuleElementCaretaker.applyRuleElements(RuleElementCaretaker.java:111)
	at org.apache.uima.ruta.rule.ComposedRuleElement.applyRuleElements(ComposedRuleElement.java:592)
	at org.apache.uima.ruta.rule.AbstractRuleElement.doneMatching(AbstractRuleElement.java:84)
	at org.apache.uima.ruta.rule.ComposedRuleElement.fallback(ComposedRuleElement.java:513)
	at org.apache.uima.ruta.rule.ComposedRuleElement.fallbackContinue(ComposedRuleElement.java:414)
	at org.apache.uima.ruta.rule.RutaRuleElement.startMatch(RutaRuleElement.java:102)
	at org.apache.uima.ruta.rule.ComposedRuleElement.startMatch(ComposedRuleElement.java:73)
	at org.apache.uima.ruta.rule.RutaRule.apply(RutaRule.java:47)
	at org.apache.uima.ruta.rule.RutaRule.apply(RutaRule.java:40)
	at org.apache.uima.ruta.rule.RutaRule.apply(RutaRule.java:29)
	at org.apache.uima.ruta.RutaScriptBlock.apply(RutaScriptBlock.java:63)
	at org.apache.uima.ruta.RutaModule.apply(RutaModule.java:48)
	at org.apache.uima.ruta.engine.RutaEngine.process(RutaEngine.java:503)
	... 29 more

Tests run: 3, Failures: 0, Errors: 0, Skipped: 0, Time elapsed: 0.131 sec - in org.apache.uima.ruta.StrictImportTest
Running org.apache.uima.ruta.SubAtomicTest
Tests run: 1, Failures: 0, Errors: 0, Skipped: 0, Time elapsed: 0.045 sec - in org.apache.uima.ruta.SubAtomicTest
Running org.apache.uima.ruta.TypeAliasTest
Tests run: 1, Failures: 0, Errors: 0, Skipped: 0, Time elapsed: 0.039 sec - in org.apache.uima.ruta.TypeAliasTest
Running org.apache.uima.ruta.verbalizer.ActionVerbalizerTest
Tests run: 1, Failures: 0, Errors: 0, Skipped: 0, Time elapsed: 0.004 sec - in org.apache.uima.ruta.verbalizer.ActionVerbalizerTest
Running org.apache.uima.ruta.verbalizer.ConditionVerbalizerTest
Tests run: 1, Failures: 0, Errors: 0, Skipped: 0, Time elapsed: 0.002 sec - in org.apache.uima.ruta.verbalizer.ConditionVerbalizerTest
Running org.apache.uima.ruta.verbalizer.ExpressionVerbalizerTest
Tests run: 1, Failures: 0, Errors: 0, Skipped: 0, Time elapsed: 0.002 sec - in org.apache.uima.ruta.verbalizer.ExpressionVerbalizerTest
Running org.apache.uima.ruta.WildCard1Test
Tests run: 1, Failures: 0, Errors: 0, Skipped: 0, Time elapsed: 0.204 sec - in org.apache.uima.ruta.WildCard1Test
Running org.apache.uima.ruta.WildCard2Test
Tests run: 1, Failures: 0, Errors: 0, Skipped: 0, Time elapsed: 0.152 sec - in org.apache.uima.ruta.WildCard2Test
Running org.apache.uima.ruta.WildCard3Test
Tests run: 1, Failures: 0, Errors: 0, Skipped: 0, Time elapsed: 0.054 sec - in org.apache.uima.ruta.WildCard3Test
Running org.apache.uima.ruta.WSDictionaryTest
Tests run: 3, Failures: 0, Errors: 0, Skipped: 0, Time elapsed: 0.224 sec - in org.apache.uima.ruta.WSDictionaryTest

Results :

Tests run: 175, Failures: 0, Errors: 0, Skipped: 0

[JENKINS] Recording test results
[INFO] 
[INFO] --- cobertura-maven-plugin:2.6:cobertura (default-cli) @ ruta-core ---
[INFO] Cobertura 2.0.3 - GNU GPL License (NO WARRANTY) - See COPYRIGHT file
Report time: 6924ms

[ERROR] Jan 08, 2015 10:00:09 AM net.sourceforge.cobertura.coveragedata.CoverageDataFileHandler
loadCoverageData
INFO: Cobertura: Loaded information on 407 classes.

[INFO] Cobertura Report generation was successful.
[INFO] 
[INFO] --- maven-enforcer-plugin:1.3.1:enforce (enforce-versions) @ ruta-core ---
[INFO] 
[INFO] --- build-helper-maven-plugin:1.8:parse-version (parse-project-version) @ ruta-core
---
[INFO] 
[INFO] --- uima-build-helper-maven-plugin:7:parse-date-time (set buildYear and buildMonth)
@ ruta-core ---
[INFO] 
[INFO] --- antlr3-maven-plugin:3.5.2:antlr (run antlr) @ ruta-core ---
[INFO] ANTLR: Processing source directory F:\jenkins\jenkins-slave\workspace\UIMA-Ruta\trunk\ruta-core\src\main\antlr3
ANTLR Parser Generator  Version 3.5.2
Grammar F:\jenkins\jenkins-slave\workspace\UIMA-Ruta\trunk\ruta-core\src\main\antlr3\org\apache\uima\ruta\parser\RutaLexer.g
is up to date - build skipped
Grammar F:\jenkins\jenkins-slave\workspace\UIMA-Ruta\trunk\ruta-core\src\main\antlr3\org\apache\uima\ruta\parser\RutaParser.g
is up to date - build skipped
[INFO] 
[INFO] --- build-helper-maven-plugin:1.8:add-source (add-source) @ ruta-core ---
[INFO] Source directory: F:\jenkins\jenkins-slave\workspace\UIMA-Ruta\trunk\ruta-core\target\generated-sources\antlr3
added.
[WARNING] Failed to getClass for org.apache.maven.plugin.javadoc.JavadocReport
[INFO] 
[INFO] --- maven-javadoc-plugin:2.9.1:javadoc (default-cli) @ ruta-core ---
[INFO] 
1 error
1 warning
[JENKINS] Archiving  javadoc

Mime
View raw message