uima-dev mailing list archives

Site index · List index
Message view « Date » · « Thread »
Top « Date » · « Thread »
From Apache Jenkins Server <jenk...@builds.apache.org>
Subject Build failed in Jenkins: UIMA-SDK » Apache UIMA Base: uimaj-core #672
Date Tue, 20 Jan 2015 21:56:55 GMT
See <https://builds.apache.org/job/UIMA-SDK/org.apache.uima$uimaj-core/672/changes>

Changes:

[schor] [UIMA-4190][UIMA-4191] Fix CasCopier to bypass index corruption checking when doing
feature setting. Add check to require range types in cas copier be the same.

[schor] no Jira - minor cleanup - eliminate extra variable, use final local var more.

[schor] no Jira, fix comment

------------------------------------------
[...truncated 943 lines...]
Tests run: 2, Failures: 0, Errors: 0, Skipped: 0, Time elapsed: 0 sec - in org.apache.uima.resource.ConfigurableResource_implTest
Running org.apache.uima.resource.impl.CasManager_implTest
Tests run: 1, Failures: 0, Errors: 0, Skipped: 0, Time elapsed: 0 sec - in org.apache.uima.resource.impl.CasManager_implTest
Running org.apache.uima.resource.impl.ConfigurableDataResourceSpecifier_implTest
Tests run: 1, Failures: 0, Errors: 0, Skipped: 0, Time elapsed: 0 sec - in org.apache.uima.resource.impl.ConfigurableDataResourceSpecifier_implTest
Running org.apache.uima.resource.impl.ConfigurableDataResource_implTest
Tests run: 1, Failures: 0, Errors: 0, Skipped: 0, Time elapsed: 0 sec - in org.apache.uima.resource.impl.ConfigurableDataResource_implTest
Running org.apache.uima.resource.impl.DataResource_implTest
Tests run: 2, Failures: 0, Errors: 0, Skipped: 0, Time elapsed: 0 sec - in org.apache.uima.resource.impl.DataResource_implTest
Running org.apache.uima.resource.impl.FileLanguageResource_implTest
Tests run: 1, Failures: 0, Errors: 0, Skipped: 0, Time elapsed: 0.001 sec - in org.apache.uima.resource.impl.FileLanguageResource_implTest
Running org.apache.uima.resource.impl.PearSpecifier_implTest
Tests run: 2, Failures: 0, Errors: 0, Skipped: 0, Time elapsed: 0 sec - in org.apache.uima.resource.impl.PearSpecifier_implTest
Running org.apache.uima.resource.impl.RelativePathResolver_implTest
Tests run: 2, Failures: 0, Errors: 0, Skipped: 0, Time elapsed: 0 sec - in org.apache.uima.resource.impl.RelativePathResolver_implTest
Running org.apache.uima.resource.impl.ResourceCreationSpecifier_implTest
Tests run: 1, Failures: 0, Errors: 0, Skipped: 0, Time elapsed: 0 sec - in org.apache.uima.resource.impl.ResourceCreationSpecifier_implTest
Running org.apache.uima.resource.impl.ResourceManager_implTest
Jan 20, 2015 1:54:19 PM org.apache.uima.resource.impl.ResourceManager_impl initializeExternalResources
WARNING: The external resource named MyFileLanguageResource has been declared multiple times
with different definitions. The definition of the resource in component /Annotator1/ will
be used.  The definition in component /Annotator2/ will be ignored.
Tests run: 4, Failures: 0, Errors: 0, Skipped: 0, Time elapsed: 0.001 sec - in org.apache.uima.resource.impl.ResourceManager_implTest
Running org.apache.uima.resource.impl.TestResourceInterface_impl
Tests run: 0, Failures: 0, Errors: 0, Skipped: 0, Time elapsed: 0 sec - in org.apache.uima.resource.impl.TestResourceInterface_impl
Running org.apache.uima.resource.impl.URISpecifier_implTest
Tests run: 1, Failures: 0, Errors: 0, Skipped: 0, Time elapsed: 0.001 sec - in org.apache.uima.resource.impl.URISpecifier_implTest
Running org.apache.uima.resource.metadata.impl.ConfigurationParameterDeclarations_implTest
Tests run: 1, Failures: 0, Errors: 0, Skipped: 0, Time elapsed: 0 sec - in org.apache.uima.resource.metadata.impl.ConfigurationParameterDeclarations_implTest
Running org.apache.uima.resource.metadata.impl.FsIndexCollection_implTest
Tests run: 2, Failures: 0, Errors: 0, Skipped: 0, Time elapsed: 0 sec - in org.apache.uima.resource.metadata.impl.FsIndexCollection_implTest
Running org.apache.uima.resource.metadata.impl.Import_implTest
Tests run: 3, Failures: 0, Errors: 0, Skipped: 0, Time elapsed: 0.001 sec - in org.apache.uima.resource.metadata.impl.Import_implTest
Running org.apache.uima.resource.metadata.impl.MetaDataObject_implTest
true
Tests run: 5, Failures: 0, Errors: 0, Skipped: 0, Time elapsed: 0 sec - in org.apache.uima.resource.metadata.impl.MetaDataObject_implTest
Running org.apache.uima.resource.metadata.impl.ResourceManagerConfiguration_implTest
Tests run: 3, Failures: 0, Errors: 0, Skipped: 0, Time elapsed: 0.001 sec - in org.apache.uima.resource.metadata.impl.ResourceManagerConfiguration_implTest
Running org.apache.uima.resource.metadata.impl.TestFruitBagObject
Tests run: 0, Failures: 0, Errors: 0, Skipped: 0, Time elapsed: 0 sec - in org.apache.uima.resource.metadata.impl.TestFruitBagObject
Running org.apache.uima.resource.metadata.impl.TestFruitObject
Tests run: 0, Failures: 0, Errors: 0, Skipped: 0, Time elapsed: 0 sec - in org.apache.uima.resource.metadata.impl.TestFruitObject
Running org.apache.uima.resource.metadata.impl.TypePriorities_implTest
Tests run: 3, Failures: 0, Errors: 0, Skipped: 0, Time elapsed: 0 sec - in org.apache.uima.resource.metadata.impl.TypePriorities_implTest
Running org.apache.uima.resource.metadata.impl.TypeSystemDescription_implTest
Tests run: 3, Failures: 0, Errors: 0, Skipped: 0, Time elapsed: 0.032 sec - in org.apache.uima.resource.metadata.impl.TypeSystemDescription_implTest
Running org.apache.uima.resource.service.impl.ResourceServiceAdapter_implTest
Tests run: 1, Failures: 0, Errors: 0, Skipped: 0, Time elapsed: 0.002 sec - in org.apache.uima.resource.service.impl.ResourceServiceAdapter_implTest
Running org.apache.uima.resource.service.impl.ResourceService_implTest
Tests run: 1, Failures: 0, Errors: 0, Skipped: 0, Time elapsed: 0.001 sec - in org.apache.uima.resource.service.impl.ResourceService_implTest
Running org.apache.uima.resource.service.impl.TestResourceServiceStub
Tests run: 0, Failures: 0, Errors: 0, Skipped: 0, Time elapsed: 0 sec - in org.apache.uima.resource.service.impl.TestResourceServiceStub
Running org.apache.uima.resource.TestCasConsumer
Tests run: 0, Failures: 0, Errors: 0, Skipped: 0, Time elapsed: 0 sec - in org.apache.uima.resource.TestCasConsumer
Running org.apache.uima.util.CasCopierTest
Tests run: 6, Failures: 0, Errors: 0, Skipped: 0, Time elapsed: 0.805 sec - in org.apache.uima.util.CasCopierTest
Running org.apache.uima.util.CasCreationUtilsTest
Tests run: 13, Failures: 0, Errors: 0, Skipped: 0, Time elapsed: 0.692 sec - in org.apache.uima.util.CasCreationUtilsTest
Running org.apache.uima.util.CasToInlineXmlTest
<?xml version="1.0" encoding="UTF-8"?>
<Document>
    <uima.tcas.DocumentAnnotation sofa="Sofa" begin="0" end="17" language="x-unspecified">
        <org.apache.uima.testTypeSystem_arrays.OfStrings sofa="Sofa" begin="0" end="0"
f1Strings="[0s,1s,2s]"/>
        <org.apache.uima.testTypeSystem_arrays.OfShorts sofa="Sofa" begin="0" end="0" f1Shorts="[0,1,2]"/>1
2 3 4 5 6 7 8 9</uima.tcas.DocumentAnnotation>
</Document>
Tests run: 2, Failures: 0, Errors: 0, Skipped: 0, Time elapsed: 0.038 sec - in org.apache.uima.util.CasToInlineXmlTest
Running org.apache.uima.util.FileUtilsTest
Tests run: 2, Failures: 0, Errors: 0, Skipped: 0, Time elapsed: 0.003 sec - in org.apache.uima.util.FileUtilsTest
Running org.apache.uima.util.impl.JSR47Logger_implTest
Jan 20, 2015 1:54:21 PM org.apache.uima.util.impl.JSR47Logger_implTest testMessageLogMethods(183)
INFO: My first test message
Jan 20, 2015 1:54:21 PM org.apache.uima.util.impl.JSR47Logger_implTest testMessageLogMethods(189)
INFO: My second test message
Jan 20, 2015 1:54:21 PM org.apache.uima.util.impl.JSR47Logger_implTest testMessageLogMethods(190)
INFO: My java.lang.Object@9553a0b test message
Jan 20, 2015 1:54:21 PM org.apache.uima.util.impl.JSR47Logger_implTest testMessageLogMethods(191)
INFO: My  test message
Jan 20, 2015 1:54:21 PM org.apache.uima.util.impl.JSR47Logger_implTest testMessageLogMethods(192)
INFO: My null test message
Jan 20, 2015 1:54:21 PM org.apache.uima.util.impl.JSR47Logger_implTest testMessageLogMethods(197)
INFO: My third test message
Jan 20, 2015 1:54:21 PM org.apache.uima.util.impl.JSR47Logger_implTest testMessageLogMethods(198)
INFO: My {0} test message
Jan 20, 2015 1:54:21 PM org.apache.uima.util.impl.JSR47Logger_implTest testMessageLogMethods(201)
INFO: My  test message
Jan 20, 2015 1:54:21 PM org.apache.uima.util.impl.JSR47Logger_implTest testMessageLogMethods(202)
INFO: My null test message
Jan 20, 2015 1:54:21 PM org.apache.uima.util.impl.JSR47Logger_implTest testMessageKeyLogMethods(246)
INFO: Exception test message
Jan 20, 2015 1:54:21 PM org.apache.uima.util.impl.JSR47Logger_implTest testMessageKeyLogMethods(248)
INFO: Exception test message
Jan 20, 2015 1:54:21 PM org.apache.uima.util.impl.JSR47Logger_implTest testMessageKeyLogMethods(249)
INFO: Exception test message
Jan 20, 2015 1:54:21 PM org.apache.uima
INFO: Exception test message
Jan 20, 2015 1:54:21 PM org.apache.uima
INFO: MESSAGE LOCALIZATION FAILED: null
Jan 20, 2015 1:54:21 PM testClass testMethod
INFO: Exception test message
Jan 20, 2015 1:54:21 PM org.apache.uima
INFO: Exception test message
Jan 20, 2015 1:54:21 PM org.apache.uima
INFO: Exception test message
Jan 20, 2015 1:54:21 PM org.apache.uima
INFO: MESSAGE LOCALIZATION FAILED: null
Jan 20, 2015 1:54:21 PM testClass testMethod
INFO: Exception test message
Jan 20, 2015 1:54:21 PM org.apache.uima
INFO: Exception test message
Jan 20, 2015 1:54:21 PM org.apache.uima
INFO: MESSAGE LOCALIZATION FAILED: null
Jan 20, 2015 1:54:21 PM testClass testMethod
INFO: Exception test message
Tests run: 4, Failures: 0, Errors: 0, Skipped: 0, Time elapsed: 0.027 sec - in org.apache.uima.util.impl.JSR47Logger_implTest
Running org.apache.uima.util.impl.Logger_implTest
Tests run: 2, Failures: 0, Errors: 0, Skipped: 0, Time elapsed: 0.002 sec - in org.apache.uima.util.impl.Logger_implTest
Running org.apache.uima.util.impl.LoggingTest
Jan 20, 2015 1:54:21 PM org.apache.uima.util.impl.LoggingTest testDefaultLoggerCreation(58)
SEVERE: Log test messege with Level SEVERE
Jan 20, 2015 1:54:21 PM org.apache.uima.util.impl.LoggingTest testClassLoggerCreation(83)
SEVERE: Log test messege with Level SEVERE
Tests run: 3, Failures: 0, Errors: 0, Skipped: 0, Time elapsed: 0.002 sec - in org.apache.uima.util.impl.LoggingTest
Running org.apache.uima.util.impl.OptimizeStringsTest
Tests run: 4, Failures: 0, Errors: 0, Skipped: 0, Time elapsed: 0.18 sec - in org.apache.uima.util.impl.OptimizeStringsTest
Running org.apache.uima.util.impl.ProcessTrace_implTest
Tests run: 6, Failures: 0, Errors: 0, Skipped: 0, Time elapsed: 0 sec - in org.apache.uima.util.impl.ProcessTrace_implTest
Running org.apache.uima.util.impl.TestLog4jLogger_impl
0 [main] INFO org.apache.uima.util.impl.TestLog4jLogger_impl  - ola
1 [main] INFO org.apache.uima.util.impl.TestLog4jLogger_impl  - OLA in info
1 [main] INFO org.apache.uima  - UIMA OLA in info
[TestLog4jLogger_impl.java:213] My first test message
[TestLog4jLogger_impl.java:219] My second test message
[TestLog4jLogger_impl.java:220] My java.lang.Object@3cd0db94 test message
[TestLog4jLogger_impl.java:221] My  test message
[TestLog4jLogger_impl.java:222] My null test message
[TestLog4jLogger_impl.java:227] My third test message
[TestLog4jLogger_impl.java:228] My {0} test message
[TestLog4jLogger_impl.java:231] My  test message
[TestLog4jLogger_impl.java:232] My null test message
[TestLog4jLogger_impl.java:237] My fourth test message
[TestLog4jLogger_impl.java:238] Exception occurred
[TestLog4jLogger_impl.java:239] Exception occurred
[TestLog4jLogger_impl.java:241] My fourth test message
[TestLog4jLogger_impl.java:243] Message from wrapper
[TestLog4jLogger_impl.java:250] My fifth test message
[TestLog4jLogger_impl.java:256] Exception occurred
[TestLog4jLogger_impl.java:296] Exception test message
[TestLog4jLogger_impl.java:298] Exception test message
[TestLog4jLogger_impl.java:299] Exception test message
[TestLog4jLogger_impl.java:302] Exception test message
[TestLog4jLogger_impl.java:304] MESSAGE LOCALIZATION FAILED: null
[TestLog4jLogger_impl.java:306] Exception test message
[TestLog4jLogger_impl.java:311] Exception test message
[TestLog4jLogger_impl.java:312] Exception test message
[TestLog4jLogger_impl.java:314] MESSAGE LOCALIZATION FAILED: null
[TestLog4jLogger_impl.java:316] Exception test message
[TestLog4jLogger_impl.java:321] Exception test message
[TestLog4jLogger_impl.java:324] MESSAGE LOCALIZATION FAILED: null
[TestLog4jLogger_impl.java:327] Exception test message
[TestLog4jLogger_impl.java:333] Exception test message
[TestLog4jLogger_impl.java:334] Exception occurred
[TestLog4jLogger_impl.java:335] MESSAGE LOCALIZATION FAILED: null
[TestLog4jLogger_impl.java:336] Exception occurred
[TestLog4jLogger_impl.java:338] Exception test message
Jan 20, 2015 1:54:21 PM org.apache.uima.util.impl.TestLog4jLogger_impl testLoggerFromUIMAFramework(358)
INFO: ------------------------------------------------------------
Jan 20, 2015 1:54:21 PM org.apache.uima.util.impl.TestLog4jLogger_impl testLoggerFromUIMAFramework(360)
INFO: My first test message
Tests run: 5, Failures: 0, Errors: 0, Skipped: 0, Time elapsed: 0.021 sec - in org.apache.uima.util.impl.TestLog4jLogger_impl
Running org.apache.uima.util.impl.XMLParser_implTest
Tests run: 7, Failures: 0, Errors: 0, Skipped: 0, Time elapsed: 0 sec - in org.apache.uima.util.impl.XMLParser_implTest
Running org.apache.uima.util.LevelTest
Tests run: 11, Failures: 0, Errors: 0, Skipped: 0, Time elapsed: 0 sec - in org.apache.uima.util.LevelTest
Running org.apache.uima.util.TestCollectionReader
Tests run: 0, Failures: 0, Errors: 0, Skipped: 0, Time elapsed: 0 sec - in org.apache.uima.util.TestCollectionReader
Running org.apache.uima.util.TypeSystemUtilTest
Tests run: 1, Failures: 0, Errors: 0, Skipped: 0, Time elapsed: 0 sec - in org.apache.uima.util.TypeSystemUtilTest
Running org.apache.uima.util.XMLSerializerTest
Java version is Oracle Corporation 1.7.0 Java HotSpot(TM) 64-Bit Server VM 21.0-b17
  javax.xml.transform.TransformerFactory: null
  Transformer version: 1.1
Trying to serialize non-XML 1.1 character:  , 0x0 at offset 2 in string starting with  ! "
Tests run: 5, Failures: 0, Errors: 0, Skipped: 0, Time elapsed: 0.001 sec - in org.apache.uima.util.XMLSerializerTest

Results :

Tests in error: 
  org.apache.uima.pear.util.PearInstallerTest#testPearInstall PackageInstallerException
  org.apache.uima.pear.util.PearRuntimeTest#testPearRuntime PackageInstallerException
  org.apache.uima.pear.util.PearRuntimeTest#testPearRuntimeDocAnnot PackageInstallerException
  org.apache.uima.pear.util.TestPearInstallationVerification#testAePearVerification PackageInstallerException
  org.apache.uima.pear.util.TestPearInstallationVerification#testCcPearVerification PackageInstallerException
  org.apache.uima.pear.util.TestPearInstallationVerification#testTsPearVerification PackageInstallerException

Tests run: 490, Failures: 0, Errors: 6, Skipped: 0

[ERROR] There are test failures.

Please refer to F:\jenkins\jenkins-slave\workspace\UIMA-SDK\trunk\uimaj-core\target\surefire-reports
for the individual test results.
[JENKINS] Recording test results
[INFO] 
[INFO] --- maven-antrun-plugin:1.7:run (dup-meta-jar-cleanup) @ uimaj-core ---
[INFO] Executing tasks

main:
[INFO] Executed tasks
[INFO] 
[INFO] --- maven-jar-plugin:2.3.2:jar (default-jar) @ uimaj-core ---
[INFO] Building jar: F:\jenkins\jenkins-slave\workspace\UIMA-SDK\trunk\uimaj-core\target\uima-core.jar
[INFO] 
[INFO] --- maven-site-plugin:3.3:attach-descriptor (attach-descriptor) @ uimaj-core ---
[INFO] 
[INFO] --- findbugs-maven-plugin:2.5.4:findbugs (default) @ uimaj-core ---
[INFO] Fork Value is true
     [java] Warnings generated: 212
[INFO] Done FindBugs Analysis....
[FINDBUGS] Finding all files that match the pattern findbugsXml.xml
[FINDBUGS] Parsing 1 files in F:\jenkins\jenkins-slave\workspace\UIMA-SDK\trunk\uimaj-core\target
[FINDBUGS] Successfully parsed file F:\jenkins\jenkins-slave\workspace\UIMA-SDK\trunk\uimaj-core\target\findbugsXml.xml
of module Apache UIMA Base: uimaj-core with 212 warnings.
[FINDBUGS] Computing warning deltas based on reference build #671
[INFO] 
[INFO] --- maven-enforcer-plugin:1.3.1:enforce (enforce-versions) @ uimaj-core ---
[INFO] 
[INFO] --- build-helper-maven-plugin:1.8:parse-version (parse-project-version) @ uimaj-core
---
[INFO] 
[INFO] --- uima-build-helper-maven-plugin:7:parse-date-time (set buildYear and buildMonth)
@ uimaj-core ---
[INFO] 
[INFO] --- maven-resources-plugin:2.6:copy-resources (setVersions) @ uimaj-core ---
[INFO] Using 'UTF-8' encoding to copy filtered resources.
[INFO] Copying 1 resource
[INFO] 
[INFO] --- build-helper-maven-plugin:1.8:add-source (addVersionSrc) @ uimaj-core ---
[INFO] Source directory: F:\jenkins\jenkins-slave\workspace\UIMA-SDK\trunk\uimaj-core\target\generated-sources\releaseVersion
added.
[INFO] 
[INFO] --- maven-remote-resources-plugin:1.5:process (default) @ uimaj-core ---
[INFO] 
[INFO] --- maven-resources-plugin:2.6:resources (default-resources) @ uimaj-core ---
[INFO] Using 'UTF-8' encoding to copy filtered resources.
[INFO] Copying 15 resources
[INFO] Copying 3 resources
[INFO] Copying 3 resources
[INFO] 
[INFO] --- maven-compiler-plugin:3.1:compile (default-compile) @ uimaj-core ---
[INFO] Changes detected - recompiling the module!
[INFO] Compiling 705 source files to F:\jenkins\jenkins-slave\workspace\UIMA-SDK\trunk\uimaj-core\target\classes
[WARNING] /F:/jenkins/jenkins-slave/workspace/UIMA-SDK/trunk/uimaj-core/src/main/java/org/apache/uima/analysis_engine/impl/AnalysisEngineImplBase.java:
Some input files use or override a deprecated API.
[WARNING] /F:/jenkins/jenkins-slave/workspace/UIMA-SDK/trunk/uimaj-core/src/main/java/org/apache/uima/analysis_engine/impl/AnalysisEngineImplBase.java:
Recompile with -Xlint:deprecation for details.
[WARNING] /F:/jenkins/jenkins-slave/workspace/UIMA-SDK/trunk/uimaj-core/src/main/java/org/apache/uima/cas/impl/FSIndexRepositoryImpl.java:
Some input files use unchecked or unsafe operations.
[WARNING] /F:/jenkins/jenkins-slave/workspace/UIMA-SDK/trunk/uimaj-core/src/main/java/org/apache/uima/cas/impl/FSIndexRepositoryImpl.java:
Recompile with -Xlint:unchecked for details.
[INFO] 
[INFO] --- cobertura-maven-plugin:2.6:instrument (default) @ uimaj-core ---

Mime
View raw message