uima-dev mailing list archives

Site index · List index
Message view « Date » · « Thread »
Top « Date » · « Thread »
From Apache Jenkins Server <jenk...@builds.apache.org>
Subject Build failed in Jenkins: UIMA-DUCC #208
Date Sat, 07 Feb 2015 14:46:10 GMT
See <https://builds.apache.org/job/UIMA-DUCC/208/changes>

Changes:

[degenaro] UIMA-4069 DUCC Job Driver (JD) system classpath

provide full stack trace in JD log when CR throws an exception

[degenaro] UIMA-4068 DUCC Job Driver (JD) user classpath

provide full stack trace in JD log when CR throws an exception

------------------------------------------
[...truncated 3281 lines...]
delete: working
<https://builds.apache.org/job/UIMA-DUCC/ws/trunk/uima-ducc-user/target/test-classes/CrInitException.xml>
java.lang.RuntimeException
	at org.apache.uima.ducc.user.jd.test.helper.CrInitException.initialize(CrInitException.java:41)
	at org.apache.uima.impl.CollectionReaderFactory_impl.produceResource(CollectionReaderFactory_impl.java:103)
	at org.apache.uima.impl.CompositeResourceFactory_impl.produceResource(CompositeResourceFactory_impl.java:62)
	at org.apache.uima.UIMAFramework.produceResource(UIMAFramework.java:279)
	at org.apache.uima.UIMAFramework.produceCollectionReader(UIMAFramework.java:749)
	at org.apache.uima.ducc.user.jd.JdUserCollectionReader._initialize(JdUserCollectionReader.java:126)
	at org.apache.uima.ducc.user.jd.JdUserCollectionReader.initialize(JdUserCollectionReader.java:76)
	at org.apache.uima.ducc.user.jd.JdUserCollectionReader.<init>(JdUserCollectionReader.java:71)
	at org.apache.uima.ducc.user.jd.test.TestSuite.test11(TestSuite.java:479)
	at sun.reflect.NativeMethodAccessorImpl.invoke0(Native Method)
	at sun.reflect.NativeMethodAccessorImpl.invoke(NativeMethodAccessorImpl.java:39)
	at sun.reflect.DelegatingMethodAccessorImpl.invoke(DelegatingMethodAccessorImpl.java:25)
	at java.lang.reflect.Method.invoke(Method.java:597)
	at org.junit.runners.model.FrameworkMethod$1.runReflectiveCall(FrameworkMethod.java:44)
	at org.junit.internal.runners.model.ReflectiveCallable.run(ReflectiveCallable.java:15)
	at org.junit.runners.model.FrameworkMethod.invokeExplosively(FrameworkMethod.java:41)
	at org.junit.internal.runners.statements.InvokeMethod.evaluate(InvokeMethod.java:20)
	at org.junit.internal.runners.statements.RunBefores.evaluate(RunBefores.java:28)
	at org.junit.internal.runners.statements.RunAfters.evaluate(RunAfters.java:31)
	at org.junit.runners.BlockJUnit4ClassRunner.runNotIgnored(BlockJUnit4ClassRunner.java:79)
	at org.junit.runners.BlockJUnit4ClassRunner.runChild(BlockJUnit4ClassRunner.java:71)
	at org.junit.runners.BlockJUnit4ClassRunner.runChild(BlockJUnit4ClassRunner.java:49)
	at org.junit.runners.ParentRunner$3.run(ParentRunner.java:193)
	at org.junit.runners.ParentRunner$1.schedule(ParentRunner.java:52)
	at org.junit.runners.ParentRunner.runChildren(ParentRunner.java:191)
	at org.junit.runners.ParentRunner.access$000(ParentRunner.java:42)
	at org.junit.runners.ParentRunner$2.evaluate(ParentRunner.java:184)
	at org.junit.internal.runners.statements.RunBefores.evaluate(RunBefores.java:28)
	at org.junit.internal.runners.statements.RunAfters.evaluate(RunAfters.java:31)
	at org.junit.runners.ParentRunner.run(ParentRunner.java:236)
	at org.apache.maven.surefire.junit4.JUnit4Provider.execute(JUnit4Provider.java:264)
	at org.apache.maven.surefire.junit4.JUnit4Provider.executeTestSet(JUnit4Provider.java:153)
	at org.apache.maven.surefire.junit4.JUnit4Provider.invoke(JUnit4Provider.java:124)
	at org.apache.maven.surefire.booter.ForkedBooter.invokeProviderInSameClassLoader(ForkedBooter.java:200)
	at org.apache.maven.surefire.booter.ForkedBooter.runSuitesInProcess(ForkedBooter.java:153)
	at org.apache.maven.surefire.booter.ForkedBooter.main(ForkedBooter.java:103)

Tests run: 12, Failures: 0, Errors: 0, Skipped: 0, Time elapsed: 1.058 sec - in org.apache.uima.ducc.user.jd.test.TestSuite

Results :

Tests run: 12, Failures: 0, Errors: 0, Skipped: 0

[JENKINS] Recording test results
[INFO] 
[INFO] --- maven-antrun-plugin:1.7:run (dup-meta-jar-cleanup) @ uima-ducc-user ---
[INFO] Executing tasks

main:
[INFO] Executed tasks
[INFO] 
[INFO] --- maven-jar-plugin:2.3.2:jar (default-jar) @ uima-ducc-user ---
[INFO] Building jar: <https://builds.apache.org/job/UIMA-DUCC/ws/trunk/uima-ducc-user/target/uima-ducc-user-2.0.0-SNAPSHOT.jar>
[INFO] 
[INFO] --- maven-site-plugin:3.3:attach-descriptor (attach-descriptor) @ uima-ducc-user ---
[INFO] 
[INFO] --- maven-install-plugin:2.5.1:install (default-install) @ uima-ducc-user ---
[INFO] Installing <https://builds.apache.org/job/UIMA-DUCC/ws/trunk/uima-ducc-user/target/uima-ducc-user-2.0.0-SNAPSHOT.jar>
to /home/jenkins/jenkins-slave/maven-repositories/1/org/apache/uima/uima-ducc-user/2.0.0-SNAPSHOT/uima-ducc-user-2.0.0-SNAPSHOT.jar
[INFO] Installing <https://builds.apache.org/job/UIMA-DUCC/ws/trunk/uima-ducc-user/pom.xml>
to /home/jenkins/jenkins-slave/maven-repositories/1/org/apache/uima/uima-ducc-user/2.0.0-SNAPSHOT/uima-ducc-user-2.0.0-SNAPSHOT.pom
[INFO] 
[INFO] --- maven-pmd-plugin:3.4:pmd (default-cli) @ uima-ducc-user ---
[PMD] Finding all files that match the pattern pmd.xml
[PMD] Parsing 1 files in <https://builds.apache.org/job/UIMA-DUCC/ws/trunk/uima-ducc-user/target>
[PMD] Successfully parsed file <https://builds.apache.org/job/UIMA-DUCC/ws/trunk/uima-ducc-user/target/pmd.xml>
of module Apache UIMA DUCC: uima-ducc-user with 72 warnings.
[INFO] 
[INFO] --- maven-pmd-plugin:3.4:cpd (default-cli) @ uima-ducc-user ---
[DRY] Finding all files that match the pattern cpd.xml
[DRY] Parsing 1 files in <https://builds.apache.org/job/UIMA-DUCC/ws/trunk/uima-ducc-user/target>
[DRY] Successfully parsed file <https://builds.apache.org/job/UIMA-DUCC/ws/trunk/uima-ducc-user/target/cpd.xml>
of module Apache UIMA DUCC: uima-ducc-user with 4 warnings.
[INFO] 
[INFO] --- findbugs-maven-plugin:3.0.0:findbugs (default-cli) @ uima-ducc-user ---
[INFO] Fork Value is true
     [java] Exception in thread "main" java.lang.UnsupportedClassVersionError: edu/umd/cs/findbugs/FindBugs2
: Unsupported major.minor version 51.0
     [java] 	at java.lang.ClassLoader.defineClass1(Native Method)
     [java] 	at java.lang.ClassLoader.defineClassCond(ClassLoader.java:631)
     [java] 	at java.lang.ClassLoader.defineClass(ClassLoader.java:615)
     [java] 	at java.security.SecureClassLoader.defineClass(SecureClassLoader.java:141)
     [java] 	at java.net.URLClassLoader.defineClass(URLClassLoader.java:283)
     [java] 	at java.net.URLClassLoader.access$000(URLClassLoader.java:58)
     [java] 	at java.net.URLClassLoader$1.run(URLClassLoader.java:197)
     [java] 	at java.security.AccessController.doPrivileged(Native Method)
     [java] 	at java.net.URLClassLoader.findClass(URLClassLoader.java:190)
     [java] 	at java.lang.ClassLoader.loadClass(ClassLoader.java:306)
     [java] 	at sun.misc.Launcher$AppClassLoader.loadClass(Launcher.java:301)
     [java] 	at java.lang.ClassLoader.loadClass(ClassLoader.java:247)
     [java] Could not find the main class: edu.umd.cs.findbugs.FindBugs2.  Program will exit.
[FINDBUGS] No report found for mojo findbugs
[INFO] ------------------------------------------------------------------------
[INFO] Reactor Summary:
[INFO] 
[INFO] uima-ducc-parent .................................. SUCCESS [35.610s]
[INFO] Apache UIMA DUCC: uima-ducc-user .................. FAILURE [27.759s]
[INFO] Apache UIMA DUCC: uima-ducc-common ................ SKIPPED
[INFO] Apache UIMA DUCC: uima-ducc-container ............. SKIPPED
[INFO] Apache UIMA DUCC: uima-ducc-transport ............. SKIPPED
[INFO] Apache UIMA DUCC: uima-ducc-cli ................... SKIPPED
[INFO] Apache UIMA DUCC: uima-ducc-jd .................... SKIPPED
[INFO] Apache UIMA DUCC: uima-ducc-pm .................... SKIPPED
[INFO] Apache UIMA DUCC: uima-ducc-rm .................... SKIPPED
[INFO] Apache UIMA DUCC: uima-ducc-sm .................... SKIPPED
[INFO] Apache UIMA DUCC: uima-ducc-orchestrator .......... SKIPPED
[INFO] Apache UIMA DUCC: uima-ducc-agent ................. SKIPPED
[INFO] uima-ducc-duccdocs ................................ SKIPPED
[INFO] Apache UIMA DUCC: uima-ducc-web ................... SKIPPED
[INFO] Apache UIMA DUCC: uima-ducc-examples .............. SKIPPED
[INFO] Apache UIMA DUCC: uima-ducc-db .................... SKIPPED
[INFO] uima-ducc-spawn ................................... SKIPPED
[INFO] Apache UIMA-DUCC: uima-ducc ....................... SKIPPED
[INFO] ------------------------------------------------------------------------
[INFO] BUILD FAILURE
[INFO] ------------------------------------------------------------------------
[INFO] Total time: 1:09.954s
[INFO] Finished at: Sat Feb 07 14:45:56 UTC 2015
[INFO] Final Memory: 59M/291M
[INFO] ------------------------------------------------------------------------
Waiting for Jenkins to finish collecting data[ERROR] Failed to execute goal org.codehaus.mojo:findbugs-maven-plugin:3.0.0:findbugs
(default-cli) on project uima-ducc-user: Execution default-cli of goal org.codehaus.mojo:findbugs-maven-plugin:3.0.0:findbugs
failed: Java returned: 1 -> [Help 1]
[ERROR] 
[ERROR] To see the full stack trace of the errors, re-run Maven with the -e switch.
[ERROR] Re-run Maven using the -X switch to enable full debug logging.
[ERROR] 
[ERROR] For more information about the errors and possible solutions, please read the following
articles:
[ERROR] [Help 1] http://cwiki.apache.org/confluence/display/MAVEN/PluginExecutionException
[ERROR] 
[ERROR] After correcting the problems, you can resume the build with the command
[ERROR]   mvn <goals> -rf :uima-ducc-user

[JENKINS] Archiving <https://builds.apache.org/job/UIMA-DUCC/ws/trunk/uima-ducc-web/pom.xml>
to org.apache.uima/uima-ducc-web/2.0.0-SNAPSHOT/uima-ducc-web-2.0.0-SNAPSHOT.pom
Sending artifact delta relative to UIMA-DUCC » Apache UIMA DUCC: uima-ducc-web #205
Archived 1 artifacts
Archive block size is 32768
Received 0 blocks and 7169 bytes
Compression is 0.0%
Took 0.12 sec
[JENKINS] Archiving <https://builds.apache.org/job/UIMA-DUCC/ws/trunk/uima-ducc-db/pom.xml>
to org.apache.uima/uima-ducc-db/2.0.0-SNAPSHOT/uima-ducc-db-2.0.0-SNAPSHOT.pom
Sending artifact delta relative to UIMA-DUCC » Apache UIMA DUCC: uima-ducc-db #205
Archived 1 artifacts
Archive block size is 32768
Received 0 blocks and 4010 bytes
Compression is 0.0%
Took 92 ms
[JENKINS] Archiving <https://builds.apache.org/job/UIMA-DUCC/ws/trunk/uima-ducc-rm/pom.xml>
to org.apache.uima/uima-ducc-rm/2.0.0-SNAPSHOT/uima-ducc-rm-2.0.0-SNAPSHOT.pom
Sending artifact delta relative to UIMA-DUCC » Apache UIMA DUCC: uima-ducc-rm #205
Archived 1 artifacts
Archive block size is 32768
Received 0 blocks and 2737 bytes
Compression is 0.0%
Took 0.12 sec
[JENKINS] Archiving <https://builds.apache.org/job/UIMA-DUCC/ws/trunk/uima-ducc-sm/pom.xml>
to org.apache.uima/uima-ducc-sm/2.0.0-SNAPSHOT/uima-ducc-sm-2.0.0-SNAPSHOT.pom
Sending artifact delta relative to UIMA-DUCC » Apache UIMA DUCC: uima-ducc-sm #205
Archived 1 artifacts
Archive block size is 32768
Received 0 blocks and 2956 bytes
Compression is 0.0%
Took 86 ms
[JENKINS] Archiving <https://builds.apache.org/job/UIMA-DUCC/ws/trunk/uima-ducc-parent/pom.xml>
to org.apache.uima/uima-ducc-parent/2.0.0-SNAPSHOT/uima-ducc-parent-2.0.0-SNAPSHOT.pom
Sending artifact delta relative to UIMA-DUCC » uima-ducc-parent #207
Archived 1 artifacts
Archive block size is 32768
Received 0 blocks and 23471 bytes
Compression is 0.0%
Took 90 ms
[JENKINS] Archiving <https://builds.apache.org/job/UIMA-DUCC/ws/trunk/uima-ducc-spawn/pom.xml>
to org.apache.uima/uima-ducc-spawn/2.0.0-SNAPSHOT/uima-ducc-spawn-2.0.0-SNAPSHOT.pom
Sending artifact delta relative to UIMA-DUCC » uima-ducc-spawn #205
Archived 1 artifacts
Archive block size is 32768
Received 0 blocks and 2217 bytes
Compression is 0.0%
Took 84 ms
[JENKINS] Archiving <https://builds.apache.org/job/UIMA-DUCC/ws/trunk/uima-ducc-orchestrator/pom.xml>
to org.apache.uima/uima-ducc-orchestrator/2.0.0-SNAPSHOT/uima-ducc-orchestrator-2.0.0-SNAPSHOT.pom
Sending artifact delta relative to UIMA-DUCC » Apache UIMA DUCC: uima-ducc-orchestrator #205
Archived 1 artifacts
Archive block size is 32768
Received 0 blocks and 3015 bytes
Compression is 0.0%
Took 0.1 sec
[JENKINS] Archiving <https://builds.apache.org/job/UIMA-DUCC/ws/trunk/uima-ducc-container/pom.xml>
to org.apache.uima/uima-ducc-container/2.0.0-SNAPSHOT/uima-ducc-container-2.0.0-SNAPSHOT.pom
No prior successful build to compare, so performing full copy of artifacts
[JENKINS] Archiving <https://builds.apache.org/job/UIMA-DUCC/ws/trunk/uima-ducc-examples/pom.xml>
to org.apache.uima/uima-ducc-examples/2.0.0-SNAPSHOT/uima-ducc-examples-2.0.0-SNAPSHOT.pom
Sending artifact delta relative to UIMA-DUCC » Apache UIMA DUCC: uima-ducc-examples #205
Archived 1 artifacts
Archive block size is 32768
Received 0 blocks and 3693 bytes
Compression is 0.0%
Took 0.1 sec
[JENKINS] Archiving <https://builds.apache.org/job/UIMA-DUCC/ws/trunk/uima-ducc-common/pom.xml>
to org.apache.uima/uima-ducc-common/2.0.0-SNAPSHOT/uima-ducc-common-2.0.0-SNAPSHOT.pom
Sending artifact delta relative to UIMA-DUCC » Apache UIMA DUCC: uima-ducc-common #205
Archived 1 artifacts
Archive block size is 32768
Received 0 blocks and 4291 bytes
Compression is 0.0%
Took 0.18 sec
[JENKINS] Archiving <https://builds.apache.org/job/UIMA-DUCC/ws/trunk/uima-ducc-duccdocs/pom.xml>
to org.apache.uima/uima-ducc-duccdocs/2.0.0-SNAPSHOT/uima-ducc-duccdocs-2.0.0-SNAPSHOT.pom
Sending artifact delta relative to UIMA-DUCC » uima-ducc-duccdocs #205
Archived 1 artifacts
Archive block size is 32768
Received 0 blocks and 18042 bytes
Compression is 0.0%
Took 88 ms
[JENKINS] Archiving <https://builds.apache.org/job/UIMA-DUCC/ws/trunk/uima-ducc-user/pom.xml>
to org.apache.uima/uima-ducc-user/2.0.0-SNAPSHOT/uima-ducc-user-2.0.0-SNAPSHOT.pom
[JENKINS] Archiving <https://builds.apache.org/job/UIMA-DUCC/ws/trunk/uima-ducc-user/target/uima-ducc-user-2.0.0-SNAPSHOT.jar>
to org.apache.uima/uima-ducc-user/2.0.0-SNAPSHOT/uima-ducc-user-2.0.0-SNAPSHOT.jar
No prior successful build to compare, so performing full copy of artifacts
[JENKINS] Archiving <https://builds.apache.org/job/UIMA-DUCC/ws/trunk/uima-ducc-agent/pom.xml>
to org.apache.uima/uima-ducc-agent/2.0.0-SNAPSHOT/uima-ducc-agent-2.0.0-SNAPSHOT.pom
Sending artifact delta relative to UIMA-DUCC » Apache UIMA DUCC: uima-ducc-agent #205
Archived 1 artifacts
Archive block size is 32768
Received 0 blocks and 3607 bytes
Compression is 0.0%
Took 0.2 sec
[JENKINS] Archiving <https://builds.apache.org/job/UIMA-DUCC/ws/trunk/uima-ducc-cli/pom.xml>
to org.apache.uima/uima-ducc-cli/2.0.0-SNAPSHOT/uima-ducc-cli-2.0.0-SNAPSHOT.pom
Sending artifact delta relative to UIMA-DUCC » Apache UIMA DUCC: uima-ducc-cli #205
Archived 1 artifacts
Archive block size is 32768
Received 0 blocks and 5923 bytes
Compression is 0.0%
Took 0.32 sec
[JENKINS] Archiving <https://builds.apache.org/job/UIMA-DUCC/ws/trunk/uima-ducc-jd/pom.xml>
to org.apache.uima/uima-ducc-jd/2.0.0-SNAPSHOT/uima-ducc-jd-2.0.0-SNAPSHOT.pom
Sending artifact delta relative to UIMA-DUCC » Apache UIMA DUCC: uima-ducc-jd #205
Archived 1 artifacts
Archive block size is 32768
Received 0 blocks and 3306 bytes
Compression is 0.0%
Took 0.13 sec
[JENKINS] Archiving <https://builds.apache.org/job/UIMA-DUCC/ws/trunk/pom.xml> to org.apache.uima/uima-ducc/2.0.0-SNAPSHOT/uima-ducc-2.0.0-SNAPSHOT.pom
Sending artifact delta relative to UIMA-DUCC » Apache UIMA-DUCC: uima-ducc #205
Archived 1 artifacts
Archive block size is 32768
Received 0 blocks and 16492 bytes
Compression is 0.0%
Took 1.4 sec
[JENKINS] Archiving <https://builds.apache.org/job/UIMA-DUCC/ws/trunk/uima-ducc-pm/pom.xml>
to org.apache.uima/uima-ducc-pm/2.0.0-SNAPSHOT/uima-ducc-pm-2.0.0-SNAPSHOT.pom
Sending artifact delta relative to UIMA-DUCC » Apache UIMA DUCC: uima-ducc-pm #205
Archived 1 artifacts
Archive block size is 32768
Received 0 blocks and 2764 bytes
Compression is 0.0%
Took 0.18 sec
[JENKINS] Archiving <https://builds.apache.org/job/UIMA-DUCC/ws/trunk/uima-ducc-transport/pom.xml>
to org.apache.uima/uima-ducc-transport/2.0.0-SNAPSHOT/uima-ducc-transport-2.0.0-SNAPSHOT.pom
Sending artifact delta relative to UIMA-DUCC » Apache UIMA DUCC: uima-ducc-transport #205
Archived 1 artifacts
Archive block size is 32768
Received 0 blocks and 3612 bytes
Compression is 0.0%
Took 0.18 sec
Sending e-mails to: dev@uima.apache.org
channel stopped
[WARNINGS] Skipping publisher since build result is FAILURE

Mime
View raw message