uima-dev mailing list archives

Site index · List index
Message view « Date » · « Thread »
Top « Date » · « Thread »
From Apache Jenkins Server <jenk...@builds.apache.org>
Subject Build failed in Jenkins: UIMA-uimaFIT #203
Date Wed, 04 Mar 2015 17:08:39 GMT
See <https://builds.apache.org/job/UIMA-uimaFIT/203/changes>

Changes:

[rec] [UIMA-4273] Upgrade to UIMA-SDK 2.7.0
- Upgrade to 2.7.0-SNAPSHOT
- Upgrade to Java 7

------------------------------------------
[...truncated 645 lines...]
At revision 1664071
Parsing POMs
using settings config with name simple-deploy-settings-no-mirror
Modules changed, recalculating dependency graph
maven3-agent.jar already up to date
maven3-interceptor.jar already up to date
maven3-interceptor-commons.jar already up to date
[trunk] $ f:\jenkins\tools\java\latest-1.6-64/bin/java -Xmx800m -XX:MaxPermSize=256m -cp f:\jenkins\jenkins-slave\maven3-agent.jar;f:\jenkins\jenkins-slave\tools\hudson.tasks.Maven_MavenInstallation\Maven_3.0.3\boot\plexus-classworlds-2.4.jar
org.jvnet.hudson.maven3.agent.Maven3Main f:\jenkins\jenkins-slave\tools\hudson.tasks.Maven_MavenInstallation\Maven_3.0.3
F:\jenkins\jenkins-slave\slave.jar f:\jenkins\jenkins-slave\maven3-interceptor.jar f:\jenkins\jenkins-slave\maven3-interceptor-commons.jar
62244
<===[JENKINS REMOTING CAPACITY]===>   channel started
using settings config with name simple-deploy-settings-no-mirror
Executing Maven:  -B -f <https://builds.apache.org/job/UIMA-uimaFIT/ws/trunk\pom.xml>
-Dmaven.repo.local=f:\jenkins\jenkins-slave\maven-repositories\1 -s C:\Windows\TEMP\settings6348020961453920582.xml
-U -Djava.awt.headless=true -Ppmd,cobertura,findbugs clean install dependency:analyze javadoc:aggregate
[INFO] Scanning for projects...
[INFO] ------------------------------------------------------------------------
[INFO] Reactor Build Order:
[INFO] 
[INFO] Apache UIMA uimaFIT - Parent
[INFO] Apache UIMA uimaFIT - Core
[INFO] Apache UIMA uimaFIT - Examples
[INFO] Apache UIMA uimaFIT - Spring integration
[INFO] Apache UIMA uimaFIT - Maven Plugin
[INFO] Apache UIMA uimaFIT - Legacy uimaFIT support
[INFO] Apache UIMA uimaFIT - Documentation
[INFO] Apache UIMA uimaFIT - Collection Processing Engine support
[INFO] Apache UIMA uimaFIT
[INFO]                                                                         
[INFO] ------------------------------------------------------------------------
[INFO] Building Apache UIMA uimaFIT - Parent 2.2.0-SNAPSHOT
[INFO] ------------------------------------------------------------------------
[INFO] 
[INFO] --- maven-clean-plugin:2.5:clean (default-clean) @ uimafit-parent ---
[TASKS] Scanning folder 'F:\jenkins\jenkins-slave\workspace\UIMA-uimaFIT\trunk\uimafit-parent'
for files matching the pattern '**/*.java' - excludes: 
[TASKS] Found 0 files to scan for tasks
Found 0 open tasks.
[TASKS] Computing warning deltas based on reference build #202
log4j:WARN No appenders could be found for logger (org.apache.commons.beanutils.converters.BooleanConverter).
log4j:WARN Please initialize the log4j system properly.
[INFO] 
[INFO] --- maven-enforcer-plugin:1.3.1:enforce (enforce-versions) @ uimafit-parent ---
[INFO] 
[INFO] --- build-helper-maven-plugin:1.8:parse-version (parse-project-version) @ uimafit-parent
---
[INFO] 
[INFO] --- uima-build-helper-maven-plugin:7:parse-date-time (set buildYear and buildMonth)
@ uimafit-parent ---
[INFO] 
[INFO] --- gmaven-plugin:1.5:execute (read-notice) @ uimafit-parent ---
[INFO] 
[INFO] --- maven-remote-resources-plugin:1.5:process (default) @ uimafit-parent ---
[INFO] 
[INFO] --- maven-antrun-plugin:1.7:run (dup-meta-jar-cleanup) @ uimafit-parent ---
[INFO] Executing tasks

main:
[INFO] Executed tasks
[INFO] 
[INFO] --- maven-site-plugin:3.3:attach-descriptor (attach-descriptor) @ uimafit-parent ---
[INFO] 
[INFO] --- findbugs-maven-plugin:2.5.4:findbugs (default) @ uimafit-parent ---
[FINDBUGS] No report found for mojo findbugs
[INFO] 
[INFO] --- maven-enforcer-plugin:1.3.1:enforce (enforce-versions) @ uimafit-parent ---
[INFO] 
[INFO] --- build-helper-maven-plugin:1.8:parse-version (parse-project-version) @ uimafit-parent
---
[INFO] 
[INFO] --- uima-build-helper-maven-plugin:7:parse-date-time (set buildYear and buildMonth)
@ uimafit-parent ---
[INFO] 
[INFO] --- gmaven-plugin:1.5:execute (read-notice) @ uimafit-parent ---
[INFO] 
[INFO] --- maven-remote-resources-plugin:1.5:process (default) @ uimafit-parent ---
[INFO] 
[INFO] --- cobertura-maven-plugin:2.6:instrument (default) @ uimafit-parent ---
[INFO] Skipping cobertura mojo for project with packaging type 'pom'
[INFO] 
[INFO] --- cobertura-maven-plugin:2.6:cobertura (default) @ uimafit-parent ---
[INFO] 
[INFO] --- maven-pmd-plugin:3.1:cpd (default) @ uimafit-parent ---
[DRY] No report found for mojo cpd
[INFO] 
[INFO] --- maven-pmd-plugin:3.1:pmd (default) @ uimafit-parent ---
[PMD] No report found for mojo pmd
[INFO] 
[INFO] --- maven-install-plugin:2.5.1:install (default-install) @ uimafit-parent ---
[INFO] Installing F:\jenkins\jenkins-slave\workspace\UIMA-uimaFIT\trunk\uimafit-parent\pom.xml
to f:\jenkins\jenkins-slave\maven-repositories\1\org\apache\uima\uimafit-parent\2.2.0-SNAPSHOT\uimafit-parent-2.2.0-SNAPSHOT.pom
[INFO] 
[INFO] --- maven-enforcer-plugin:1.3.1:enforce (enforce-versions) @ uimafit-parent ---
[INFO] 
[INFO] --- build-helper-maven-plugin:1.8:parse-version (parse-project-version) @ uimafit-parent
---
[INFO] 
[INFO] --- uima-build-helper-maven-plugin:7:parse-date-time (set buildYear and buildMonth)
@ uimafit-parent ---
[INFO] 
[INFO] --- gmaven-plugin:1.5:execute (read-notice) @ uimafit-parent ---
[INFO] 
[INFO] --- maven-remote-resources-plugin:1.5:process (default) @ uimafit-parent ---
[WARNING] Failed to getClass for org.apache.maven.plugin.dependency.analyze.AnalyzeMojo
[INFO] 
[INFO] --- maven-dependency-plugin:2.8:analyze (default-cli) @ uimafit-parent ---
[INFO] Skipping pom project
[INFO]                                                                         
[INFO] ------------------------------------------------------------------------
[INFO] Building Apache UIMA uimaFIT - Core 2.2.0-SNAPSHOT
[INFO] ------------------------------------------------------------------------
Downloading: http://repository.apache.org/snapshots/org/apache/uima/jcasgen-maven-plugin/2.7.0-SNAPSHOT/maven-metadata.xml
Downloaded: http://repository.apache.org/snapshots/org/apache/uima/jcasgen-maven-plugin/2.7.0-SNAPSHOT/maven-metadata.xml
(788 B at 1.2 KB/sec)
Downloading: http://repository.apache.org/snapshots/org/apache/uima/jcasgen-maven-plugin/2.7.0-SNAPSHOT/jcasgen-maven-plugin-2.7.0-20150302.222921-68.pom
Downloaded: http://repository.apache.org/snapshots/org/apache/uima/jcasgen-maven-plugin/2.7.0-SNAPSHOT/jcasgen-maven-plugin-2.7.0-20150302.222921-68.pom
(5 KB at 59.4 KB/sec)
Downloading: http://repository.apache.org/snapshots/org/apache/uima/uimaj-parent/2.7.0-SNAPSHOT/maven-metadata.xml
Downloaded: http://repository.apache.org/snapshots/org/apache/uima/uimaj-parent/2.7.0-SNAPSHOT/maven-metadata.xml
(606 B at 3.8 KB/sec)
Downloading: http://repository.apache.org/snapshots/org/apache/uima/uimaj-parent/2.7.0-SNAPSHOT/uimaj-parent-2.7.0-20150302.222933-68.pom
Downloaded: http://repository.apache.org/snapshots/org/apache/uima/uimaj-parent/2.7.0-SNAPSHOT/uimaj-parent-2.7.0-20150302.222933-68.pom
(7 KB at 94.4 KB/sec)
Downloading: http://repository.apache.org/snapshots/org/apache/uima/jcasgen-maven-plugin/2.7.0-SNAPSHOT/jcasgen-maven-plugin-2.7.0-20150302.222921-68.jar
Downloaded: http://repository.apache.org/snapshots/org/apache/uima/jcasgen-maven-plugin/2.7.0-SNAPSHOT/jcasgen-maven-plugin-2.7.0-20150302.222921-68.jar
(28 KB at 591.7 KB/sec)
Downloading: http://repository.apache.org/snapshots/org/apache/uima/uimaj-core/2.7.0-SNAPSHOT/maven-metadata.xml
Downloaded: http://repository.apache.org/snapshots/org/apache/uima/uimaj-core/2.7.0-SNAPSHOT/maven-metadata.xml
(778 B at 1.3 KB/sec)
Downloading: http://repository.apache.org/snapshots/org/apache/uima/uimaj-core/2.7.0-SNAPSHOT/uimaj-core-2.7.0-20150302.222928-69.pom
Downloaded: http://repository.apache.org/snapshots/org/apache/uima/uimaj-core/2.7.0-SNAPSHOT/uimaj-core-2.7.0-20150302.222928-69.pom
(8 KB at 10.6 KB/sec)
Downloading: http://repository.apache.org/snapshots/org/apache/uima/uimaj-core/2.7.0-SNAPSHOT/uimaj-core-2.7.0-20150302.222928-69.jar
Downloaded: http://repository.apache.org/snapshots/org/apache/uima/uimaj-core/2.7.0-SNAPSHOT/uimaj-core-2.7.0-20150302.222928-69.jar
(1544 KB at 1142.8 KB/sec)
[INFO] 
[INFO] --- maven-clean-plugin:2.5:clean (default-clean) @ uimafit-core ---
[TASKS] Scanning folder 'F:\jenkins\jenkins-slave\workspace\UIMA-uimaFIT\trunk\uimafit-core'
for files matching the pattern '**/*.java' - excludes: 
[TASKS] Found 146 files to scan for tasks
Found 3 open tasks.
[TASKS] Computing warning deltas based on reference build #202
[INFO] 
[INFO] --- maven-enforcer-plugin:1.3.1:enforce (enforce-versions) @ uimafit-core ---
[INFO] 
[INFO] --- build-helper-maven-plugin:1.8:parse-version (parse-project-version) @ uimafit-core
---
[INFO] 
[INFO] --- uima-build-helper-maven-plugin:7:parse-date-time (set buildYear and buildMonth)
@ uimafit-core ---
[INFO] 
[INFO] --- gmaven-plugin:1.5:execute (read-notice) @ uimafit-core ---
[INFO] 
[INFO] --- maven-remote-resources-plugin:1.5:process (default) @ uimafit-core ---
Downloading: http://repository.apache.org/snapshots/org/apache/uima/uimaj-parent/2.7.0-SNAPSHOT/maven-metadata.xml
Downloaded: http://repository.apache.org/snapshots/org/apache/uima/uimaj-parent/2.7.0-SNAPSHOT/maven-metadata.xml
(606 B at 5.5 KB/sec)
Downloading: http://repository.apache.org/snapshots/org/apache/uima/uimaj-parent/2.7.0-SNAPSHOT/uimaj-parent-2.7.0-20150302.222933-68.pom
Downloaded: http://repository.apache.org/snapshots/org/apache/uima/uimaj-parent/2.7.0-SNAPSHOT/uimaj-parent-2.7.0-20150302.222933-68.pom
(0 B at 0.0 KB/sec)
Downloading: http://repository.apache.org/snapshots/org/apache/uima/uimaj-core/2.7.0-SNAPSHOT/maven-metadata.xml
Downloaded: http://repository.apache.org/snapshots/org/apache/uima/uimaj-core/2.7.0-SNAPSHOT/maven-metadata.xml
(778 B at 5.4 KB/sec)
[INFO] 
[INFO] --- maven-resources-plugin:2.6:resources (default-resources) @ uimafit-core ---
[INFO] Using 'UTF-8' encoding to copy filtered resources.
[INFO] Copying 1 resource
[INFO] Copying 3 resources
[INFO] 
[INFO] --- maven-compiler-plugin:3.1:compile (default-compile) @ uimafit-core ---
[INFO] Changes detected - recompiling the module!
[INFO] Compiling 84 source files to F:\jenkins\jenkins-slave\workspace\UIMA-uimaFIT\trunk\uimafit-core\target\classes
[INFO]                                                                         
[INFO] ------------------------------------------------------------------------
[INFO] Skipping Apache UIMA uimaFIT
[INFO] This project has been banned from the build due to previous failures.
[INFO] ------------------------------------------------------------------------
[INFO] ------------------------------------------------------------------------
[INFO] Reactor Summary:
[INFO] 
[INFO] Apache UIMA uimaFIT - Parent ...................... SUCCESS [23.553s]
[INFO] Apache UIMA uimaFIT - Core ........................ FAILURE [9.165s]
[INFO] Apache UIMA uimaFIT - Examples .................... SKIPPED
[INFO] Apache UIMA uimaFIT - Spring integration .......... SKIPPED
[INFO] Apache UIMA uimaFIT - Maven Plugin ................ SKIPPED
[INFO] Apache UIMA uimaFIT - Legacy uimaFIT support ...... SKIPPED
[INFO] Apache UIMA uimaFIT - Documentation ............... SKIPPED
[INFO] Apache UIMA uimaFIT - Collection Processing Engine support  SKIPPED
[INFO] Apache UIMA uimaFIT ............................... SKIPPED
[INFO] ------------------------------------------------------------------------
[INFO] BUILD FAILURE
[INFO] ------------------------------------------------------------------------
[INFO] Total time: 35.806s
[INFO] Finished at: Wed Mar 04 09:08:17 PST 2015
[INFO] Final Memory: 33M/81M
[INFO] ------------------------------------------------------------------------
Waiting for Jenkins to finish collecting data
[ERROR] Failed to execute goal org.apache.maven.plugins:maven-compiler-plugin:3.1:compile
(default-compile) on project uimafit-core: Fatal error compiling: invalid target release:
1.7 -> [Help 1]
[ERROR] 
[ERROR] To see the full stack trace of the errors, re-run Maven with the -e switch.
[ERROR] Re-run Maven using the -X switch to enable full debug logging.
[ERROR] 
[ERROR] For more information about the errors and possible solutions, please read the following
articles:
[ERROR] [Help 1] http://cwiki.apache.org/confluence/display/MAVEN/MojoExecutionException
[ERROR] 
[ERROR] After correcting the problems, you can resume the build with the command
[ERROR]   mvn <goals> -rf :uimafit-core
[JENKINS] Archiving F:\jenkins\jenkins-slave\workspace\UIMA-uimaFIT\trunk\uimafit-maven-plugin\pom.xml
to org.apache.uima/uimafit-maven-plugin/2.2.0-SNAPSHOT/uimafit-maven-plugin-2.2.0-SNAPSHOT.pom
Sending artifact delta relative to UIMA-uimaFIT » Apache UIMA uimaFIT - Maven Plugin #202
Archived 1 artifacts
Archive block size is 32768
Received 0 blocks and 5696 bytes
Compression is 0.0%
Took 58 ms
[JENKINS] Archiving F:\jenkins\jenkins-slave\workspace\UIMA-uimaFIT\trunk\uimafit-spring\pom.xml
to org.apache.uima/uimafit-spring/2.2.0-SNAPSHOT/uimafit-spring-2.2.0-SNAPSHOT.pom
Sending artifact delta relative to UIMA-uimaFIT » Apache UIMA uimaFIT - Spring integration
#202
Archived 1 artifacts
Archive block size is 32768
Received 0 blocks and 2340 bytes
Compression is 0.0%
Took 31 ms
[JENKINS] Archiving F:\jenkins\jenkins-slave\workspace\UIMA-uimaFIT\trunk\uimafit-examples\pom.xml
to org.apache.uima/uimafit-examples/2.2.0-SNAPSHOT/uimafit-examples-2.2.0-SNAPSHOT.pom
Sending artifact delta relative to UIMA-uimaFIT » Apache UIMA uimaFIT - Examples #202
Archived 1 artifacts
Archive block size is 32768
Received 0 blocks and 3852 bytes
Compression is 0.0%
Took 23 ms
[JENKINS] Archiving F:\jenkins\jenkins-slave\workspace\UIMA-uimaFIT\trunk\uimafit-cpe\pom.xml
to org.apache.uima/uimafit-cpe/2.2.0-SNAPSHOT/uimafit-cpe-2.2.0-SNAPSHOT.pom
Sending artifact delta relative to UIMA-uimaFIT » Apache UIMA uimaFIT - Collection Processing
Engine support #202
Archived 1 artifacts
Archive block size is 32768
Received 0 blocks and 1990 bytes
Compression is 0.0%
Took 39 ms
[JENKINS] Archiving F:\jenkins\jenkins-slave\workspace\UIMA-uimaFIT\trunk\uimafit-docbook\pom.xml
to org.apache.uima/uimafit-docbook/2.2.0-SNAPSHOT/uimafit-docbook-2.2.0-SNAPSHOT.pom
Sending artifact delta relative to UIMA-uimaFIT » Apache UIMA uimaFIT - Documentation #202
Archived 1 artifacts
Archive block size is 32768
Received 0 blocks and 1631 bytes
Compression is 0.0%
Took 23 ms
[JENKINS] Archiving F:\jenkins\jenkins-slave\workspace\UIMA-uimaFIT\trunk\uimafit-legacy-support\pom.xml
to org.apache.uima/uimafit-legacy-support/2.2.0-SNAPSHOT/uimafit-legacy-support-2.2.0-SNAPSHOT.pom
Sending artifact delta relative to UIMA-uimaFIT » Apache UIMA uimaFIT - Legacy uimaFIT support
#202
Archived 1 artifacts
Archive block size is 32768
Received 0 blocks and 5217 bytes
Compression is 0.0%
Took 26 ms
[JENKINS] Archiving F:\jenkins\jenkins-slave\workspace\UIMA-uimaFIT\trunk\uimafit-parent\pom.xml
to org.apache.uima/uimafit-parent/2.2.0-SNAPSHOT/uimafit-parent-2.2.0-SNAPSHOT.pom
Sending artifact delta relative to UIMA-uimaFIT » Apache UIMA uimaFIT - Parent #202
Archived 1 artifacts
Archive block size is 32768
Received 0 blocks and 7052 bytes
Compression is 0.0%
Took 12 ms
[JENKINS] Archiving F:\jenkins\jenkins-slave\workspace\UIMA-uimaFIT\trunk\uimafit-core\pom.xml
to org.apache.uima/uimafit-core/2.2.0-SNAPSHOT/uimafit-core-2.2.0-SNAPSHOT.pom
Sending artifact delta relative to UIMA-uimaFIT » Apache UIMA uimaFIT - Core #202
Archived 1 artifacts
Archive block size is 32768
Received 0 blocks and 6077 bytes
Compression is 0.0%
Took 31 ms
[JENKINS] Archiving <https://builds.apache.org/job/UIMA-uimaFIT/ws/trunk\pom.xml> to
org.apache.uima/uimafit/2.2.0-SNAPSHOT/uimafit-2.2.0-SNAPSHOT.pom
Sending artifact delta relative to UIMA-uimaFIT » Apache UIMA uimaFIT #202
Archived 1 artifacts
Archive block size is 32768
Received 0 blocks and 5481 bytes
Compression is 0.0%
Took 0.19 sec
Sending e-mails to: dev@uima.apache.org
channel stopped
[WARNINGS] Skipping publisher since build result is FAILURE
Archiving artifacts
Skipping Cobertura coverage report as build was not UNSTABLE or better ...

Mime
View raw message