uima-dev mailing list archives

Site index · List index
Message view « Date » · « Thread »
Top « Date » · « Thread »
From Apache Jenkins Server <jenk...@builds.apache.org>
Subject Build failed in Jenkins: UIMA-DUCC #250
Date Tue, 03 Mar 2015 13:48:26 GMT
See <https://builds.apache.org/job/UIMA-DUCC/250/changes>

Changes:

[burn] UIMA-4258 Move the don't-replace-placeholders-again-flag into a common subclass for
all CLI apis to use

------------------------------------------
[...truncated 3447 lines...]
Tests run: 12, Failures: 0, Errors: 0, Skipped: 0, Time elapsed: 3.399 sec - in org.apache.uima.ducc.user.jd.test.TestSuite

Results :

Tests run: 12, Failures: 0, Errors: 0, Skipped: 0

[JENKINS] Recording test results
[INFO] 
[INFO] --- cobertura-maven-plugin:2.6:cobertura (default-cli) @ uima-ducc-user ---
[INFO] Cobertura 2.0.3 - GNU GPL License (NO WARRANTY) - See COPYRIGHT file
Report time: 811ms

[ERROR] Mar 3, 2015 1:48:03 PM net.sourceforge.cobertura.coveragedata.CoverageDataFileHandler
loadCoverageData
INFO: Cobertura: Loaded information on 51 classes.

[INFO] Cobertura Report generation was successful.
[INFO] 
[INFO] --- maven-enforcer-plugin:1.3.1:enforce (enforce-versions) @ uima-ducc-user ---
[INFO] 
[INFO] --- build-helper-maven-plugin:1.8:parse-version (parse-project-version) @ uima-ducc-user
---
[INFO] 
[INFO] --- uima-build-helper-maven-plugin:7:parse-date-time (set buildYear and buildMonth)
@ uima-ducc-user ---
[WARNING] Failed to getClass for org.apache.maven.plugin.javadoc.JavadocReport
[INFO] 
[INFO] --- maven-javadoc-plugin:2.9.1:javadoc (default-cli) @ uima-ducc-user ---
[INFO] 
2 warnings
[JENKINS] Archiving  javadoc
[INFO] ------------------------------------------------------------------------
[INFO] Reactor Summary:
[INFO] 
[INFO] uima-ducc-parent .................................. SUCCESS [31.538s]
[INFO] Apache UIMA DUCC: uima-ducc-user .................. FAILURE [1:14.435s]
[INFO] Apache UIMA DUCC: uima-ducc-common ................ SKIPPED
[INFO] Apache UIMA DUCC: uima-ducc-container ............. SKIPPED
[INFO] Apache UIMA DUCC: uima-ducc-transport ............. SKIPPED
[INFO] Apache UIMA DUCC: uima-ducc-cli ................... SKIPPED
[INFO] Apache UIMA DUCC: uima-ducc-jd .................... SKIPPED
[INFO] Apache UIMA DUCC: uima-ducc-pm .................... SKIPPED
[INFO] Apache UIMA DUCC: uima-ducc-rm .................... SKIPPED
[INFO] Apache UIMA DUCC: uima-ducc-sm .................... SKIPPED
[INFO] Apache UIMA DUCC: uima-ducc-orchestrator .......... SKIPPED
[INFO] Apache UIMA DUCC: uima-ducc-agent ................. SKIPPED
[INFO] uima-ducc-duccdocs ................................ SKIPPED
[INFO] Apache UIMA DUCC: uima-ducc-web ................... SKIPPED
[INFO] Apache UIMA DUCC: uima-ducc-examples .............. SKIPPED
[INFO] Apache UIMA DUCC: uima-ducc-db .................... SKIPPED
[INFO] uima-ducc-spawn ................................... SKIPPED
[INFO] Apache UIMA-DUCC: uima-ducc ....................... SKIPPED
[INFO] ------------------------------------------------------------------------
[INFO] BUILD FAILURE
[INFO] ------------------------------------------------------------------------
[INFO] Total time: 2:02.136s
[INFO] Finished at: Tue Mar 03 13:48:08 GMT 2015
[INFO] Final Memory: 58M/341M
[INFO] ------------------------------------------------------------------------
Waiting for Jenkins to finish collecting data
[ERROR] Failed to execute goal org.apache.maven.plugins:maven-javadoc-plugin:2.9.1:javadoc
(default-cli) on project uima-ducc-user: An error has occurred in JavaDocs report generation:
[ERROR] Exit code: 1 - F:\hudson\hudson-slave\workspace\UIMA-DUCC\trunk\uima-ducc-user\src\main\java\org\apache\uima\ducc\user\common\Utils.java:91:
warning - @return tag has no arguments.
[ERROR] F:\hudson\hudson-slave\workspace\UIMA-DUCC\trunk\uima-ducc-user\src\main\java\org\apache\uima\ducc\user\common\Utils.java:40:
warning - @param argument "props" is not a parameter name.
[ERROR] java.io.FileNotFoundException: F:\hudson\hudson-slave\workspace\UIMA-DUCC\trunk\uima-ducc-user\target\site\apidocs\org\apache\uima\ducc\user\error\iface\StringifyUserError.html
(There is not enough space on the disk)
[ERROR] at java.io.FileOutputStream.open(Native Method)
[ERROR] at java.io.FileOutputStream.<init>(FileOutputStream.java:194)
[ERROR] at java.io.FileOutputStream.<init>(FileOutputStream.java:84)
[ERROR] at com.sun.tools.doclets.internal.toolkit.util.Util.genWriter(Util.java:577)
[ERROR] at com.sun.tools.doclets.formats.html.markup.HtmlWriter.<init>(HtmlWriter.java:61)
[ERROR] at com.sun.tools.doclets.formats.html.markup.HtmlDocWriter.<init>(HtmlDocWriter.java:47)
[ERROR] at com.sun.tools.doclets.formats.html.HtmlDocletWriter.<init>(HtmlDocletWriter.java:95)
[ERROR] at com.sun.tools.doclets.formats.html.SubWriterHolderWriter.<init>(SubWriterHolderWriter.java:40)
[ERROR] at com.sun.tools.doclets.formats.html.ClassWriterImpl.<init>(ClassWriterImpl.java:49)
[ERROR] at com.sun.tools.doclets.formats.html.WriterFactoryImpl.getClassWriter(WriterFactoryImpl.java:64)
[ERROR] at com.sun.tools.doclets.internal.toolkit.builders.BuilderFactory.getClassBuilder(BuilderFactory.java:83)
[ERROR] at com.sun.tools.doclets.formats.html.HtmlDoclet.generateClassFiles(HtmlDoclet.java:152)
[ERROR] at com.sun.tools.doclets.internal.toolkit.AbstractDoclet.generateClassFiles(AbstractDoclet.java:164)
[ERROR] at com.sun.tools.doclets.internal.toolkit.AbstractDoclet.startGeneration(AbstractDoclet.java:106)
[ERROR] at com.sun.tools.doclets.internal.toolkit.AbstractDoclet.start(AbstractDoclet.java:64)
[ERROR] at com.sun.tools.doclets.formats.html.HtmlDoclet.start(HtmlDoclet.java:42)
[ERROR] at com.sun.tools.doclets.standard.Standard.start(Standard.java:23)
[ERROR] at sun.reflect.NativeMethodAccessorImpl.invoke0(Native Method)
[ERROR] at sun.reflect.NativeMethodAccessorImpl.invoke(NativeMethodAccessorImpl.java:39)
[ERROR] at sun.reflect.DelegatingMethodAccessorImpl.invoke(DelegatingMethodAccessorImpl.java:25)
[ERROR] at java.lang.reflect.Method.invoke(Method.java:597)
[ERROR] at com.sun.tools.javadoc.DocletInvoker.invoke(DocletInvoker.java:269)
[ERROR] at com.sun.tools.javadoc.DocletInvoker.start(DocletInvoker.java:143)
[ERROR] at com.sun.tools.javadoc.Start.parseAndExecute(Start.java:340)
[ERROR] at com.sun.tools.javadoc.Start.begin(Start.java:128)
[ERROR] at com.sun.tools.javadoc.Main.execute(Main.java:41)
[ERROR] at com.sun.tools.javadoc.Main.main(Main.java:31)
[ERROR] com.sun.tools.doclets.internal.toolkit.util.DocletAbortException
[ERROR] at com.sun.tools.doclets.formats.html.HtmlDoclet.generateClassFiles(HtmlDoclet.java:159)
[ERROR] at com.sun.tools.doclets.internal.toolkit.AbstractDoclet.generateClassFiles(AbstractDoclet.java:164)
[ERROR] at com.sun.tools.doclets.internal.toolkit.AbstractDoclet.startGeneration(AbstractDoclet.java:106)
[ERROR] at com.sun.tools.doclets.internal.toolkit.AbstractDoclet.start(AbstractDoclet.java:64)
[ERROR] at com.sun.tools.doclets.formats.html.HtmlDoclet.start(HtmlDoclet.java:42)
[ERROR] at com.sun.tools.doclets.standard.Standard.start(Standard.java:23)
[ERROR] at sun.reflect.NativeMethodAccessorImpl.invoke0(Native Method)
[ERROR] at sun.reflect.NativeMethodAccessorImpl.invoke(NativeMethodAccessorImpl.java:39)
[ERROR] at sun.reflect.DelegatingMethodAccessorImpl.invoke(DelegatingMethodAccessorImpl.java:25)
[ERROR] at java.lang.reflect.Method.invoke(Method.java:597)
[ERROR] at com.sun.tools.javadoc.DocletInvoker.invoke(DocletInvoker.java:269)
[ERROR] at com.sun.tools.javadoc.DocletInvoker.start(DocletInvoker.java:143)
[ERROR] at com.sun.tools.javadoc.Start.parseAndExecute(Start.java:340)
[ERROR] at com.sun.tools.javadoc.Start.begin(Start.java:128)
[ERROR] at com.sun.tools.javadoc.Main.execute(Main.java:41)
[ERROR] at com.sun.tools.javadoc.Main.main(Main.java:31)
[ERROR] 
[ERROR] Command line was: f:\hudson\tools\java\latest-1.6-64\jre\..\bin\javadoc.exe @options
@packages
[ERROR] 
[ERROR] Refer to the generated Javadoc files in 'F:\hudson\hudson-slave\workspace\UIMA-DUCC\trunk\uima-ducc-user\target\site\apidocs'
dir.
[ERROR] -> [Help 1]
[ERROR] 
[ERROR] To see the full stack trace of the errors, re-run Maven with the -e switch.
[ERROR] Re-run Maven using the -X switch to enable full debug logging.
[ERROR] 
[ERROR] For more information about the errors and possible solutions, please read the following
articles:
[ERROR] [Help 1] http://cwiki.apache.org/confluence/display/MAVEN/MojoExecutionException
[ERROR] 
[ERROR] After correcting the problems, you can resume the build with the command
[ERROR]   mvn <goals> -rf :uima-ducc-user
[JENKINS] Archiving F:\hudson\hudson-slave\workspace\UIMA-DUCC\trunk\uima-ducc-web\pom.xml
to org.apache.uima/uima-ducc-web/2.0.0-SNAPSHOT/uima-ducc-web-2.0.0-SNAPSHOT.pom
Sending artifact delta relative to UIMA-DUCC » Apache UIMA DUCC: uima-ducc-web #249
Archived 1 artifacts
Archive block size is 32768
Received 0 blocks and 7410 bytes
Compression is 0.0%
Took 0.26 sec
[JENKINS] Archiving F:\hudson\hudson-slave\workspace\UIMA-DUCC\trunk\uima-ducc-db\pom.xml
to org.apache.uima/uima-ducc-db/2.0.0-SNAPSHOT/uima-ducc-db-2.0.0-SNAPSHOT.pom
Sending artifact delta relative to UIMA-DUCC » Apache UIMA DUCC: uima-ducc-db #249
Archived 1 artifacts
Archive block size is 32768
Received 0 blocks and 4010 bytes
Compression is 0.0%
Took 0.12 sec
[JENKINS] Archiving F:\hudson\hudson-slave\workspace\UIMA-DUCC\trunk\uima-ducc-rm\pom.xml
to org.apache.uima/uima-ducc-rm/2.0.0-SNAPSHOT/uima-ducc-rm-2.0.0-SNAPSHOT.pom
Sending artifact delta relative to UIMA-DUCC » Apache UIMA DUCC: uima-ducc-rm #249
Archived 1 artifacts
Archive block size is 32768
Received 0 blocks and 2802 bytes
Compression is 0.0%
Took 0.15 sec
[JENKINS] Archiving F:\hudson\hudson-slave\workspace\UIMA-DUCC\trunk\uima-ducc-sm\pom.xml
to org.apache.uima/uima-ducc-sm/2.0.0-SNAPSHOT/uima-ducc-sm-2.0.0-SNAPSHOT.pom
Sending artifact delta relative to UIMA-DUCC » Apache UIMA DUCC: uima-ducc-sm #249
Archived 1 artifacts
Archive block size is 32768
Received 0 blocks and 3026 bytes
Compression is 0.0%
Took 0.16 sec
[JENKINS] Archiving F:\hudson\hudson-slave\workspace\UIMA-DUCC\trunk\uima-ducc-parent\pom.xml
to org.apache.uima/uima-ducc-parent/2.0.0-SNAPSHOT/uima-ducc-parent-2.0.0-SNAPSHOT.pom
Sending artifact delta relative to UIMA-DUCC » uima-ducc-parent #249
Archived 1 artifacts
Archive block size is 32768
Received 0 blocks and 24242 bytes
Compression is 0.0%
Took 0.13 sec
[JENKINS] Archiving F:\hudson\hudson-slave\workspace\UIMA-DUCC\trunk\uima-ducc-spawn\pom.xml
to org.apache.uima/uima-ducc-spawn/2.0.0-SNAPSHOT/uima-ducc-spawn-2.0.0-SNAPSHOT.pom
Sending artifact delta relative to UIMA-DUCC » uima-ducc-spawn #249
Archived 1 artifacts
Archive block size is 32768
Received 0 blocks and 2259 bytes
Compression is 0.0%
Took 18 ms
[JENKINS] Archiving F:\hudson\hudson-slave\workspace\UIMA-DUCC\trunk\uima-ducc-orchestrator\pom.xml
to org.apache.uima/uima-ducc-orchestrator/2.0.0-SNAPSHOT/uima-ducc-orchestrator-2.0.0-SNAPSHOT.pom
Sending artifact delta relative to UIMA-DUCC » Apache UIMA DUCC: uima-ducc-orchestrator #249
Archived 1 artifacts
Archive block size is 32768
Received 0 blocks and 3086 bytes
Compression is 0.0%
Took 0.14 sec
[JENKINS] Archiving F:\hudson\hudson-slave\workspace\UIMA-DUCC\trunk\uima-ducc-container\pom.xml
to org.apache.uima/uima-ducc-container/2.0.0-SNAPSHOT/uima-ducc-container-2.0.0-SNAPSHOT.pom
Sending artifact delta relative to UIMA-DUCC » Apache UIMA DUCC: uima-ducc-container #249
Archived 1 artifacts
Archive block size is 32768
Received 0 blocks and 9792 bytes
Compression is 0.0%
Took 0.17 sec
[JENKINS] Archiving F:\hudson\hudson-slave\workspace\UIMA-DUCC\trunk\uima-ducc-examples\pom.xml
to org.apache.uima/uima-ducc-examples/2.0.0-SNAPSHOT/uima-ducc-examples-2.0.0-SNAPSHOT.pom
Sending artifact delta relative to UIMA-DUCC » Apache UIMA DUCC: uima-ducc-examples #249
Archived 1 artifacts
Archive block size is 32768
Received 0 blocks and 3693 bytes
Compression is 0.0%
Took 0.18 sec
[JENKINS] Archiving F:\hudson\hudson-slave\workspace\UIMA-DUCC\trunk\uima-ducc-common\pom.xml
to org.apache.uima/uima-ducc-common/2.0.0-SNAPSHOT/uima-ducc-common-2.0.0-SNAPSHOT.pom
Sending artifact delta relative to UIMA-DUCC » Apache UIMA DUCC: uima-ducc-common #249
Archived 1 artifacts
Archive block size is 32768
Received 0 blocks and 4425 bytes
Compression is 0.0%
Took 0.1 sec
[JENKINS] Archiving F:\hudson\hudson-slave\workspace\UIMA-DUCC\trunk\uima-ducc-duccdocs\pom.xml
to org.apache.uima/uima-ducc-duccdocs/2.0.0-SNAPSHOT/uima-ducc-duccdocs-2.0.0-SNAPSHOT.pom
Sending artifact delta relative to UIMA-DUCC » uima-ducc-duccdocs #249
Archived 1 artifacts
Archive block size is 32768
Received 0 blocks and 18042 bytes
Compression is 0.0%
Took 0.1 sec
[JENKINS] Archiving F:\hudson\hudson-slave\workspace\UIMA-DUCC\trunk\uima-ducc-user\pom.xml
to org.apache.uima/uima-ducc-user/2.0.0-SNAPSHOT/uima-ducc-user-2.0.0-SNAPSHOT.pom
[JENKINS] Archiving F:\hudson\hudson-slave\workspace\UIMA-DUCC\trunk\uima-ducc-user\target\uima-ducc-user-2.0.0-SNAPSHOT.jar
to org.apache.uima/uima-ducc-user/2.0.0-SNAPSHOT/uima-ducc-user-2.0.0-SNAPSHOT.jar
Sending artifact delta relative to UIMA-DUCC » Apache UIMA DUCC: uima-ducc-user #249
Archived 2 artifacts
Archive block size is 32768
Received 0 blocks and 103406 bytes
Compression is 0.0%
Took 0.19 sec
[JENKINS] Archiving F:\hudson\hudson-slave\workspace\UIMA-DUCC\trunk\uima-ducc-agent\pom.xml
to org.apache.uima/uima-ducc-agent/2.0.0-SNAPSHOT/uima-ducc-agent-2.0.0-SNAPSHOT.pom
Sending artifact delta relative to UIMA-DUCC » Apache UIMA DUCC: uima-ducc-agent #249
Archived 1 artifacts
Archive block size is 32768
Received 0 blocks and 3707 bytes
Compression is 0.0%
Took 0.17 sec
[JENKINS] Archiving F:\hudson\hudson-slave\workspace\UIMA-DUCC\trunk\uima-ducc-cli\pom.xml
to org.apache.uima/uima-ducc-cli/2.0.0-SNAPSHOT/uima-ducc-cli-2.0.0-SNAPSHOT.pom
Sending artifact delta relative to UIMA-DUCC » Apache UIMA DUCC: uima-ducc-cli #249
Archived 1 artifacts
Archive block size is 32768
Received 0 blocks and 6103 bytes
Compression is 0.0%
Took 0.16 sec
[JENKINS] Archiving F:\hudson\hudson-slave\workspace\UIMA-DUCC\trunk\uima-ducc-jd\pom.xml
to org.apache.uima/uima-ducc-jd/2.0.0-SNAPSHOT/uima-ducc-jd-2.0.0-SNAPSHOT.pom
Sending artifact delta relative to UIMA-DUCC » Apache UIMA DUCC: uima-ducc-jd #249
Archived 1 artifacts
Archive block size is 32768
Received 0 blocks and 3391 bytes
Compression is 0.0%
Took 0.12 sec
[JENKINS] Archiving <https://builds.apache.org/job/UIMA-DUCC/ws/trunk\pom.xml> to org.apache.uima/uima-ducc/2.0.0-SNAPSHOT/uima-ducc-2.0.0-SNAPSHOT.pom
Sending artifact delta relative to UIMA-DUCC » Apache UIMA-DUCC: uima-ducc #249
Archived 1 artifacts
Archive block size is 32768
Received 0 blocks and 16958 bytes
Compression is 0.0%
Took 1.3 sec
[JENKINS] Archiving F:\hudson\hudson-slave\workspace\UIMA-DUCC\trunk\uima-ducc-pm\pom.xml
to org.apache.uima/uima-ducc-pm/2.0.0-SNAPSHOT/uima-ducc-pm-2.0.0-SNAPSHOT.pom
Sending artifact delta relative to UIMA-DUCC » Apache UIMA DUCC: uima-ducc-pm #249
Archived 1 artifacts
Archive block size is 32768
Received 0 blocks and 2830 bytes
Compression is 0.0%
Took 0.17 sec
[JENKINS] Archiving F:\hudson\hudson-slave\workspace\UIMA-DUCC\trunk\uima-ducc-transport\pom.xml
to org.apache.uima/uima-ducc-transport/2.0.0-SNAPSHOT/uima-ducc-transport-2.0.0-SNAPSHOT.pom
Sending artifact delta relative to UIMA-DUCC » Apache UIMA DUCC: uima-ducc-transport #249
Archived 1 artifacts
Archive block size is 32768
Received 0 blocks and 3713 bytes
Compression is 0.0%
Took 0.2 sec
Sending e-mails to: dev@uima.apache.org
channel stopped
[WARNINGS] Skipping publisher since build result is FAILURE

Mime
View raw message