uima-dev mailing list archives

Site index · List index
Message view « Date » · « Thread »
Top « Date » · « Thread »
From Apache Jenkins Server <jenk...@builds.apache.org>
Subject Build failed in Jenkins: UIMA-DUCC #328
Date Thu, 02 Apr 2015 14:09:25 GMT
See <https://builds.apache.org/job/UIMA-DUCC/328/changes>

Changes:

[burn] UIMA-4322 Hide undefined placeholder warning if an always-propagated variable

------------------------------------------
[...truncated 5613 lines...]
main:
[INFO] Executed tasks
[INFO] 
[INFO] --- maven-install-plugin:2.5.1:install (default-install) @ uima-ducc ---
[INFO] Installing <https://builds.apache.org/job/UIMA-DUCC/ws/trunk/pom.xml> to /home/jenkins/jenkins-slave/maven-repositories/0/org/apache/uima/uima-ducc/2.0.0-SNAPSHOT/uima-ducc-2.0.0-SNAPSHOT.pom
[INFO] Installing <https://builds.apache.org/job/UIMA-DUCC/ws/trunk/target/uima-ducc-2.0.0-SNAPSHOT-bin.tar.gz>
to /home/jenkins/jenkins-slave/maven-repositories/0/org/apache/uima/uima-ducc/2.0.0-SNAPSHOT/uima-ducc-2.0.0-SNAPSHOT-bin.tar.gz
[INFO] 
[INFO] --- maven-pmd-plugin:3.4:pmd (default-cli) @ uima-ducc ---
[PMD] No report found for mojo pmd
[INFO] 
[INFO] --- maven-pmd-plugin:3.4:cpd (default-cli) @ uima-ducc ---
[DRY] No report found for mojo cpd
[INFO] 
[INFO] --- findbugs-maven-plugin:3.0.0:findbugs (default-cli) @ uima-ducc ---
[FINDBUGS] No report found for mojo findbugs
[INFO] 
[INFO] --- maven-enforcer-plugin:1.3.1:enforce (enforce-versions) @ uima-ducc ---
[INFO] 
[INFO] --- build-helper-maven-plugin:1.8:parse-version (parse-project-version) @ uima-ducc
---
[INFO] 
[INFO] --- uima-build-helper-maven-plugin:7:parse-date-time (set buildYear and buildMonth)
@ uima-ducc ---
[INFO] 
[INFO] --- maven-remote-resources-plugin:1.5:process (default) @ uima-ducc ---
[INFO] 
[INFO] --- maven-changes-plugin:2.10:jira-report (default-cli) @ uima-ducc ---
[INFO] 
[INFO] --- cobertura-maven-plugin:2.7:instrument (default-cli) @ uima-ducc ---
[INFO] Skipping cobertura mojo for project with packaging type 'pom'
[INFO] 
[INFO] --- cobertura-maven-plugin:2.7:cobertura (default-cli) @ uima-ducc ---
[INFO] 
[INFO] --- maven-enforcer-plugin:1.3.1:enforce (enforce-versions) @ uima-ducc ---
[INFO] 
[INFO] --- build-helper-maven-plugin:1.8:parse-version (parse-project-version) @ uima-ducc
---
[INFO] 
[INFO] --- uima-build-helper-maven-plugin:7:parse-date-time (set buildYear and buildMonth)
@ uima-ducc ---
[WARNING] Failed to getClass for org.apache.maven.plugin.javadoc.JavadocReport
[JENKINS] Archiving  javadoc
[INFO] 
[INFO] --- maven-javadoc-plugin:2.9.1:javadoc (default-cli) @ uima-ducc ---
[JENKINS] Archiving  javadoc
[INFO] ------------------------------------------------------------------------
[INFO] Reactor Summary:
[INFO] 
[INFO] uima-ducc-parent .................................. SUCCESS [26.746s]
[INFO] Apache UIMA DUCC: uima-ducc-user .................. SUCCESS [1:21.274s]
[INFO] Apache UIMA DUCC: uima-ducc-common ................ SUCCESS [1:17.023s]
[INFO] Apache UIMA DUCC: uima-ducc-container ............. SUCCESS [1:31.990s]
[INFO] Apache UIMA DUCC: uima-ducc-transport ............. SUCCESS [1:15.825s]
[INFO] Apache UIMA DUCC: uima-ducc-cli ................... SUCCESS [53.020s]
[INFO] Apache UIMA DUCC: uima-ducc-pm .................... SUCCESS [27.695s]
[INFO] Apache UIMA DUCC: uima-ducc-rm .................... SUCCESS [47.745s]
[INFO] Apache UIMA DUCC: uima-ducc-sm .................... SUCCESS [40.329s]
[INFO] Apache UIMA DUCC: uima-ducc-orchestrator .......... SUCCESS [47.314s]
[INFO] Apache UIMA DUCC: uima-ducc-agent ................. SUCCESS [46.046s]
[INFO] uima-ducc-duccdocs ................................ SUCCESS [11.458s]
[INFO] Apache UIMA DUCC: uima-ducc-web ................... SUCCESS [1:14.064s]
[INFO] Apache UIMA DUCC: uima-ducc-examples .............. SUCCESS [39.391s]
[INFO] Apache UIMA DUCC: uima-ducc-db .................... SUCCESS [25.873s]
[INFO] uima-ducc-spawn ................................... SUCCESS [7.478s]
[INFO] Apache UIMA-DUCC: uima-ducc ....................... SUCCESS [51.986s]
[INFO] ------------------------------------------------------------------------
[INFO] BUILD SUCCESS
[INFO] ------------------------------------------------------------------------
[INFO] Total time: 16:08.637s
[INFO] Finished at: Thu Apr 02 14:05:36 UTC 2015
[INFO] Final Memory: 101M/358M
[INFO] ------------------------------------------------------------------------
Waiting for Jenkins to finish collecting data
[JENKINS] Archiving <https://builds.apache.org/job/UIMA-DUCC/ws/trunk/uima-ducc-web/pom.xml>
to org.apache.uima/uima-ducc-web/2.0.0-SNAPSHOT/uima-ducc-web-2.0.0-SNAPSHOT.pom
[JENKINS] Archiving <https://builds.apache.org/job/UIMA-DUCC/ws/trunk/uima-ducc-web/target/uima-ducc-web-2.0.0-SNAPSHOT.jar>
to org.apache.uima/uima-ducc-web/2.0.0-SNAPSHOT/uima-ducc-web-2.0.0-SNAPSHOT.jar
Sending artifact delta relative to UIMA-DUCC » Apache UIMA DUCC: uima-ducc-web #327
Archived 2 artifacts
Archive block size is 32768
Received 1 blocks and 336469 bytes
Compression is 8.9%
Took 1.1 sec
[JENKINS] Archiving <https://builds.apache.org/job/UIMA-DUCC/ws/trunk/uima-ducc-db/pom.xml>
to org.apache.uima/uima-ducc-db/2.0.0-SNAPSHOT/uima-ducc-db-2.0.0-SNAPSHOT.pom
[JENKINS] Archiving <https://builds.apache.org/job/UIMA-DUCC/ws/trunk/uima-ducc-db/target/uima-ducc-db-2.0.0-SNAPSHOT.jar>
to org.apache.uima/uima-ducc-db/2.0.0-SNAPSHOT/uima-ducc-db-2.0.0-SNAPSHOT.jar
Sending artifact delta relative to UIMA-DUCC » Apache UIMA DUCC: uima-ducc-db #327
Archived 2 artifacts
Archive block size is 32768
Received 0 blocks and 36489 bytes
Compression is 0.0%
Took 0.16 sec
[JENKINS] Archiving <https://builds.apache.org/job/UIMA-DUCC/ws/trunk/uima-ducc-rm/pom.xml>
to org.apache.uima/uima-ducc-rm/2.0.0-SNAPSHOT/uima-ducc-rm-2.0.0-SNAPSHOT.pom
[JENKINS] Archiving <https://builds.apache.org/job/UIMA-DUCC/ws/trunk/uima-ducc-rm/target/uima-ducc-rm-2.0.0-SNAPSHOT.jar>
to org.apache.uima/uima-ducc-rm/2.0.0-SNAPSHOT/uima-ducc-rm-2.0.0-SNAPSHOT.jar
Sending artifact delta relative to UIMA-DUCC » Apache UIMA DUCC: uima-ducc-rm #327
Archived 2 artifacts
Archive block size is 32768
Received 0 blocks and 180761 bytes
Compression is 0.0%
Took 0.38 sec
[JENKINS] Archiving <https://builds.apache.org/job/UIMA-DUCC/ws/trunk/uima-ducc-sm/pom.xml>
to org.apache.uima/uima-ducc-sm/2.0.0-SNAPSHOT/uima-ducc-sm-2.0.0-SNAPSHOT.pom
[JENKINS] Archiving <https://builds.apache.org/job/UIMA-DUCC/ws/trunk/uima-ducc-sm/target/uima-ducc-sm-2.0.0-SNAPSHOT.jar>
to org.apache.uima/uima-ducc-sm/2.0.0-SNAPSHOT/uima-ducc-sm-2.0.0-SNAPSHOT.jar
Sending artifact delta relative to UIMA-DUCC » Apache UIMA DUCC: uima-ducc-sm #327
Archived 2 artifacts
Archive block size is 32768
Received 0 blocks and 128677 bytes
Compression is 0.0%
Took 0.55 sec
[JENKINS] Archiving <https://builds.apache.org/job/UIMA-DUCC/ws/trunk/uima-ducc-parent/pom.xml>
to org.apache.uima/uima-ducc-parent/2.0.0-SNAPSHOT/uima-ducc-parent-2.0.0-SNAPSHOT.pom
Sending artifact delta relative to UIMA-DUCC » uima-ducc-parent #327
Archived 1 artifacts
Archive block size is 32768
Received 0 blocks and 23664 bytes
Compression is 0.0%
Took 0.11 sec
[JENKINS] Archiving <https://builds.apache.org/job/UIMA-DUCC/ws/trunk/uima-ducc-spawn/pom.xml>
to org.apache.uima/uima-ducc-spawn/2.0.0-SNAPSHOT/uima-ducc-spawn-2.0.0-SNAPSHOT.pom
Sending artifact delta relative to UIMA-DUCC » uima-ducc-spawn #327
Archived 1 artifacts
Archive block size is 32768
Received 0 blocks and 2217 bytes
Compression is 0.0%
Took 40 ms
[JENKINS] Archiving <https://builds.apache.org/job/UIMA-DUCC/ws/trunk/uima-ducc-orchestrator/pom.xml>
to org.apache.uima/uima-ducc-orchestrator/2.0.0-SNAPSHOT/uima-ducc-orchestrator-2.0.0-SNAPSHOT.pom
[JENKINS] Archiving <https://builds.apache.org/job/UIMA-DUCC/ws/trunk/uima-ducc-orchestrator/target/uima-ducc-orchestrator-2.0.0-SNAPSHOT.jar>
to org.apache.uima/uima-ducc-orchestrator/2.0.0-SNAPSHOT/uima-ducc-orchestrator-2.0.0-SNAPSHOT.jar
Sending artifact delta relative to UIMA-DUCC » Apache UIMA DUCC: uima-ducc-orchestrator #327
Archived 2 artifacts
Archive block size is 32768
Received 0 blocks and 166549 bytes
Compression is 0.0%
Took 0.3 sec
[JENKINS] Archiving <https://builds.apache.org/job/UIMA-DUCC/ws/trunk/uima-ducc-container/pom.xml>
to org.apache.uima/uima-ducc-container/2.0.0-SNAPSHOT/uima-ducc-container-2.0.0-SNAPSHOT.pom
[JENKINS] Archiving <https://builds.apache.org/job/UIMA-DUCC/ws/trunk/uima-ducc-container/target/uima-ducc-container-2.0.0-SNAPSHOT.jar>
to org.apache.uima/uima-ducc-container/2.0.0-SNAPSHOT/uima-ducc-container-2.0.0-SNAPSHOT.jar
Sending artifact delta relative to UIMA-DUCC » Apache UIMA DUCC: uima-ducc-container #327
Archived 2 artifacts
Archive block size is 32768
Received 0 blocks and 209710 bytes
Compression is 0.0%
Took 0.6 sec
[JENKINS] Archiving <https://builds.apache.org/job/UIMA-DUCC/ws/trunk/uima-ducc-examples/pom.xml>
to org.apache.uima/uima-ducc-examples/2.0.0-SNAPSHOT/uima-ducc-examples-2.0.0-SNAPSHOT.pom
[JENKINS] Archiving <https://builds.apache.org/job/UIMA-DUCC/ws/trunk/uima-ducc-examples/target/uima-ducc-examples-2.0.0-SNAPSHOT.jar>
to org.apache.uima/uima-ducc-examples/2.0.0-SNAPSHOT/uima-ducc-examples-2.0.0-SNAPSHOT.jar
Sending artifact delta relative to UIMA-DUCC » Apache UIMA DUCC: uima-ducc-examples #327
Archived 2 artifacts
Archive block size is 32768
Received 0 blocks and 158046 bytes
Compression is 0.0%
Took 0.22 sec
[JENKINS] Archiving <https://builds.apache.org/job/UIMA-DUCC/ws/trunk/uima-ducc-common/pom.xml>
to org.apache.uima/uima-ducc-common/2.0.0-SNAPSHOT/uima-ducc-common-2.0.0-SNAPSHOT.pom
[JENKINS] Archiving <https://builds.apache.org/job/UIMA-DUCC/ws/trunk/uima-ducc-common/target/uima-ducc-common-2.0.0-SNAPSHOT.jar>
to org.apache.uima/uima-ducc-common/2.0.0-SNAPSHOT/uima-ducc-common-2.0.0-SNAPSHOT.jar
Sending artifact delta relative to UIMA-DUCC » Apache UIMA DUCC: uima-ducc-common #327
Archived 2 artifacts
Archive block size is 32768
Received 0 blocks and 301173 bytes
Compression is 0.0%
Took 0.45 sec
[JENKINS] Archiving <https://builds.apache.org/job/UIMA-DUCC/ws/trunk/uima-ducc-duccdocs/pom.xml>
to org.apache.uima/uima-ducc-duccdocs/2.0.0-SNAPSHOT/uima-ducc-duccdocs-2.0.0-SNAPSHOT.pom
Sending artifact delta relative to UIMA-DUCC » uima-ducc-duccdocs #327
Archived 1 artifacts
Archive block size is 32768
Received 0 blocks and 18042 bytes
Compression is 0.0%
Took 53 ms
[JENKINS] Archiving <https://builds.apache.org/job/UIMA-DUCC/ws/trunk/uima-ducc-user/pom.xml>
to org.apache.uima/uima-ducc-user/2.0.0-SNAPSHOT/uima-ducc-user-2.0.0-SNAPSHOT.pom
[JENKINS] Archiving <https://builds.apache.org/job/UIMA-DUCC/ws/trunk/uima-ducc-user/target/uima-ducc-user-2.0.0-SNAPSHOT.jar>
to org.apache.uima/uima-ducc-user/2.0.0-SNAPSHOT/uima-ducc-user-2.0.0-SNAPSHOT.jar
Sending artifact delta relative to UIMA-DUCC » Apache UIMA DUCC: uima-ducc-user #327
Archived 2 artifacts
Archive block size is 32768
Received 0 blocks and 107363 bytes
Compression is 0.0%
Took 0.86 sec
[JENKINS] Archiving <https://builds.apache.org/job/UIMA-DUCC/ws/trunk/uima-ducc-agent/pom.xml>
to org.apache.uima/uima-ducc-agent/2.0.0-SNAPSHOT/uima-ducc-agent-2.0.0-SNAPSHOT.pom
[JENKINS] Archiving <https://builds.apache.org/job/UIMA-DUCC/ws/trunk/uima-ducc-agent/target/uima-ducc-agent-2.0.0-SNAPSHOT.jar>
to org.apache.uima/uima-ducc-agent/2.0.0-SNAPSHOT/uima-ducc-agent-2.0.0-SNAPSHOT.jar
Sending artifact delta relative to UIMA-DUCC » Apache UIMA DUCC: uima-ducc-agent #327
Archived 2 artifacts
Archive block size is 32768
Received 0 blocks and 193004 bytes
Compression is 0.0%
Took 0.42 sec
[JENKINS] Archiving <https://builds.apache.org/job/UIMA-DUCC/ws/trunk/uima-ducc-cli/pom.xml>
to org.apache.uima/uima-ducc-cli/2.0.0-SNAPSHOT/uima-ducc-cli-2.0.0-SNAPSHOT.pom
[JENKINS] Archiving <https://builds.apache.org/job/UIMA-DUCC/ws/trunk/uima-ducc-cli/target/uima-ducc-cli-2.0.0-SNAPSHOT.jar>
to org.apache.uima/uima-ducc-cli/2.0.0-SNAPSHOT/uima-ducc-cli-2.0.0-SNAPSHOT.jar
Sending artifact delta relative to UIMA-DUCC » Apache UIMA DUCC: uima-ducc-cli #327
Archived 2 artifacts
Archive block size is 32768
Received 0 blocks and 272005 bytes
Compression is 0.0%
Took 0.36 sec
[JENKINS] Archiving <https://builds.apache.org/job/UIMA-DUCC/ws/trunk/pom.xml> to org.apache.uima/uima-ducc/2.0.0-SNAPSHOT/uima-ducc-2.0.0-SNAPSHOT.pom
[JENKINS] Archiving <https://builds.apache.org/job/UIMA-DUCC/ws/trunk/target/uima-ducc-2.0.0-SNAPSHOT-bin.tar.gz>
to org.apache.uima/uima-ducc/2.0.0-SNAPSHOT/uima-ducc-2.0.0-SNAPSHOT-bin.tar.gz
Sending artifact delta relative to UIMA-DUCC » Apache UIMA-DUCC: uima-ducc #326
Archived 2 artifacts
Archive block size is 32768
Received 0 blocks and 65746671 bytes
Compression is 0.0%
Took 2 min 26 sec
[JENKINS] Archiving <https://builds.apache.org/job/UIMA-DUCC/ws/trunk/uima-ducc-pm/pom.xml>
to org.apache.uima/uima-ducc-pm/2.0.0-SNAPSHOT/uima-ducc-pm-2.0.0-SNAPSHOT.pom
[JENKINS] Archiving <https://builds.apache.org/job/UIMA-DUCC/ws/trunk/uima-ducc-pm/target/uima-ducc-pm-2.0.0-SNAPSHOT.jar>
to org.apache.uima/uima-ducc-pm/2.0.0-SNAPSHOT/uima-ducc-pm-2.0.0-SNAPSHOT.jar
Sending artifact delta relative to UIMA-DUCC » Apache UIMA DUCC: uima-ducc-pm #327
Archived 2 artifacts
Archive block size is 32768
Received 0 blocks and 31950 bytes
Compression is 0.0%
Took 0.28 sec
[JENKINS] Archiving <https://builds.apache.org/job/UIMA-DUCC/ws/trunk/uima-ducc-transport/pom.xml>
to org.apache.uima/uima-ducc-transport/2.0.0-SNAPSHOT/uima-ducc-transport-2.0.0-SNAPSHOT.pom
[JENKINS] Archiving <https://builds.apache.org/job/UIMA-DUCC/ws/trunk/uima-ducc-transport/target/uima-ducc-transport-2.0.0-SNAPSHOT.jar>
to org.apache.uima/uima-ducc-transport/2.0.0-SNAPSHOT/uima-ducc-transport-2.0.0-SNAPSHOT.jar
Sending artifact delta relative to UIMA-DUCC » Apache UIMA DUCC: uima-ducc-transport #327
Archived 2 artifacts
Archive block size is 32768
Received 0 blocks and 353807 bytes
Compression is 0.0%
Took 0.56 sec
channel stopped
[WARNINGS] Parsing warnings in console log with parser Java Compiler (javac)
[WARNINGS] Parsing warnings in console log with parser JavaDoc Tool
[WARNINGS] Parsing warnings in console log with parser Maven
using settings config with name simple-deploy-settings-no-mirror
Maven RedeployPublisher use remote ubuntu-5 maven settings from : /tmp/settings7427608207759773484.xml
[INFO] Deployment in https://repository.apache.org/content/repositories/snapshots (id=apache.snapshots.https,uniqueVersion=true)
Deploying the main artifact uima-ducc-2.0.0-SNAPSHOT.pom
Downloading: https://repository.apache.org/content/repositories/snapshots/org/apache/uima/uima-ducc/2.0.0-SNAPSHOT/maven-metadata.xml
ERROR: Failed to retrieve remote metadata org.apache.uima:uima-ducc:2.0.0-SNAPSHOT/maven-metadata.xml:
Could not transfer metadata org.apache.uima:uima-ducc:2.0.0-SNAPSHOT/maven-metadata.xml from/to
apache.snapshots.https (https://repository.apache.org/content/repositories/snapshots): Failed
to transfer file: https://repository.apache.org/content/repositories/snapshots/org/apache/uima/uima-ducc/2.0.0-SNAPSHOT/maven-metadata.xml.
Return code is: 502 , ReasonPhrase:Proxy Error.
org.apache.maven.artifact.deployer.ArtifactDeploymentException: Failed to retrieve remote
metadata org.apache.uima:uima-ducc:2.0.0-SNAPSHOT/maven-metadata.xml: Could not transfer metadata
org.apache.uima:uima-ducc:2.0.0-SNAPSHOT/maven-metadata.xml from/to apache.snapshots.https
(https://repository.apache.org/content/repositories/snapshots): Failed to transfer file: https://repository.apache.org/content/repositories/snapshots/org/apache/uima/uima-ducc/2.0.0-SNAPSHOT/maven-metadata.xml.
Return code is: 502 , ReasonPhrase:Proxy Error.
	at org.apache.maven.artifact.deployer.DefaultArtifactDeployer.deploy(DefaultArtifactDeployer.java:143)
	at hudson.maven.reporters.MavenArtifactRecord.deploy(MavenArtifactRecord.java:193)
	at hudson.maven.RedeployPublisher.perform(RedeployPublisher.java:176)
	at hudson.tasks.BuildStepMonitor$1.perform(BuildStepMonitor.java:20)
	at hudson.model.AbstractBuild$AbstractBuildExecution.perform(AbstractBuild.java:756)
	at hudson.model.AbstractBuild$AbstractBuildExecution.performAllBuildSteps(AbstractBuild.java:720)
	at hudson.maven.MavenModuleSetBuild$MavenModuleSetBuildExecution.post2(MavenModuleSetBuild.java:1037)
	at hudson.model.AbstractBuild$AbstractBuildExecution.post(AbstractBuild.java:669)
	at hudson.model.Run.execute(Run.java:1731)
	at hudson.maven.MavenModuleSetBuild.run(MavenModuleSetBuild.java:529)
	at hudson.model.ResourceController.execute(ResourceController.java:88)
	at hudson.model.Executor.run(Executor.java:232)
Caused by: org.eclipse.aether.deployment.DeploymentException: Failed to retrieve remote metadata
org.apache.uima:uima-ducc:2.0.0-SNAPSHOT/maven-metadata.xml: Could not transfer metadata org.apache.uima:uima-ducc:2.0.0-SNAPSHOT/maven-metadata.xml
from/to apache.snapshots.https (https://repository.apache.org/content/repositories/snapshots):
Failed to transfer file: https://repository.apache.org/content/repositories/snapshots/org/apache/uima/uima-ducc/2.0.0-SNAPSHOT/maven-metadata.xml.
Return code is: 502 , ReasonPhrase:Proxy Error.
	at org.eclipse.aether.internal.impl.DefaultDeployer.upload(DefaultDeployer.java:470)
	at org.eclipse.aether.internal.impl.DefaultDeployer.deploy(DefaultDeployer.java:314)
	at org.eclipse.aether.internal.impl.DefaultDeployer.deploy(DefaultDeployer.java:269)
	at org.eclipse.aether.internal.impl.DefaultRepositorySystem.deploy(DefaultRepositorySystem.java:413)
	at org.apache.maven.artifact.deployer.DefaultArtifactDeployer.deploy(DefaultArtifactDeployer.java:139)
	... 11 more
Caused by: org.eclipse.aether.transfer.MetadataTransferException: Could not transfer metadata
org.apache.uima:uima-ducc:2.0.0-SNAPSHOT/maven-metadata.xml from/to apache.snapshots.https
(https://repository.apache.org/content/repositories/snapshots): Failed to transfer file: https://repository.apache.org/content/repositories/snapshots/org/apache/uima/uima-ducc/2.0.0-SNAPSHOT/maven-metadata.xml.
Return code is: 502 , ReasonPhrase:Proxy Error.
	at org.eclipse.aether.connector.wagon.WagonRepositoryConnector$5.wrap(WagonRepositoryConnector.java:995)
	at org.eclipse.aether.connector.wagon.WagonRepositoryConnector$5.wrap(WagonRepositoryConnector.java:983)
	at org.eclipse.aether.connector.wagon.WagonRepositoryConnector$GetTask.run(WagonRepositoryConnector.java:725)
	at org.eclipse.aether.util.concurrency.RunnableErrorForwarder$1.run(RunnableErrorForwarder.java:67)
	at java.util.concurrent.ThreadPoolExecutor.runWorker(ThreadPoolExecutor.java:1145)
	at java.util.concurrent.ThreadPoolExecutor$Worker.run(ThreadPoolExecutor.java:615)
	at java.lang.Thread.run(Thread.java:745)
Caused by: org.apache.maven.wagon.TransferFailedException: Failed to transfer file: https://repository.apache.org/content/repositories/snapshots/org/apache/uima/uima-ducc/2.0.0-SNAPSHOT/maven-metadata.xml.
Return code is: 502 , ReasonPhrase:Proxy Error.
	at org.apache.maven.wagon.shared.http4.AbstractHttpClientWagon.fillInputData(AbstractHttpClientWagon.java:945)
	at org.apache.maven.wagon.StreamWagon.getInputStream(StreamWagon.java:116)
	at org.apache.maven.wagon.StreamWagon.getIfNewer(StreamWagon.java:88)
	at org.apache.maven.wagon.StreamWagon.get(StreamWagon.java:61)
	at org.eclipse.aether.connector.wagon.WagonRepositoryConnector$GetTask.run(WagonRepositoryConnector.java:660)
	... 4 more
[INFO] Deployment failed after 1 min 1 sec
Build step 'Deploy artifacts to Maven repository' changed build result to FAILURE

Mime
View raw message