uima-dev mailing list archives

Site index · List index
Message view « Date » · « Thread »
Top « Date » · « Thread »
From Apache Jenkins Server <jenk...@builds.apache.org>
Subject Build failed in Jenkins: UIMA-DUCC #391
Date Mon, 04 May 2015 19:00:58 GMT
See <https://builds.apache.org/job/UIMA-DUCC/391/changes>

Changes:

[degenaro] UIMA-4358 delete obsolete top level folder: umia-ducc-jd

------------------------------------------
[...truncated 5013 lines...]
[INFO] 
[INFO] --- maven-install-plugin:2.5.1:install (default-install) @ uima-ducc-duccdocs ---
[INFO] Installing F:\hudson\hudson-slave\workspace\UIMA-DUCC\trunk\uima-ducc-duccdocs\pom.xml
to f:\hudson\hudson-slave\maven-repositories\1\org\apache\uima\uima-ducc-duccdocs\2.0.0-SNAPSHOT\uima-ducc-duccdocs-2.0.0-SNAPSHOT.pom
[INFO] 
[INFO] --- maven-pmd-plugin:3.4:pmd (default-cli) @ uima-ducc-duccdocs ---
[PMD] No report found for mojo pmd
[INFO] 
[INFO] --- maven-pmd-plugin:3.4:cpd (default-cli) @ uima-ducc-duccdocs ---
[DRY] No report found for mojo cpd
[INFO] 
[INFO] --- findbugs-maven-plugin:3.0.0:findbugs (default-cli) @ uima-ducc-duccdocs ---
[FINDBUGS] No report found for mojo findbugs
[INFO] 
[INFO] --- maven-enforcer-plugin:1.3.1:enforce (enforce-versions) @ uima-ducc-duccdocs ---
[INFO] 
[INFO] --- build-helper-maven-plugin:1.8:parse-version (parse-project-version) @ uima-ducc-duccdocs
---
[INFO] 
[INFO] --- uima-build-helper-maven-plugin:7:parse-date-time (set buildYear and buildMonth)
@ uima-ducc-duccdocs ---
[INFO] 
[INFO] --- maven-remote-resources-plugin:1.5:process (default) @ uima-ducc-duccdocs ---
[INFO] 
[INFO] --- cobertura-maven-plugin:2.7:instrument (default-cli) @ uima-ducc-duccdocs ---
[INFO] Skipping cobertura mojo for project with packaging type 'pom'
[INFO] 
[INFO] --- cobertura-maven-plugin:2.7:cobertura (default-cli) @ uima-ducc-duccdocs ---
[INFO] 
[INFO] --- maven-enforcer-plugin:1.3.1:enforce (enforce-versions) @ uima-ducc-duccdocs ---
[INFO] 
[INFO] --- build-helper-maven-plugin:1.8:parse-version (parse-project-version) @ uima-ducc-duccdocs
---
[INFO] 
[INFO] --- uima-build-helper-maven-plugin:7:parse-date-time (set buildYear and buildMonth)
@ uima-ducc-duccdocs ---
[WARNING] Failed to getClass for org.apache.maven.plugin.javadoc.JavadocReport
[INFO] 
[INFO] --- maven-javadoc-plugin:2.9.1:javadoc (default-cli) @ uima-ducc-duccdocs ---
[INFO]                                                                         
[INFO] ------------------------------------------------------------------------
[INFO] Building Apache UIMA DUCC: uima-ducc-web 2.0.0-SNAPSHOT
[INFO] ------------------------------------------------------------------------
[INFO] 
[INFO] --- maven-clean-plugin:2.5:clean (default-clean) @ uima-ducc-web ---
[TASKS] Scanning folder 'F:\hudson\hudson-slave\workspace\UIMA-DUCC\trunk\uima-ducc-web' for
files matching the pattern '**/*.java' - excludes: 
[TASKS] Found 79 files to scan for tasks
Found 2 open tasks.
[TASKS] Computing warning deltas based on reference build #390
[INFO] 
[INFO] --- maven-enforcer-plugin:1.3.1:enforce (enforce-versions) @ uima-ducc-web ---
[INFO] 
[INFO] --- build-helper-maven-plugin:1.8:parse-version (parse-project-version) @ uima-ducc-web
---
[INFO] 
[INFO] --- uima-build-helper-maven-plugin:7:parse-date-time (set buildYear and buildMonth)
@ uima-ducc-web ---
[INFO] 
[INFO] --- maven-remote-resources-plugin:1.5:process (default) @ uima-ducc-web ---
[INFO] 
[INFO] --- maven-resources-plugin:2.6:resources (default-resources) @ uima-ducc-web ---
[INFO] Using 'UTF-8' encoding to copy filtered resources.
[INFO] Copying 0 resource
[INFO] Copying 3 resources
[INFO] 
[INFO] --- maven-compiler-plugin:3.1:compile (default-compile) @ uima-ducc-web ---
[INFO] Changes detected - recompiling the module!
[INFO] Compiling 79 source files to F:\hudson\hudson-slave\workspace\UIMA-DUCC\trunk\uima-ducc-web\target\classes
[INFO] -------------------------------------------------------------
[ERROR] COMPILATION ERROR : 
[INFO] -------------------------------------------------------------
[ERROR] /F:/hudson/hudson-slave/workspace/UIMA-DUCC/trunk/uima-ducc-web/src/main/java/org/apache/uima/ducc/ws/server/DuccWebMonitor.java:[68,17]
cannot find symbol
  symbol:   class DuccWebMonitorReservation
  location: class org.apache.uima.ducc.ws.server.DuccWebMonitor
[ERROR] /F:/hudson/hudson-slave/workspace/UIMA-DUCC/trunk/uima-ducc-web/src/main/java/org/apache/uima/ducc/ws/server/DuccWebMonitor.java:[112,49]
cannot find symbol
  symbol:   class DuccWebMonitorReservation
  location: class org.apache.uima.ducc.ws.server.DuccWebMonitor
[INFO] 2 errors 
[INFO] -------------------------------------------------------------
[INFO] ------------------------------------------------------------------------
[INFO] Reactor Summary:
[INFO] 
[INFO] uima-ducc-parent .................................. SUCCESS [20.248s]
[INFO] Apache UIMA DUCC: uima-ducc-user .................. SUCCESS [1:11.090s]
[INFO] Apache UIMA DUCC: uima-ducc-common ................ SUCCESS [1:19.240s]
[INFO] Apache UIMA DUCC: uima-ducc-container ............. SUCCESS [1:09.549s]
[INFO] Apache UIMA DUCC: uima-ducc-transport ............. SUCCESS [1:18.423s]
[INFO] Apache UIMA DUCC: uima-ducc-cli ................... SUCCESS [59.586s]
[INFO] Apache UIMA DUCC: uima-ducc-pm .................... SUCCESS [24.724s]
[INFO] Apache UIMA DUCC: uima-ducc-rm .................... SUCCESS [51.755s]
[INFO] Apache UIMA DUCC: uima-ducc-sm .................... SUCCESS [44.999s]
[INFO] Apache UIMA DUCC: uima-ducc-orchestrator .......... SUCCESS [54.941s]
[INFO] Apache UIMA DUCC: uima-ducc-agent ................. SUCCESS [55.957s]
[INFO] uima-ducc-duccdocs ................................ SUCCESS [4.218s]
[INFO] Apache UIMA DUCC: uima-ducc-web ................... FAILURE [3.378s]
[INFO] Apache UIMA DUCC: uima-ducc-examples .............. SKIPPED
[INFO] Apache UIMA DUCC: uima-ducc-db .................... SKIPPED
[INFO] uima-ducc-spawn ................................... SKIPPED
[INFO] Apache UIMA-DUCC: uima-ducc ....................... SKIPPED
[INFO] ------------------------------------------------------------------------
[INFO] BUILD FAILURE
[INFO] ------------------------------------------------------------------------
[INFO] Total time: 12:17.464s
[INFO] Finished at: Mon May 04 19:53:56 BST 2015
[INFO] Final Memory: 100M/408M
[INFO] ------------------------------------------------------------------------
Waiting for Jenkins to finish collecting data
[ERROR] Failed to execute goal org.apache.maven.plugins:maven-compiler-plugin:3.1:compile
(default-compile) on project uima-ducc-web: Compilation failure: Compilation failure:
[ERROR] /F:/hudson/hudson-slave/workspace/UIMA-DUCC/trunk/uima-ducc-web/src/main/java/org/apache/uima/ducc/ws/server/DuccWebMonitor.java:[68,17]
cannot find symbol
[ERROR] symbol:   class DuccWebMonitorReservation
[ERROR] location: class org.apache.uima.ducc.ws.server.DuccWebMonitor
[ERROR] /F:/hudson/hudson-slave/workspace/UIMA-DUCC/trunk/uima-ducc-web/src/main/java/org/apache/uima/ducc/ws/server/DuccWebMonitor.java:[112,49]
cannot find symbol
[ERROR] symbol:   class DuccWebMonitorReservation
[ERROR] location: class org.apache.uima.ducc.ws.server.DuccWebMonitor
[ERROR] -> [Help 1]
[ERROR] 
[ERROR] To see the full stack trace of the errors, re-run Maven with the -e switch.
[ERROR] Re-run Maven using the -X switch to enable full debug logging.
[ERROR] 
[ERROR] For more information about the errors and possible solutions, please read the following
articles:
[ERROR] [Help 1] http://cwiki.apache.org/confluence/display/MAVEN/MojoFailureException
[ERROR] 
[ERROR] After correcting the problems, you can resume the build with the command
[ERROR]   mvn <goals> -rf :uima-ducc-web
[JENKINS] Archiving F:\hudson\hudson-slave\workspace\UIMA-DUCC\trunk\uima-ducc-web\pom.xml
to org.apache.uima/uima-ducc-web/2.0.0-SNAPSHOT/uima-ducc-web-2.0.0-SNAPSHOT.pom
Sending artifact delta relative to UIMA-DUCC » Apache UIMA DUCC: uima-ducc-web #390
Archived 1 artifacts
Archive block size is 32768
Received 0 blocks and 7410 bytes
Compression is 0.0%
Took 0.16 sec
[JENKINS] Archiving F:\hudson\hudson-slave\workspace\UIMA-DUCC\trunk\uima-ducc-db\pom.xml
to org.apache.uima/uima-ducc-db/2.0.0-SNAPSHOT/uima-ducc-db-2.0.0-SNAPSHOT.pom
Sending artifact delta relative to UIMA-DUCC » Apache UIMA DUCC: uima-ducc-db #390
Archived 1 artifacts
Archive block size is 32768
Received 0 blocks and 4010 bytes
Compression is 0.0%
Took 85 ms
[JENKINS] Archiving F:\hudson\hudson-slave\workspace\UIMA-DUCC\trunk\uima-ducc-rm\pom.xml
to org.apache.uima/uima-ducc-rm/2.0.0-SNAPSHOT/uima-ducc-rm-2.0.0-SNAPSHOT.pom
[JENKINS] Archiving F:\hudson\hudson-slave\workspace\UIMA-DUCC\trunk\uima-ducc-rm\target\uima-ducc-rm-2.0.0-SNAPSHOT.jar
to org.apache.uima/uima-ducc-rm/2.0.0-SNAPSHOT/uima-ducc-rm-2.0.0-SNAPSHOT.jar
Sending artifact delta relative to UIMA-DUCC » Apache UIMA DUCC: uima-ducc-rm #390
Archived 2 artifacts
Archive block size is 32768
Received 0 blocks and 183323 bytes
Compression is 0.0%
Took 0.26 sec
[JENKINS] Archiving F:\hudson\hudson-slave\workspace\UIMA-DUCC\trunk\uima-ducc-sm\pom.xml
to org.apache.uima/uima-ducc-sm/2.0.0-SNAPSHOT/uima-ducc-sm-2.0.0-SNAPSHOT.pom
[JENKINS] Archiving F:\hudson\hudson-slave\workspace\UIMA-DUCC\trunk\uima-ducc-sm\target\uima-ducc-sm-2.0.0-SNAPSHOT.jar
to org.apache.uima/uima-ducc-sm/2.0.0-SNAPSHOT/uima-ducc-sm-2.0.0-SNAPSHOT.jar
Sending artifact delta relative to UIMA-DUCC » Apache UIMA DUCC: uima-ducc-sm #390
Archived 2 artifacts
Archive block size is 32768
Received 0 blocks and 129980 bytes
Compression is 0.0%
Took 77 ms
[JENKINS] Archiving F:\hudson\hudson-slave\workspace\UIMA-DUCC\trunk\uima-ducc-parent\pom.xml
to org.apache.uima/uima-ducc-parent/2.0.0-SNAPSHOT/uima-ducc-parent-2.0.0-SNAPSHOT.pom
Sending artifact delta relative to UIMA-DUCC » uima-ducc-parent #390
Archived 1 artifacts
Archive block size is 32768
Received 0 blocks and 24438 bytes
Compression is 0.0%
Took 74 ms
[JENKINS] Archiving F:\hudson\hudson-slave\workspace\UIMA-DUCC\trunk\uima-ducc-spawn\pom.xml
to org.apache.uima/uima-ducc-spawn/2.0.0-SNAPSHOT/uima-ducc-spawn-2.0.0-SNAPSHOT.pom
Sending artifact delta relative to UIMA-DUCC » uima-ducc-spawn #390
Archived 1 artifacts
Archive block size is 32768
Received 0 blocks and 2259 bytes
Compression is 0.0%
Took 82 ms
[JENKINS] Archiving F:\hudson\hudson-slave\workspace\UIMA-DUCC\trunk\uima-ducc-orchestrator\pom.xml
to org.apache.uima/uima-ducc-orchestrator/2.0.0-SNAPSHOT/uima-ducc-orchestrator-2.0.0-SNAPSHOT.pom
[JENKINS] Archiving F:\hudson\hudson-slave\workspace\UIMA-DUCC\trunk\uima-ducc-orchestrator\target\uima-ducc-orchestrator-2.0.0-SNAPSHOT.jar
to org.apache.uima/uima-ducc-orchestrator/2.0.0-SNAPSHOT/uima-ducc-orchestrator-2.0.0-SNAPSHOT.jar
Sending artifact delta relative to UIMA-DUCC » Apache UIMA DUCC: uima-ducc-orchestrator #390
Archived 2 artifacts
Archive block size is 32768
Received 0 blocks and 164421 bytes
Compression is 0.0%
Took 0.2 sec
[JENKINS] Archiving F:\hudson\hudson-slave\workspace\UIMA-DUCC\trunk\uima-ducc-container\pom.xml
to org.apache.uima/uima-ducc-container/2.0.0-SNAPSHOT/uima-ducc-container-2.0.0-SNAPSHOT.pom
[JENKINS] Archiving F:\hudson\hudson-slave\workspace\UIMA-DUCC\trunk\uima-ducc-container\target\uima-ducc-container-2.0.0-SNAPSHOT.jar
to org.apache.uima/uima-ducc-container/2.0.0-SNAPSHOT/uima-ducc-container-2.0.0-SNAPSHOT.jar
Sending artifact delta relative to UIMA-DUCC » Apache UIMA DUCC: uima-ducc-container #390
Archived 2 artifacts
Archive block size is 32768
Received 0 blocks and 213659 bytes
Compression is 0.0%
Took 0.62 sec
[JENKINS] Archiving F:\hudson\hudson-slave\workspace\UIMA-DUCC\trunk\uima-ducc-examples\pom.xml
to org.apache.uima/uima-ducc-examples/2.0.0-SNAPSHOT/uima-ducc-examples-2.0.0-SNAPSHOT.pom
Sending artifact delta relative to UIMA-DUCC » Apache UIMA DUCC: uima-ducc-examples #390
Archived 1 artifacts
Archive block size is 32768
Received 0 blocks and 3693 bytes
Compression is 0.0%
Took 0.53 sec
[JENKINS] Archiving F:\hudson\hudson-slave\workspace\UIMA-DUCC\trunk\uima-ducc-common\pom.xml
to org.apache.uima/uima-ducc-common/2.0.0-SNAPSHOT/uima-ducc-common-2.0.0-SNAPSHOT.pom
[JENKINS] Archiving F:\hudson\hudson-slave\workspace\UIMA-DUCC\trunk\uima-ducc-common\target\uima-ducc-common-2.0.0-SNAPSHOT.jar
to org.apache.uima/uima-ducc-common/2.0.0-SNAPSHOT/uima-ducc-common-2.0.0-SNAPSHOT.jar
Sending artifact delta relative to UIMA-DUCC » Apache UIMA DUCC: uima-ducc-common #390
Archived 2 artifacts
Archive block size is 32768
Received 0 blocks and 303956 bytes
Compression is 0.0%
Took 0.21 sec
[JENKINS] Archiving F:\hudson\hudson-slave\workspace\UIMA-DUCC\trunk\uima-ducc-duccdocs\pom.xml
to org.apache.uima/uima-ducc-duccdocs/2.0.0-SNAPSHOT/uima-ducc-duccdocs-2.0.0-SNAPSHOT.pom
Sending artifact delta relative to UIMA-DUCC » uima-ducc-duccdocs #390
Archived 1 artifacts
Archive block size is 32768
Received 0 blocks and 18042 bytes
Compression is 0.0%
Took 0.1 sec
[JENKINS] Archiving F:\hudson\hudson-slave\workspace\UIMA-DUCC\trunk\uima-ducc-user\pom.xml
to org.apache.uima/uima-ducc-user/2.0.0-SNAPSHOT/uima-ducc-user-2.0.0-SNAPSHOT.pom
[JENKINS] Archiving F:\hudson\hudson-slave\workspace\UIMA-DUCC\trunk\uima-ducc-user\target\uima-ducc-user-2.0.0-SNAPSHOT.jar
to org.apache.uima/uima-ducc-user/2.0.0-SNAPSHOT/uima-ducc-user-2.0.0-SNAPSHOT.jar
Sending artifact delta relative to UIMA-DUCC » Apache UIMA DUCC: uima-ducc-user #390
Archived 2 artifacts
Archive block size is 32768
Received 0 blocks and 107369 bytes
Compression is 0.0%
Took 0.11 sec
[JENKINS] Archiving F:\hudson\hudson-slave\workspace\UIMA-DUCC\trunk\uima-ducc-agent\pom.xml
to org.apache.uima/uima-ducc-agent/2.0.0-SNAPSHOT/uima-ducc-agent-2.0.0-SNAPSHOT.pom
[JENKINS] Archiving F:\hudson\hudson-slave\workspace\UIMA-DUCC\trunk\uima-ducc-agent\target\uima-ducc-agent-2.0.0-SNAPSHOT.jar
to org.apache.uima/uima-ducc-agent/2.0.0-SNAPSHOT/uima-ducc-agent-2.0.0-SNAPSHOT.jar
Sending artifact delta relative to UIMA-DUCC » Apache UIMA DUCC: uima-ducc-agent #390
Archived 2 artifacts
Archive block size is 32768
Received 0 blocks and 193103 bytes
Compression is 0.0%
Took 0.14 sec
[JENKINS] Archiving F:\hudson\hudson-slave\workspace\UIMA-DUCC\trunk\uima-ducc-cli\pom.xml
to org.apache.uima/uima-ducc-cli/2.0.0-SNAPSHOT/uima-ducc-cli-2.0.0-SNAPSHOT.pom
[JENKINS] Archiving F:\hudson\hudson-slave\workspace\UIMA-DUCC\trunk\uima-ducc-cli\target\uima-ducc-cli-2.0.0-SNAPSHOT.jar
to org.apache.uima/uima-ducc-cli/2.0.0-SNAPSHOT/uima-ducc-cli-2.0.0-SNAPSHOT.jar
Sending artifact delta relative to UIMA-DUCC » Apache UIMA DUCC: uima-ducc-cli #390
Archived 2 artifacts
Archive block size is 32768
Received 0 blocks and 274209 bytes
Compression is 0.0%
Took 0.48 sec
[JENKINS] Archiving <https://builds.apache.org/job/UIMA-DUCC/ws/trunk\pom.xml> to org.apache.uima/uima-ducc/2.0.0-SNAPSHOT/uima-ducc-2.0.0-SNAPSHOT.pom
Sending artifact delta relative to UIMA-DUCC » Apache UIMA-DUCC: uima-ducc #389
Archived 1 artifacts
Archive block size is 32768
Received 0 blocks and 18344 bytes
Compression is 0.0%
Took 6.2 sec
[JENKINS] Archiving F:\hudson\hudson-slave\workspace\UIMA-DUCC\trunk\uima-ducc-pm\pom.xml
to org.apache.uima/uima-ducc-pm/2.0.0-SNAPSHOT/uima-ducc-pm-2.0.0-SNAPSHOT.pom
[JENKINS] Archiving F:\hudson\hudson-slave\workspace\UIMA-DUCC\trunk\uima-ducc-pm\target\uima-ducc-pm-2.0.0-SNAPSHOT.jar
to org.apache.uima/uima-ducc-pm/2.0.0-SNAPSHOT/uima-ducc-pm-2.0.0-SNAPSHOT.jar
Sending artifact delta relative to UIMA-DUCC » Apache UIMA DUCC: uima-ducc-pm #390
Archived 2 artifacts
Archive block size is 32768
Received 0 blocks and 32028 bytes
Compression is 0.0%
Took 95 ms
[JENKINS] Archiving F:\hudson\hudson-slave\workspace\UIMA-DUCC\trunk\uima-ducc-transport\pom.xml
to org.apache.uima/uima-ducc-transport/2.0.0-SNAPSHOT/uima-ducc-transport-2.0.0-SNAPSHOT.pom
[JENKINS] Archiving F:\hudson\hudson-slave\workspace\UIMA-DUCC\trunk\uima-ducc-transport\target\uima-ducc-transport-2.0.0-SNAPSHOT.jar
to org.apache.uima/uima-ducc-transport/2.0.0-SNAPSHOT/uima-ducc-transport-2.0.0-SNAPSHOT.jar
Sending artifact delta relative to UIMA-DUCC » Apache UIMA DUCC: uima-ducc-transport #390
Archived 2 artifacts
Archive block size is 32768
Received 0 blocks and 344149 bytes
Compression is 0.0%
Took 0.2 sec
Sending e-mails to: dev@uima.apache.org
channel stopped
[WARNINGS] Skipping publisher since build result is FAILURE

Mime
View raw message