uima-dev mailing list archives

Site index · List index
Message view « Date » · « Thread »
Top « Date » · « Thread »
From Apache Jenkins Server <jenk...@builds.apache.org>
Subject Build failed in Jenkins: UIMA-DUCC » Apache UIMA DUCC: uima-ducc-web #391
Date Mon, 04 May 2015 19:00:55 GMT
See <https://builds.apache.org/job/UIMA-DUCC/org.apache.uima$uima-ducc-web/391/changes>

Changes:

[degenaro] UIMA-4358 delete obsolete top level folder: umia-ducc-jd

------------------------------------------
[INFO]                                                                         
[INFO] ------------------------------------------------------------------------
[INFO] Building Apache UIMA DUCC: uima-ducc-web 2.0.0-SNAPSHOT
[INFO] ------------------------------------------------------------------------
[INFO] 
[INFO] --- maven-clean-plugin:2.5:clean (default-clean) @ uima-ducc-web ---
[TASKS] Scanning folder 'F:\hudson\hudson-slave\workspace\UIMA-DUCC\trunk\uima-ducc-web' for
files matching the pattern '**/*.java' - excludes: 
[TASKS] Found 79 files to scan for tasks
Found 2 open tasks.
[TASKS] Computing warning deltas based on reference build #390
[INFO] 
[INFO] --- maven-enforcer-plugin:1.3.1:enforce (enforce-versions) @ uima-ducc-web ---
[INFO] 
[INFO] --- build-helper-maven-plugin:1.8:parse-version (parse-project-version) @ uima-ducc-web
---
[INFO] 
[INFO] --- uima-build-helper-maven-plugin:7:parse-date-time (set buildYear and buildMonth)
@ uima-ducc-web ---
[INFO] 
[INFO] --- maven-remote-resources-plugin:1.5:process (default) @ uima-ducc-web ---
[INFO] 
[INFO] --- maven-resources-plugin:2.6:resources (default-resources) @ uima-ducc-web ---
[INFO] Using 'UTF-8' encoding to copy filtered resources.
[INFO] Copying 0 resource
[INFO] Copying 3 resources
[INFO] 
[INFO] --- maven-compiler-plugin:3.1:compile (default-compile) @ uima-ducc-web ---
[INFO] Changes detected - recompiling the module!
[INFO] Compiling 79 source files to F:\hudson\hudson-slave\workspace\UIMA-DUCC\trunk\uima-ducc-web\target\classes
[INFO] -------------------------------------------------------------
[ERROR] COMPILATION ERROR : 
[INFO] -------------------------------------------------------------
[ERROR] /F:/hudson/hudson-slave/workspace/UIMA-DUCC/trunk/uima-ducc-web/src/main/java/org/apache/uima/ducc/ws/server/DuccWebMonitor.java:[68,17]
cannot find symbol
  symbol:   class DuccWebMonitorReservation
  location: class org.apache.uima.ducc.ws.server.DuccWebMonitor
[ERROR] /F:/hudson/hudson-slave/workspace/UIMA-DUCC/trunk/uima-ducc-web/src/main/java/org/apache/uima/ducc/ws/server/DuccWebMonitor.java:[112,49]
cannot find symbol
  symbol:   class DuccWebMonitorReservation
  location: class org.apache.uima.ducc.ws.server.DuccWebMonitor
[INFO] 2 errors 
[INFO] -------------------------------------------------------------
[INFO] ------------------------------------------------------------------------
[INFO] Reactor Summary:
[INFO] 
[INFO] uima-ducc-parent .................................. SUCCESS [20.248s]
[INFO] Apache UIMA DUCC: uima-ducc-user .................. SUCCESS [1:11.090s]
[INFO] Apache UIMA DUCC: uima-ducc-common ................ SUCCESS [1:19.240s]
[INFO] Apache UIMA DUCC: uima-ducc-container ............. SUCCESS [1:09.549s]
[INFO] Apache UIMA DUCC: uima-ducc-transport ............. SUCCESS [1:18.423s]
[INFO] Apache UIMA DUCC: uima-ducc-cli ................... SUCCESS [59.586s]
[INFO] Apache UIMA DUCC: uima-ducc-pm .................... SUCCESS [24.724s]
[INFO] Apache UIMA DUCC: uima-ducc-rm .................... SUCCESS [51.755s]
[INFO] Apache UIMA DUCC: uima-ducc-sm .................... SUCCESS [44.999s]
[INFO] Apache UIMA DUCC: uima-ducc-orchestrator .......... SUCCESS [54.941s]
[INFO] Apache UIMA DUCC: uima-ducc-agent ................. SUCCESS [55.957s]
[INFO] uima-ducc-duccdocs ................................ SUCCESS [4.218s]
[INFO] Apache UIMA DUCC: uima-ducc-web ................... FAILURE [3.378s]
[INFO] Apache UIMA DUCC: uima-ducc-examples .............. SKIPPED
[INFO] Apache UIMA DUCC: uima-ducc-db .................... SKIPPED
[INFO] uima-ducc-spawn ................................... SKIPPED
[INFO] Apache UIMA-DUCC: uima-ducc ....................... SKIPPED
[INFO] ------------------------------------------------------------------------
[INFO] BUILD FAILURE
[INFO] ------------------------------------------------------------------------
[INFO] Total time: 12:17.464s
[INFO] Finished at: Mon May 04 19:53:56 BST 2015
[INFO] Final Memory: 100M/408M
[INFO] ------------------------------------------------------------------------
Waiting for Jenkins to finish collecting data
[ERROR] Failed to execute goal org.apache.maven.plugins:maven-compiler-plugin:3.1:compile
(default-compile) on project uima-ducc-web: Compilation failure: Compilation failure:
[ERROR] /F:/hudson/hudson-slave/workspace/UIMA-DUCC/trunk/uima-ducc-web/src/main/java/org/apache/uima/ducc/ws/server/DuccWebMonitor.java:[68,17]
cannot find symbol
[ERROR] symbol:   class DuccWebMonitorReservation
[ERROR] location: class org.apache.uima.ducc.ws.server.DuccWebMonitor
[ERROR] /F:/hudson/hudson-slave/workspace/UIMA-DUCC/trunk/uima-ducc-web/src/main/java/org/apache/uima/ducc/ws/server/DuccWebMonitor.java:[112,49]
cannot find symbol
[ERROR] symbol:   class DuccWebMonitorReservation
[ERROR] location: class org.apache.uima.ducc.ws.server.DuccWebMonitor
[ERROR] -> [Help 1]
[ERROR] 
[ERROR] To see the full stack trace of the errors, re-run Maven with the -e switch.
[ERROR] Re-run Maven using the -X switch to enable full debug logging.
[ERROR] 
[ERROR] For more information about the errors and possible solutions, please read the following
articles:
[ERROR] [Help 1] http://cwiki.apache.org/confluence/display/MAVEN/MojoFailureException
[ERROR] 
[ERROR] After correcting the problems, you can resume the build with the command
[ERROR]   mvn <goals> -rf :uima-ducc-web

Mime
View raw message