uima-dev mailing list archives

Site index · List index
Message view « Date » · « Thread »
Top « Date » · « Thread »
From Apache Jenkins Server <jenk...@builds.apache.org>
Subject Build failed in Jenkins: UIMA-DUCC #651
Date Thu, 07 Jan 2016 20:46:06 GMT
See <https://builds.apache.org/job/UIMA-DUCC/651/changes>

Changes:

[degenaro] UIMA-4717 ducc-mon fails to display log files if there is a '+' in the filename

[degenaro] UIMA-4717 ducc-mon fails to display log files if there is a '+' in the filename

------------------------------------------
[...truncated 2853 lines...]
[INFO] ------------------------------------------------------------------------
Downloading: http://repo1.maven.org/eclipse/org/apache/camel/camel-context/2.15.3/camel-context-2.15.3.pom
Downloading: http://repo1.maven.org/maven2/org/apache/camel/camel-context/2.15.3/camel-context-2.15.3.pom
Downloaded: http://repo1.maven.org/maven2/org/apache/camel/camel-context/2.15.3/camel-context-2.15.3.pom
(3 KB at 35.0 KB/sec)
Downloading: http://repo1.maven.org/eclipse/org/apache/camel/camel-http4/2.15.3/camel-http4-2.15.3.pom
Downloading: http://repo1.maven.org/maven2/org/apache/camel/camel-http4/2.15.3/camel-http4-2.15.3.pom
Downloaded: http://repo1.maven.org/maven2/org/apache/camel/camel-http4/2.15.3/camel-http4-2.15.3.pom
(4 KB at 48.5 KB/sec)
Downloading: http://repo1.maven.org/eclipse/org/apache/camel/camel-jetty-common/2.15.3/camel-jetty-common-2.15.3.pom
Downloading: http://repo1.maven.org/maven2/org/apache/camel/camel-jetty-common/2.15.3/camel-jetty-common-2.15.3.pom
Downloaded: http://repo1.maven.org/maven2/org/apache/camel/camel-jetty-common/2.15.3/camel-jetty-common-2.15.3.pom
(6 KB at 71.6 KB/sec)
Downloading: http://repo1.maven.org/eclipse/org/apache/camel/camel-http/2.15.3/camel-http-2.15.3.pom
Downloading: http://repo1.maven.org/maven2/org/apache/camel/camel-http/2.15.3/camel-http-2.15.3.pom
Downloaded: http://repo1.maven.org/maven2/org/apache/camel/camel-http/2.15.3/camel-http-2.15.3.pom
(3 KB at 34.6 KB/sec)
Downloading: http://repo1.maven.org/eclipse/org/apache/camel/camel-mina/2.15.3/camel-mina-2.15.3.pom
Downloading: http://repo1.maven.org/maven2/org/apache/camel/camel-mina/2.15.3/camel-mina-2.15.3.pom
Downloaded: http://repo1.maven.org/maven2/org/apache/camel/camel-mina/2.15.3/camel-mina-2.15.3.pom
(5 KB at 27.9 KB/sec)
Downloading: http://repo1.maven.org/eclipse/org/apache/camel/camel-xmlbeans/2.15.3/camel-xmlbeans-2.15.3.pom
Downloading: http://repo1.maven.org/maven2/org/apache/camel/camel-xmlbeans/2.15.3/camel-xmlbeans-2.15.3.pom
Downloaded: http://repo1.maven.org/maven2/org/apache/camel/camel-xmlbeans/2.15.3/camel-xmlbeans-2.15.3.pom
(5 KB at 32.2 KB/sec)
Downloading: http://repo1.maven.org/eclipse/org/apache/camel/camel-servlet/2.15.3/camel-servlet-2.15.3.pom
Downloading: http://repo1.maven.org/maven2/org/apache/camel/camel-servlet/2.15.3/camel-servlet-2.15.3.pom
Downloaded: http://repo1.maven.org/maven2/org/apache/camel/camel-servlet/2.15.3/camel-servlet-2.15.3.pom
(5 KB at 55.2 KB/sec)
Downloading: http://repo1.maven.org/eclipse/org/apache/camel/camel-test-spring/2.15.3/camel-test-spring-2.15.3.pom
Downloading: http://repo1.maven.org/maven2/org/apache/camel/camel-test-spring/2.15.3/camel-test-spring-2.15.3.pom
Downloaded: http://repo1.maven.org/maven2/org/apache/camel/camel-test-spring/2.15.3/camel-test-spring-2.15.3.pom
(4 KB at 14.2 KB/sec)
Downloading: http://repo1.maven.org/eclipse/org/apache/camel/camel-stream/2.15.3/camel-stream-2.15.3.pom
Downloading: http://repo1.maven.org/maven2/org/apache/camel/camel-stream/2.15.3/camel-stream-2.15.3.pom
Downloaded: http://repo1.maven.org/maven2/org/apache/camel/camel-stream/2.15.3/camel-stream-2.15.3.pom
(3 KB at 36.3 KB/sec)
Downloading: http://repo1.maven.org/eclipse/org/apache/camel/camel-context/2.15.3/camel-context-2.15.3.jar
Downloading: http://repo1.maven.org/eclipse/org/apache/camel/camel-http4/2.15.3/camel-http4-2.15.3.jar
Downloading: http://repo1.maven.org/eclipse/org/apache/camel/camel-jetty-common/2.15.3/camel-jetty-common-2.15.3.jar
Downloading: http://repo1.maven.org/eclipse/org/apache/camel/camel-http/2.15.3/camel-http-2.15.3.jar
Downloading: http://repo1.maven.org/eclipse/org/apache/camel/camel-mina/2.15.3/camel-mina-2.15.3.jar
Downloading: http://repo1.maven.org/eclipse/org/apache/camel/camel-xmlbeans/2.15.3/camel-xmlbeans-2.15.3.jar
Downloading: http://repo1.maven.org/eclipse/org/apache/camel/camel-servlet/2.15.3/camel-servlet-2.15.3.jar
Downloading: http://repo1.maven.org/eclipse/org/apache/camel/camel-test-spring/2.15.3/camel-test-spring-2.15.3.jar
Downloading: http://repo1.maven.org/eclipse/org/apache/camel/camel-stream/2.15.3/camel-stream-2.15.3.jar
Downloading: http://repo1.maven.org/maven2/org/apache/camel/camel-context/2.15.3/camel-context-2.15.3.jar
Downloading: http://repo1.maven.org/maven2/org/apache/camel/camel-http4/2.15.3/camel-http4-2.15.3.jar
Downloading: http://repo1.maven.org/maven2/org/apache/camel/camel-jetty-common/2.15.3/camel-jetty-common-2.15.3.jar
Downloading: http://repo1.maven.org/maven2/org/apache/camel/camel-http/2.15.3/camel-http-2.15.3.jar
Downloading: http://repo1.maven.org/maven2/org/apache/camel/camel-mina/2.15.3/camel-mina-2.15.3.jar
Downloaded: http://repo1.maven.org/maven2/org/apache/camel/camel-jetty-common/2.15.3/camel-jetty-common-2.15.3.jar
(53 KB at 433.6 KB/sec)
Downloading: http://repo1.maven.org/maven2/org/apache/camel/camel-xmlbeans/2.15.3/camel-xmlbeans-2.15.3.jar
Downloaded: http://repo1.maven.org/maven2/org/apache/camel/camel-http4/2.15.3/camel-http4-2.15.3.jar
(78 KB at 623.9 KB/sec)
Downloading: http://repo1.maven.org/maven2/org/apache/camel/camel-servlet/2.15.3/camel-servlet-2.15.3.jar
Downloaded: http://repo1.maven.org/maven2/org/apache/camel/camel-http/2.15.3/camel-http-2.15.3.jar
(80 KB at 636.3 KB/sec)
Downloading: http://repo1.maven.org/maven2/org/apache/camel/camel-test-spring/2.15.3/camel-test-spring-2.15.3.jar
Downloaded: http://repo1.maven.org/maven2/org/apache/camel/camel-context/2.15.3/camel-context-2.15.3.jar
(22 KB at 125.9 KB/sec)
Downloading: http://repo1.maven.org/maven2/org/apache/camel/camel-stream/2.15.3/camel-stream-2.15.3.jar
Downloaded: http://repo1.maven.org/maven2/org/apache/camel/camel-servlet/2.15.3/camel-servlet-2.15.3.jar
(33 KB at 590.0 KB/sec)
Downloaded: http://repo1.maven.org/maven2/org/apache/camel/camel-test-spring/2.15.3/camel-test-spring-2.15.3.jar
(49 KB at 668.6 KB/sec)
Downloaded: http://repo1.maven.org/maven2/org/apache/camel/camel-stream/2.15.3/camel-stream-2.15.3.jar
(30 KB at 403.0 KB/sec)
Downloaded: http://repo1.maven.org/maven2/org/apache/camel/camel-mina/2.15.3/camel-mina-2.15.3.jar
(50 KB at 190.3 KB/sec)
Downloaded: http://repo1.maven.org/maven2/org/apache/camel/camel-xmlbeans/2.15.3/camel-xmlbeans-2.15.3.jar
(20 KB at 97.8 KB/sec)
[INFO] 
[INFO] --- maven-clean-plugin:2.5:clean (default-clean) @ uima-ducc-parent ---
[TASKS] Scanning folder '<https://builds.apache.org/job/UIMA-DUCC/ws/trunk/uima-ducc-parent'>
for files matching the pattern '**/*.java' - excludes: 
[TASKS] Found 0 files to scan for tasks
Found 0 open tasks.
[TASKS] Computing warning deltas based on reference build #650
log4j:WARN No appenders could be found for logger (org.apache.commons.beanutils.converters.BooleanConverter).
log4j:WARN Please initialize the log4j system properly.
[INFO] 
[INFO] --- maven-enforcer-plugin:1.3.1:enforce (enforce-versions) @ uima-ducc-parent ---
[INFO] 
[INFO] --- build-helper-maven-plugin:1.8:parse-version (parse-project-version) @ uima-ducc-parent
---
[INFO] 
[INFO] --- uima-build-helper-maven-plugin:7:parse-date-time (set buildYear and buildMonth)
@ uima-ducc-parent ---
[INFO] 
[INFO] --- maven-remote-resources-plugin:1.5:process (default) @ uima-ducc-parent ---
[INFO] 
[INFO] --- maven-antrun-plugin:1.7:run (dup-meta-jar-cleanup) @ uima-ducc-parent ---
[INFO] Executing tasks

main:
[INFO] Executed tasks
[INFO] 
[INFO] --- maven-site-plugin:3.3:attach-descriptor (attach-descriptor) @ uima-ducc-parent
---
[INFO] 
[INFO] --- maven-install-plugin:2.5.1:install (default-install) @ uima-ducc-parent ---
[INFO] Installing <https://builds.apache.org/job/UIMA-DUCC/ws/trunk/uima-ducc-parent/pom.xml>
to /home/jenkins/jenkins-slave/maven-repositories/1/org/apache/uima/uima-ducc-parent/2.1.0-SNAPSHOT/uima-ducc-parent-2.1.0-SNAPSHOT.pom
[INFO] 
[INFO] --- maven-pmd-plugin:3.6:pmd (default-cli) @ uima-ducc-parent ---
[PMD] No report found for mojo pmd
[INFO] 
[INFO] --- maven-pmd-plugin:3.6:cpd (default-cli) @ uima-ducc-parent ---
[DRY] No report found for mojo cpd
[INFO] 
[INFO] --- findbugs-maven-plugin:3.0.2:findbugs (default-cli) @ uima-ducc-parent ---
[FINDBUGS] No report found for mojo findbugs
[INFO] 
[INFO] --- maven-enforcer-plugin:1.3.1:enforce (enforce-versions) @ uima-ducc-parent ---
[INFO] 
[INFO] --- build-helper-maven-plugin:1.8:parse-version (parse-project-version) @ uima-ducc-parent
---
[INFO] 
[INFO] --- uima-build-helper-maven-plugin:7:parse-date-time (set buildYear and buildMonth)
@ uima-ducc-parent ---
[INFO] 
[INFO] --- maven-remote-resources-plugin:1.5:process (default) @ uima-ducc-parent ---
[INFO] 
[INFO] --- cobertura-maven-plugin:2.7:instrument (default-cli) @ uima-ducc-parent ---
[INFO] Skipping cobertura mojo for project with packaging type 'pom'
[INFO] 
[INFO] --- cobertura-maven-plugin:2.7:cobertura (default-cli) @ uima-ducc-parent ---
[INFO] 
[INFO] --- maven-enforcer-plugin:1.3.1:enforce (enforce-versions) @ uima-ducc-parent ---
[INFO] 
[INFO] --- build-helper-maven-plugin:1.8:parse-version (parse-project-version) @ uima-ducc-parent
---
[INFO] 
[INFO] --- uima-build-helper-maven-plugin:7:parse-date-time (set buildYear and buildMonth)
@ uima-ducc-parent ---
[WARNING] Failed to getClass for org.apache.maven.plugin.javadoc.JavadocReport
[INFO] 
[INFO] --- maven-javadoc-plugin:2.9.1:javadoc (default-cli) @ uima-ducc-parent ---
[INFO]                                                                         
[INFO] ------------------------------------------------------------------------
[INFO] Building Apache UIMA DUCC: uima-ducc-user 2.1.0-SNAPSHOT
[INFO] ------------------------------------------------------------------------
Downloading: http://repository.apache.org/snapshots/org/apache/uima/uimaj-as-activemq/2.8.1-SNAPSHOT/maven-metadata.xml
Downloaded: http://repository.apache.org/snapshots/org/apache/uima/uimaj-as-activemq/2.8.1-SNAPSHOT/maven-metadata.xml
(2 KB at 26.0 KB/sec)
Downloading: http://repository.apache.org/snapshots/org/apache/uima/uimaj-as-activemq/2.8.1-SNAPSHOT/uimaj-as-activemq-2.8.1-20160107.200558-2.pom
Downloaded: http://repository.apache.org/snapshots/org/apache/uima/uimaj-as-activemq/2.8.1-SNAPSHOT/uimaj-as-activemq-2.8.1-20160107.200558-2.pom
(10 KB at 137.3 KB/sec)
Downloading: http://repository.apache.org/snapshots/org/apache/uima/uima-as-parent/2.8.1-SNAPSHOT/maven-metadata.xml
Downloaded: http://repository.apache.org/snapshots/org/apache/uima/uima-as-parent/2.8.1-SNAPSHOT/maven-metadata.xml
(783 B at 10.3 KB/sec)
Downloading: http://repository.apache.org/snapshots/org/apache/uima/uima-as-parent/2.8.1-SNAPSHOT/uima-as-parent-2.8.1-20160107.200240-2.pom
Downloaded: http://repository.apache.org/snapshots/org/apache/uima/uima-as-parent/2.8.1-SNAPSHOT/uima-as-parent-2.8.1-20160107.200240-2.pom
(17 KB at 227.6 KB/sec)
Downloading: http://repository.apache.org/snapshots/org/apache/uima/uimaj-core/2.8.1-SNAPSHOT/maven-metadata.xml
Downloading: http://repository.apache.org/snapshots/org/apache/uima/uimaj-core/2.8.1-SNAPSHOT/uimaj-core-2.8.1-SNAPSHOT.pom
[WARNING] The POM for org.apache.uima:uimaj-core:jar:2.8.1-SNAPSHOT is missing, no dependency
information available
Downloading: http://repo1.maven.org/eclipse/org/apache/activemq/activemq-console/5.12.1/activemq-console-5.12.1.pom
Downloading: http://repo1.maven.org/maven2/org/apache/activemq/activemq-console/5.12.1/activemq-console-5.12.1.pom
Downloaded: http://repo1.maven.org/maven2/org/apache/activemq/activemq-console/5.12.1/activemq-console-5.12.1.pom
(9 KB at 111.0 KB/sec)
Downloading: http://repo1.maven.org/eclipse/org/apache/activemq/activemq-http/5.12.1/activemq-http-5.12.1.pom
Downloading: http://repo1.maven.org/maven2/org/apache/activemq/activemq-http/5.12.1/activemq-http-5.12.1.pom
Downloaded: http://repo1.maven.org/maven2/org/apache/activemq/activemq-http/5.12.1/activemq-http-5.12.1.pom
(8 KB at 106.0 KB/sec)
Downloading: http://repo1.maven.org/eclipse/org/apache/activemq/activemq-leveldb-store/5.12.1/activemq-leveldb-store-5.12.1.pom
Downloading: http://repo1.maven.org/maven2/org/apache/activemq/activemq-leveldb-store/5.12.1/activemq-leveldb-store-5.12.1.pom
Downloaded: http://repo1.maven.org/maven2/org/apache/activemq/activemq-leveldb-store/5.12.1/activemq-leveldb-store-5.12.1.pom
(20 KB at 199.8 KB/sec)
Downloading: http://repo1.maven.org/eclipse/org/apache/activemq/activemq-log4j-appender/5.12.1/activemq-log4j-appender-5.12.1.pom
Downloading: http://repo1.maven.org/maven2/org/apache/activemq/activemq-log4j-appender/5.12.1/activemq-log4j-appender-5.12.1.pom
Downloaded: http://repo1.maven.org/maven2/org/apache/activemq/activemq-log4j-appender/5.12.1/activemq-log4j-appender-5.12.1.pom
(4 KB at 48.3 KB/sec)
Downloading: http://repo1.maven.org/eclipse/org/apache/activemq/activemq-partition/5.12.1/activemq-partition-5.12.1.pom
Downloading: http://repo1.maven.org/maven2/org/apache/activemq/activemq-partition/5.12.1/activemq-partition-5.12.1.pom
Downloaded: http://repo1.maven.org/maven2/org/apache/activemq/activemq-partition/5.12.1/activemq-partition-5.12.1.pom
(5 KB at 55.2 KB/sec)
Downloading: http://repo1.maven.org/eclipse/org/apache/activemq/activemq-runtime-config/5.12.1/activemq-runtime-config-5.12.1.pom
Downloading: http://repo1.maven.org/maven2/org/apache/activemq/activemq-runtime-config/5.12.1/activemq-runtime-config-5.12.1.pom
Downloaded: http://repo1.maven.org/maven2/org/apache/activemq/activemq-runtime-config/5.12.1/activemq-runtime-config-5.12.1.pom
(7 KB at 92.9 KB/sec)
Downloading: http://repo1.maven.org/eclipse/org/apache/activemq/activemq-shiro/5.12.1/activemq-shiro-5.12.1.pom
Downloading: http://repo1.maven.org/maven2/org/apache/activemq/activemq-shiro/5.12.1/activemq-shiro-5.12.1.pom
Downloaded: http://repo1.maven.org/maven2/org/apache/activemq/activemq-shiro/5.12.1/activemq-shiro-5.12.1.pom
(7 KB at 93.1 KB/sec)
Downloading: http://repository.apache.org/snapshots/org/apache/uima/uimaj-as-core/2.8.1-SNAPSHOT/maven-metadata.xml
Downloaded: http://repository.apache.org/snapshots/org/apache/uima/uimaj-as-core/2.8.1-SNAPSHOT/maven-metadata.xml
(2 KB at 28.7 KB/sec)
Downloading: http://repository.apache.org/snapshots/org/apache/uima/uimaj-as-core/2.8.1-SNAPSHOT/uimaj-as-core-2.8.1-20160107.200357-2.pom
Downloaded: http://repository.apache.org/snapshots/org/apache/uima/uimaj-as-core/2.8.1-SNAPSHOT/uimaj-as-core-2.8.1-20160107.200357-2.pom
(6 KB at 90.9 KB/sec)
Downloading: http://repository.apache.org/snapshots/org/apache/uima/uimaj-as-jms/2.8.1-SNAPSHOT/maven-metadata.xml
Downloaded: http://repository.apache.org/snapshots/org/apache/uima/uimaj-as-jms/2.8.1-SNAPSHOT/maven-metadata.xml
(2 KB at 31.9 KB/sec)
Downloading: http://repository.apache.org/snapshots/org/apache/uima/uimaj-as-jms/2.8.1-SNAPSHOT/uimaj-as-jms-2.8.1-20160107.200443-2.pom
Downloaded: http://repository.apache.org/snapshots/org/apache/uima/uimaj-as-jms/2.8.1-SNAPSHOT/uimaj-as-jms-2.8.1-20160107.200443-2.pom
(4 KB at 64.1 KB/sec)
Downloading: http://repo1.maven.org/eclipse/org/apache/camel/camel-xstream/2.15.3/camel-xstream-2.15.3.pom
Downloading: http://repo1.maven.org/maven2/org/apache/camel/camel-xstream/2.15.3/camel-xstream-2.15.3.pom
Downloaded: http://repo1.maven.org/maven2/org/apache/camel/camel-xstream/2.15.3/camel-xstream-2.15.3.pom
(4 KB at 44.8 KB/sec)
Downloading: http://repository.apache.org/snapshots/org/apache/uima/uimaj-as-activemq/2.8.1-SNAPSHOT/uimaj-as-activemq-2.8.1-20160107.200558-2.jar
Downloading: http://repository.apache.org/snapshots/org/apache/uima/uimaj-core/2.8.1-SNAPSHOT/uimaj-core-2.8.1-SNAPSHOT.jar
Downloading: http://repository.apache.org/snapshots/org/apache/uima/uimaj-as-core/2.8.1-SNAPSHOT/uimaj-as-core-2.8.1-20160107.200357-2.jar
Downloading: http://repository.apache.org/snapshots/org/apache/uima/uimaj-as-jms/2.8.1-SNAPSHOT/uimaj-as-jms-2.8.1-20160107.200443-2.jar
Downloaded: http://repository.apache.org/snapshots/org/apache/uima/uimaj-as-jms/2.8.1-SNAPSHOT/uimaj-as-jms-2.8.1-20160107.200443-2.jar
(81 KB at 911.3 KB/sec)
Downloaded: http://repository.apache.org/snapshots/org/apache/uima/uimaj-as-activemq/2.8.1-SNAPSHOT/uimaj-as-activemq-2.8.1-20160107.200558-2.jar
(165 KB at 1551.7 KB/sec)
Downloaded: http://repository.apache.org/snapshots/org/apache/uima/uimaj-as-core/2.8.1-SNAPSHOT/uimaj-as-core-2.8.1-20160107.200357-2.jar
(559 KB at 4299.7 KB/sec)
Downloading: http://repo1.maven.org/eclipse/org/apache/activemq/activemq-console/5.12.1/activemq-console-5.12.1.jar
Downloading: http://repo1.maven.org/eclipse/org/apache/activemq/activemq-http/5.12.1/activemq-http-5.12.1.jar
Downloading: http://repo1.maven.org/eclipse/org/apache/activemq/activemq-partition/5.12.1/activemq-partition-5.12.1.jar
Downloading: http://repo1.maven.org/eclipse/org/apache/activemq/activemq-log4j-appender/5.12.1/activemq-log4j-appender-5.12.1.jar
Downloading: http://repo1.maven.org/eclipse/org/apache/activemq/activemq-leveldb-store/5.12.1/activemq-leveldb-store-5.12.1.jar
Downloading: http://repo1.maven.org/eclipse/org/apache/activemq/activemq-runtime-config/5.12.1/activemq-runtime-config-5.12.1.jar
Downloading: http://repo1.maven.org/eclipse/org/apache/activemq/activemq-shiro/5.12.1/activemq-shiro-5.12.1.jar
Downloading: http://repo1.maven.org/eclipse/org/apache/camel/camel-xstream/2.15.3/camel-xstream-2.15.3.jar
Downloading: http://repo1.maven.org/maven2/org/apache/activemq/activemq-console/5.12.1/activemq-console-5.12.1.jar
Downloading: http://repo1.maven.org/maven2/org/apache/activemq/activemq-http/5.12.1/activemq-http-5.12.1.jar
Downloading: http://repo1.maven.org/maven2/org/apache/activemq/activemq-leveldb-store/5.12.1/activemq-leveldb-store-5.12.1.jar
Downloading: http://repo1.maven.org/maven2/org/apache/activemq/activemq-log4j-appender/5.12.1/activemq-log4j-appender-5.12.1.jar
Downloading: http://repo1.maven.org/maven2/org/apache/activemq/activemq-partition/5.12.1/activemq-partition-5.12.1.jar
Downloaded: http://repo1.maven.org/maven2/org/apache/activemq/activemq-log4j-appender/5.12.1/activemq-log4j-appender-5.12.1.jar
(14 KB at 143.5 KB/sec)
Downloading: http://repo1.maven.org/maven2/org/apache/activemq/activemq-runtime-config/5.12.1/activemq-runtime-config-5.12.1.jar
Downloaded: http://repo1.maven.org/maven2/org/apache/activemq/activemq-partition/5.12.1/activemq-partition-5.12.1.jar
(25 KB at 229.1 KB/sec)
Downloading: http://repo1.maven.org/maven2/org/apache/activemq/activemq-shiro/5.12.1/activemq-shiro-5.12.1.jar
Downloaded: http://repo1.maven.org/maven2/org/apache/activemq/activemq-http/5.12.1/activemq-http-5.12.1.jar
(93 KB at 651.0 KB/sec)
Downloading: http://repo1.maven.org/maven2/org/apache/camel/camel-xstream/2.15.3/camel-xstream-2.15.3.jar
Downloaded: http://repo1.maven.org/maven2/org/apache/activemq/activemq-console/5.12.1/activemq-console-5.12.1.jar
(192 KB at 1144.2 KB/sec)
Downloaded: http://repo1.maven.org/maven2/org/apache/activemq/activemq-shiro/5.12.1/activemq-shiro-5.12.1.jar
(44 KB at 585.5 KB/sec)
Downloaded: http://repo1.maven.org/maven2/org/apache/camel/camel-xstream/2.15.3/camel-xstream-2.15.3.jar
(26 KB at 508.2 KB/sec)
Downloaded: http://repo1.maven.org/maven2/org/apache/activemq/activemq-leveldb-store/5.12.1/activemq-leveldb-store-5.12.1.jar
(950 KB at 4218.3 KB/sec)
Downloaded: http://repo1.maven.org/maven2/org/apache/activemq/activemq-runtime-config/5.12.1/activemq-runtime-config-5.12.1.jar
(1593 KB at 7111.1 KB/sec)
[INFO] ------------------------------------------------------------------------
[INFO] Reactor Summary:
[INFO] 
[INFO] uima-ducc-parent .................................. SUCCESS [23.226s]
[INFO] Apache UIMA DUCC: uima-ducc-user .................. FAILURE [3.996s]
[INFO] Apache UIMA DUCC: uima-ducc-common ................ SKIPPED
[INFO] Apache UIMA DUCC: uima-ducc-container ............. SKIPPED
[INFO] Apache UIMA DUCC: uima-ducc-transport ............. SKIPPED
[INFO] Apache UIMA DUCC: uima-ducc-cli ................... SKIPPED
[INFO] Apache UIMA DUCC: uima-ducc-pm .................... SKIPPED
[INFO] Apache UIMA DUCC: uima-ducc-rm .................... SKIPPED
[INFO] Apache UIMA DUCC: uima-ducc-sm .................... SKIPPED
[INFO] Apache UIMA DUCC: uima-ducc-database .............. SKIPPED
[INFO] Apache UIMA DUCC: uima-ducc-orchestrator .......... SKIPPED
[INFO] Apache UIMA DUCC: uima-ducc-agent ................. SKIPPED
[INFO] uima-ducc-duccdocs ................................ SKIPPED
[INFO] Apache UIMA DUCC: uima-ducc-web ................... SKIPPED
[INFO] Apache UIMA DUCC: uima-ducc-examples .............. SKIPPED
[INFO] uima-ducc-spawn ................................... SKIPPED
[INFO] Apache UIMA-DUCC: uima-ducc ....................... SKIPPED
[INFO] ------------------------------------------------------------------------
[INFO] BUILD FAILURE
[INFO] ------------------------------------------------------------------------
[INFO] Total time: 30.879s
[INFO] Finished at: Thu Jan 07 20:46:05 UTC 2016
[INFO] Final Memory: 50M/722M
[INFO] ------------------------------------------------------------------------
Waiting for Jenkins to finish collecting data[ERROR] Failed to execute goal on project uima-ducc-user:
Could not resolve dependencies for project org.apache.uima:uima-ducc-user:jar:2.1.0-SNAPSHOT:
Could not find artifact org.apache.uima:uimaj-core:jar:2.8.1-SNAPSHOT in apache.snapshots
(http://repository.apache.org/snapshots) -> [Help 1]
[ERROR] 
[ERROR] To see the full stack trace of the errors, re-run Maven with the -e switch.
[ERROR] Re-run Maven using the -X switch to enable full debug logging.
[ERROR] 
[ERROR] For more information about the errors and possible solutions, please read the following
articles:
[ERROR] [Help 1] http://cwiki.apache.org/confluence/display/MAVEN/DependencyResolutionException
[ERROR] 
[ERROR] After correcting the problems, you can resume the build with the command
[ERROR]   mvn <goals> -rf :uima-ducc-user

[JENKINS] Archiving <https://builds.apache.org/job/UIMA-DUCC/ws/trunk/uima-ducc-web/pom.xml>
to org.apache.uima/uima-ducc-web/2.1.0-SNAPSHOT/uima-ducc-web-2.1.0-SNAPSHOT.pom
[JENKINS] Archiving <https://builds.apache.org/job/UIMA-DUCC/ws/trunk/uima-ducc-rm/pom.xml>
to org.apache.uima/uima-ducc-rm/2.1.0-SNAPSHOT/uima-ducc-rm-2.1.0-SNAPSHOT.pom
[JENKINS] Archiving <https://builds.apache.org/job/UIMA-DUCC/ws/trunk/uima-ducc-sm/pom.xml>
to org.apache.uima/uima-ducc-sm/2.1.0-SNAPSHOT/uima-ducc-sm-2.1.0-SNAPSHOT.pom
[JENKINS] Archiving <https://builds.apache.org/job/UIMA-DUCC/ws/trunk/uima-ducc-parent/pom.xml>
to org.apache.uima/uima-ducc-parent/2.1.0-SNAPSHOT/uima-ducc-parent-2.1.0-SNAPSHOT.pom
[JENKINS] Archiving <https://builds.apache.org/job/UIMA-DUCC/ws/trunk/uima-ducc-spawn/pom.xml>
to org.apache.uima/uima-ducc-spawn/2.1.0-SNAPSHOT/uima-ducc-spawn-2.1.0-SNAPSHOT.pom
[JENKINS] Archiving <https://builds.apache.org/job/UIMA-DUCC/ws/trunk/uima-ducc-orchestrator/pom.xml>
to org.apache.uima/uima-ducc-orchestrator/2.1.0-SNAPSHOT/uima-ducc-orchestrator-2.1.0-SNAPSHOT.pom
[JENKINS] Archiving <https://builds.apache.org/job/UIMA-DUCC/ws/trunk/uima-ducc-container/pom.xml>
to org.apache.uima/uima-ducc-container/2.1.0-SNAPSHOT/uima-ducc-container-2.1.0-SNAPSHOT.pom
[JENKINS] Archiving <https://builds.apache.org/job/UIMA-DUCC/ws/trunk/uima-ducc-examples/pom.xml>
to org.apache.uima/uima-ducc-examples/2.1.0-SNAPSHOT/uima-ducc-examples-2.1.0-SNAPSHOT.pom
[JENKINS] Archiving <https://builds.apache.org/job/UIMA-DUCC/ws/trunk/uima-ducc-common/pom.xml>
to org.apache.uima/uima-ducc-common/2.1.0-SNAPSHOT/uima-ducc-common-2.1.0-SNAPSHOT.pom
[JENKINS] Archiving <https://builds.apache.org/job/UIMA-DUCC/ws/trunk/uima-ducc-duccdocs/pom.xml>
to org.apache.uima/uima-ducc-duccdocs/2.1.0-SNAPSHOT/uima-ducc-duccdocs-2.1.0-SNAPSHOT.pom
[JENKINS] Archiving <https://builds.apache.org/job/UIMA-DUCC/ws/trunk/uima-ducc-user/pom.xml>
to org.apache.uima/uima-ducc-user/2.1.0-SNAPSHOT/uima-ducc-user-2.1.0-SNAPSHOT.pom
[JENKINS] Archiving <https://builds.apache.org/job/UIMA-DUCC/ws/trunk/uima-ducc-agent/pom.xml>
to org.apache.uima/uima-ducc-agent/2.1.0-SNAPSHOT/uima-ducc-agent-2.1.0-SNAPSHOT.pom
[JENKINS] Archiving <https://builds.apache.org/job/UIMA-DUCC/ws/trunk/uima-ducc-cli/pom.xml>
to org.apache.uima/uima-ducc-cli/2.1.0-SNAPSHOT/uima-ducc-cli-2.1.0-SNAPSHOT.pom
[JENKINS] Archiving <https://builds.apache.org/job/UIMA-DUCC/ws/trunk/uima-ducc-database/pom.xml>
to org.apache.uima/uima-ducc-database/2.1.0-SNAPSHOT/uima-ducc-database-2.1.0-SNAPSHOT.pom
[JENKINS] Archiving <https://builds.apache.org/job/UIMA-DUCC/ws/trunk/pom.xml> to org.apache.uima/uima-ducc/2.1.0-SNAPSHOT/uima-ducc-2.1.0-SNAPSHOT.pom
[JENKINS] Archiving <https://builds.apache.org/job/UIMA-DUCC/ws/trunk/uima-ducc-pm/pom.xml>
to org.apache.uima/uima-ducc-pm/2.1.0-SNAPSHOT/uima-ducc-pm-2.1.0-SNAPSHOT.pom
[JENKINS] Archiving <https://builds.apache.org/job/UIMA-DUCC/ws/trunk/uima-ducc-transport/pom.xml>
to org.apache.uima/uima-ducc-transport/2.1.0-SNAPSHOT/uima-ducc-transport-2.1.0-SNAPSHOT.pom
Sending e-mails to: dev@uima.apache.org
channel stopped
[WARNINGS] Skipping publisher since build result is FAILURE

Mime
View raw message