uima-dev mailing list archives

Site index · List index
Message view « Date » · « Thread »
Top « Date » · « Thread »
From Apache Jenkins Server <jenk...@builds.apache.org>
Subject Build failed in Jenkins: UIMA-Ruta #658
Date Tue, 05 Jan 2016 12:59:06 GMT
See <https://builds.apache.org/job/UIMA-Ruta/658/>

------------------------------------------
[...truncated 8404 lines...]
A         ruta-ep-ide\src\main\java\org\apache\uima\ruta\ide\parser\ast\RutaActionConstants.java
A         ruta-ep-ide\src\main\java\org\apache\uima\ruta\ide\parser\ast\ComponentDeclaration.java
A         ruta-ep-ide\src\main\java\org\apache\uima\ruta\ide\parser\ast\RutaDeclareDeclarationsStatement.java
A         ruta-ep-ide\src\main\java\org\apache\uima\ruta\ide\parser\ast\RutaAction.java
A         ruta-ep-ide\src\main\java\org\apache\uima\ruta\ide\parser\ast\RutaTypeConstants.java
A         ruta-ep-ide\src\main\java\org\apache\uima\ruta\ide\parser\ast\RutaSimpleStatement.java
A         ruta-ep-ide\src\main\java\org\apache\uima\ruta\ide\parser\ast\RutaLogAction.java
A         ruta-ep-ide\src\main\java\org\apache\uima\ruta\ide\parser\ast\ComposedRuleElement.java
A         ruta-ep-ide\src\main\java\org\apache\uima\ruta\ide\parser\ast\RutaRegExpRule.java
A         ruta-ep-ide\src\main\java\org\apache\uima\ruta\ide\parser\ast\RutaConditionConstants.java
A         ruta-ep-ide\src\main\java\org\apache\uima\ruta\ide\parser\ast\RutaFunction.java
A         ruta-ep-ide\src\main\java\org\apache\uima\ruta\ide\parser\ast\ComponentReference.java
A         ruta-ep-ide\src\main\java\org\apache\uima\ruta\ide\parser\ast\RutaStringExpression.java
A         ruta-ep-ide\src\main\antlr3
A         ruta-ep-ide\src\main\antlr3\org
A         ruta-ep-ide\src\main\antlr3\org\apache
A         ruta-ep-ide\src\main\antlr3\org\apache\uima
A         ruta-ep-ide\src\main\antlr3\org\apache\uima\ruta
A         ruta-ep-ide\src\main\antlr3\org\apache\uima\ruta\ide
A         ruta-ep-ide\src\main\antlr3\org\apache\uima\ruta\ide\core
A         ruta-ep-ide\src\main\antlr3\org\apache\uima\ruta\ide\core\parser
A         ruta-ep-ide\src\main\antlr3\org\apache\uima\ruta\ide\core\parser\RutaLexer.g
A         ruta-ep-ide\src\main\antlr3\org\apache\uima\ruta\ide\core\parser\RutaParser.tokens
A         ruta-ep-ide\src\main\antlr3\org\apache\uima\ruta\ide\core\parser\RutaLexer.tokens
A         ruta-ep-ide\src\main\antlr3\org\apache\uima\ruta\ide\core\parser\RutaParser.g
A         ruta-ep-ide\plugin.properties
A         ruta-ep-ide\pom.xml
A         ruta-ep-ide\plugin.xml
A         ruta-ep-ide\schema
A         ruta-ep-ide\schema\blockExtension.exsd
A         ruta-ep-ide\schema\stringFunctionExtension.exsd
A         ruta-ep-ide\schema\actionExtension.exsd
A         ruta-ep-ide\schema\rutaCommandProcessor.exsd
A         ruta-ep-ide\schema\numberFunctionExtension.exsd
A         ruta-ep-ide\schema\booleanFunctionExtension.exsd
A         ruta-ep-ide\schema\engineExtension.exsd
A         ruta-ep-ide\schema\conditionExtension.exsd
A         ruta-ep-ide\schema\rutakeywords.exsd
A         ruta-ep-ide\schema\rutaCommandDetector.exsd
A         ruta-ep-ide\schema\typeFunctionExtension.exsd
A         ruta-eclipse-update-site
A         ruta-eclipse-update-site\src
A         ruta-eclipse-update-site\src\main
A         ruta-eclipse-update-site\src\main\resources
A         ruta-eclipse-update-site\src\main\resources\category.xml
A         ruta-eclipse-update-site\marker-file-identifying-eclipse-update-site
A         ruta-eclipse-update-site\pom.xml
 U        .
ERROR: Failed to check out https://svn.apache.org/repos/asf/uima/ruta/trunk
org.tmatesoft.svn.core.SVNException: svn: E200030: SCHEMA
	at org.tmatesoft.svn.core.internal.wc.SVNErrorManager.error(SVNErrorManager.java:64)
	at org.tmatesoft.svn.core.internal.wc.SVNErrorManager.error(SVNErrorManager.java:51)
	at org.tmatesoft.svn.core.internal.io.dav.http.HTTPConnection.request(HTTPConnection.java:759)
	at org.tmatesoft.svn.core.internal.io.dav.http.HTTPConnection.request(HTTPConnection.java:371)
	at org.tmatesoft.svn.core.internal.io.dav.http.HTTPConnection.request(HTTPConnection.java:359)
	at org.tmatesoft.svn.core.internal.io.dav.DAVConnection.performHttpRequest(DAVConnection.java:710)
	at org.tmatesoft.svn.core.internal.io.dav.DAVConnection.doReport(DAVConnection.java:334)
	at org.tmatesoft.svn.core.internal.io.dav.DAVRepository.runReport(DAVRepository.java:1303)
	at org.tmatesoft.svn.core.internal.io.dav.DAVRepository.update(DAVRepository.java:851)
	at org.tmatesoft.svn.core.internal.wc2.ng.SvnNgAbstractUpdate.updateInternal(SvnNgAbstractUpdate.java:209)
	at org.tmatesoft.svn.core.internal.wc2.ng.SvnNgAbstractUpdate.update(SvnNgAbstractUpdate.java:72)
	at org.tmatesoft.svn.core.internal.wc2.ng.SvnNgAbstractUpdate.checkout(SvnNgAbstractUpdate.java:802)
	at org.tmatesoft.svn.core.internal.wc2.ng.SvnNgCheckout.run(SvnNgCheckout.java:26)
	at org.tmatesoft.svn.core.internal.wc2.ng.SvnNgCheckout.run(SvnNgCheckout.java:11)
	at org.tmatesoft.svn.core.internal.wc2.ng.SvnNgOperationRunner.run(SvnNgOperationRunner.java:20)
	at org.tmatesoft.svn.core.internal.wc2.SvnOperationRunner.run(SvnOperationRunner.java:21)
	at org.tmatesoft.svn.core.wc2.SvnOperationFactory.run(SvnOperationFactory.java:1259)
	at org.tmatesoft.svn.core.wc2.SvnOperation.run(SvnOperation.java:294)
	at hudson.scm.subversion.CheckoutUpdater$1.perform(CheckoutUpdater.java:121)
	at hudson.scm.subversion.WorkspaceUpdater$UpdateTask.delegateTo(WorkspaceUpdater.java:162)
	at hudson.scm.SubversionSCM$CheckOutTask.perform(SubversionSCM.java:992)
	at hudson.scm.SubversionSCM$CheckOutTask.invoke(SubversionSCM.java:973)
	at hudson.scm.SubversionSCM$CheckOutTask.invoke(SubversionSCM.java:949)
	at hudson.FilePath$FileCallableWrapper.call(FilePath.java:2688)
	at hudson.remoting.UserRequest.perform(UserRequest.java:118)
	at hudson.remoting.UserRequest.perform(UserRequest.java:48)
	at hudson.remoting.Request$2.run(Request.java:328)
	at hudson.remoting.InterceptingExecutorService$1.call(InterceptingExecutorService.java:72)
	at java.util.concurrent.FutureTask.run(Unknown Source)
	at java.util.concurrent.ThreadPoolExecutor.runWorker(Unknown Source)
	at java.util.concurrent.ThreadPoolExecutor$Worker.run(Unknown Source)
	at hudson.remoting.Engine$1$1.run(Engine.java:63)
	at java.lang.Thread.run(Unknown Source)
Caused by: org.tmatesoft.sqljet.core.SqlJetException: SCHEMA: error code is SCHEMA
	at org.tmatesoft.sqljet.core.internal.table.SqlJetOptions.verifySchemaVersion(SqlJetOptions.java:269)
	at org.tmatesoft.sqljet.core.internal.table.SqlJetOptions.changeSchemaVersion(SqlJetOptions.java:282)
	at org.tmatesoft.sqljet.core.internal.schema.SqlJetSchema.createTableSafe(SqlJetSchema.java:527)
	at org.tmatesoft.sqljet.core.internal.schema.SqlJetSchema.createTable(SqlJetSchema.java:476)
	at org.tmatesoft.sqljet.core.table.SqlJetDb$5.run(SqlJetDb.java:270)
	at org.tmatesoft.sqljet.core.table.SqlJetDb$3.run(SqlJetDb.java:240)
	at org.tmatesoft.sqljet.core.table.engine.SqlJetEngine$12.runSynchronized(SqlJetEngine.java:533)
	at org.tmatesoft.sqljet.core.table.engine.SqlJetEngine.runSynchronized(SqlJetEngine.java:217)
	at org.tmatesoft.sqljet.core.table.engine.SqlJetEngine.runEngineTransaction(SqlJetEngine.java:529)
	at org.tmatesoft.sqljet.core.table.SqlJetDb.runTransaction(SqlJetDb.java:238)
	at org.tmatesoft.sqljet.core.table.SqlJetDb.runWriteTransaction(SqlJetDb.java:211)
	at org.tmatesoft.sqljet.core.table.SqlJetDb.createTable(SqlJetDb.java:268)
	at org.tmatesoft.svn.core.internal.wc17.db.statement.SVNWCDbCreateSchema$1.run(SVNWCDbCreateSchema.java:237)
	at org.tmatesoft.sqljet.core.table.SqlJetDb$3.run(SqlJetDb.java:240)
	at org.tmatesoft.sqljet.core.table.engine.SqlJetEngine$12.runSynchronized(SqlJetEngine.java:538)
	at org.tmatesoft.sqljet.core.table.engine.SqlJetEngine.runSynchronized(SqlJetEngine.java:217)
	at org.tmatesoft.sqljet.core.table.engine.SqlJetEngine.runEngineTransaction(SqlJetEngine.java:529)
	at org.tmatesoft.sqljet.core.table.SqlJetDb.runTransaction(SqlJetDb.java:238)
	at org.tmatesoft.sqljet.core.table.SqlJetDb.runWriteTransaction(SqlJetDb.java:211)
	at org.tmatesoft.svn.core.internal.wc17.db.statement.SVNWCDbCreateSchema.exec(SVNWCDbCreateSchema.java:221)
	at org.tmatesoft.svn.core.internal.db.SVNSqlJetStatement.done(SVNSqlJetStatement.java:420)
	at org.tmatesoft.svn.core.internal.wc17.db.SVNWCDb$BumpRevisionPostUpdate.bumpMovedAway(SVNWCDb.java:5185)
	at org.tmatesoft.svn.core.internal.wc17.db.SVNWCDb$BumpRevisionPostUpdate.transaction(SVNWCDb.java:5178)
	at org.tmatesoft.svn.core.internal.db.SVNSqlJetDb.runTransaction(SVNSqlJetDb.java:256)
	at org.tmatesoft.svn.core.internal.db.SVNSqlJetDb.runTransaction(SVNSqlJetDb.java:250)
	at org.tmatesoft.svn.core.internal.wc17.db.SVNWCDb.opBumpRevisionPostUpdate(SVNWCDb.java:5130)
	at org.tmatesoft.svn.core.internal.wc17.SVNUpdateEditor17.closeEdit(SVNUpdateEditor17.java:1728)
	at org.tmatesoft.svn.core.internal.wc.SVNCancellableEditor.closeEdit(SVNCancellableEditor.java:148)
	at org.tmatesoft.svn.core.internal.io.dav.handlers.DAVEditorHandler.endElement(DAVEditorHandler.java:488)
	at org.tmatesoft.svn.core.internal.io.dav.handlers.BasicDAVHandler.endElement(BasicDAVHandler.java:103)
	at com.sun.org.apache.xerces.internal.parsers.AbstractSAXParser.endElement(Unknown Source)
	at com.sun.org.apache.xerces.internal.impl.XMLDocumentFragmentScannerImpl.scanEndElement(Unknown
Source)
	at com.sun.org.apache.xerces.internal.impl.XMLDocumentFragmentScannerImpl$FragmentContentDriver.next(Unknown
Source)
	at com.sun.org.apache.xerces.internal.impl.XMLDocumentScannerImpl.next(Unknown Source)
	at com.sun.org.apache.xerces.internal.impl.XMLNSDocumentScannerImpl.next(Unknown Source)
	at com.sun.org.apache.xerces.internal.impl.XMLDocumentFragmentScannerImpl.scanDocument(Unknown
Source)
	at com.sun.org.apache.xerces.internal.parsers.XML11Configuration.parse(Unknown Source)
	at com.sun.org.apache.xerces.internal.parsers.XML11Configuration.parse(Unknown Source)
	at com.sun.org.apache.xerces.internal.parsers.XMLParser.parse(Unknown Source)
	at com.sun.org.apache.xerces.internal.parsers.AbstractSAXParser.parse(Unknown Source)
	at com.sun.org.apache.xerces.internal.jaxp.SAXParserImpl$JAXPSAXParser.parse(Unknown Source)
	at org.tmatesoft.svn.core.internal.io.dav.http.HTTPConnection.readData(HTTPConnection.java:898)
	at org.tmatesoft.svn.core.internal.io.dav.http.HTTPConnection.readData(HTTPConnection.java:863)
	at org.tmatesoft.svn.core.internal.io.dav.http.HTTPRequest.dispatch(HTTPRequest.java:220)
	at org.tmatesoft.svn.core.internal.io.dav.http.HTTPConnection.request(HTTPConnection.java:463)
	... 30 more
java.io.IOException: remote file operation failed: <https://builds.apache.org/job/UIMA-Ruta/ws/>
at hudson.remoting.Channel@8df7ecf:windows2: java.io.IOException: Failed to check out https://svn.apache.org/repos/asf/uima/ruta/trunk
	at hudson.FilePath.act(FilePath.java:985)
	at hudson.FilePath.act(FilePath.java:967)
	at hudson.scm.SubversionSCM.checkout(SubversionSCM.java:898)
	at hudson.scm.SubversionSCM.checkout(SubversionSCM.java:834)
	at hudson.scm.SCM.checkout(SCM.java:484)
	at hudson.model.AbstractProject.checkout(AbstractProject.java:1274)
	at hudson.model.AbstractBuild$AbstractBuildExecution.defaultCheckout(AbstractBuild.java:609)
	at jenkins.scm.SCMCheckoutStrategy.checkout(SCMCheckoutStrategy.java:86)
	at hudson.model.AbstractBuild$AbstractBuildExecution.run(AbstractBuild.java:531)
	at hudson.model.Run.execute(Run.java:1738)
	at hudson.maven.MavenModuleSetBuild.run(MavenModuleSetBuild.java:531)
	at hudson.model.ResourceController.execute(ResourceController.java:98)
	at hudson.model.Executor.run(Executor.java:381)
Caused by: java.io.IOException: Failed to check out https://svn.apache.org/repos/asf/uima/ruta/trunk
	at hudson.scm.subversion.CheckoutUpdater$1.perform(CheckoutUpdater.java:132)
	at hudson.scm.subversion.WorkspaceUpdater$UpdateTask.delegateTo(WorkspaceUpdater.java:162)
	at hudson.scm.SubversionSCM$CheckOutTask.perform(SubversionSCM.java:992)
	at hudson.scm.SubversionSCM$CheckOutTask.invoke(SubversionSCM.java:973)
	at hudson.scm.SubversionSCM$CheckOutTask.invoke(SubversionSCM.java:949)
	at hudson.FilePath$FileCallableWrapper.call(FilePath.java:2688)
	at hudson.remoting.UserRequest.perform(UserRequest.java:118)
	at hudson.remoting.UserRequest.perform(UserRequest.java:48)
	at hudson.remoting.Request$2.run(Request.java:328)
	at hudson.remoting.InterceptingExecutorService$1.call(InterceptingExecutorService.java:72)
	at java.util.concurrent.FutureTask.run(Unknown Source)
	at java.util.concurrent.ThreadPoolExecutor.runWorker(Unknown Source)
	at java.util.concurrent.ThreadPoolExecutor$Worker.run(Unknown Source)
	at hudson.remoting.Engine$1$1.run(Engine.java:63)
	at java.lang.Thread.run(Unknown Source)
	at ......remote call to windows2(Native Method)
	at hudson.remoting.Channel.attachCallSiteStackTrace(Channel.java:1413)
	at hudson.remoting.UserResponse.retrieve(UserRequest.java:221)
	at hudson.remoting.Channel.call(Channel.java:778)
	at hudson.FilePath.act(FilePath.java:978)
	... 12 more
Caused by: org.tmatesoft.svn.core.SVNException: svn: E200030: SCHEMA
	at org.tmatesoft.svn.core.internal.wc.SVNErrorManager.error(SVNErrorManager.java:64)
	at org.tmatesoft.svn.core.internal.wc.SVNErrorManager.error(SVNErrorManager.java:51)
	at org.tmatesoft.svn.core.internal.io.dav.http.HTTPConnection.request(HTTPConnection.java:759)
	at org.tmatesoft.svn.core.internal.io.dav.http.HTTPConnection.request(HTTPConnection.java:371)
	at org.tmatesoft.svn.core.internal.io.dav.http.HTTPConnection.request(HTTPConnection.java:359)
	at org.tmatesoft.svn.core.internal.io.dav.DAVConnection.performHttpRequest(DAVConnection.java:710)
	at org.tmatesoft.svn.core.internal.io.dav.DAVConnection.doReport(DAVConnection.java:334)
	at org.tmatesoft.svn.core.internal.io.dav.DAVRepository.runReport(DAVRepository.java:1303)
	at org.tmatesoft.svn.core.internal.io.dav.DAVRepository.update(DAVRepository.java:851)
	at org.tmatesoft.svn.core.internal.wc2.ng.SvnNgAbstractUpdate.updateInternal(SvnNgAbstractUpdate.java:209)
	at org.tmatesoft.svn.core.internal.wc2.ng.SvnNgAbstractUpdate.update(SvnNgAbstractUpdate.java:72)
	at org.tmatesoft.svn.core.internal.wc2.ng.SvnNgAbstractUpdate.checkout(SvnNgAbstractUpdate.java:802)
	at org.tmatesoft.svn.core.internal.wc2.ng.SvnNgCheckout.run(SvnNgCheckout.java:26)
	at org.tmatesoft.svn.core.internal.wc2.ng.SvnNgCheckout.run(SvnNgCheckout.java:11)
	at org.tmatesoft.svn.core.internal.wc2.ng.SvnNgOperationRunner.run(SvnNgOperationRunner.java:20)
	at org.tmatesoft.svn.core.internal.wc2.SvnOperationRunner.run(SvnOperationRunner.java:21)
	at org.tmatesoft.svn.core.wc2.SvnOperationFactory.run(SvnOperationFactory.java:1259)
	at org.tmatesoft.svn.core.wc2.SvnOperation.run(SvnOperation.java:294)
	at hudson.scm.subversion.CheckoutUpdater$1.perform(CheckoutUpdater.java:121)
	at hudson.scm.subversion.WorkspaceUpdater$UpdateTask.delegateTo(WorkspaceUpdater.java:162)
	at hudson.scm.SubversionSCM$CheckOutTask.perform(SubversionSCM.java:992)
	at hudson.scm.SubversionSCM$CheckOutTask.invoke(SubversionSCM.java:973)
	at hudson.scm.SubversionSCM$CheckOutTask.invoke(SubversionSCM.java:949)
	at hudson.FilePath$FileCallableWrapper.call(FilePath.java:2688)
	at hudson.remoting.UserRequest.perform(UserRequest.java:118)
	at hudson.remoting.UserRequest.perform(UserRequest.java:48)
	at hudson.remoting.Request$2.run(Request.java:328)
	at hudson.remoting.InterceptingExecutorService$1.call(InterceptingExecutorService.java:72)
	at java.util.concurrent.FutureTask.run(Unknown Source)
	at java.util.concurrent.ThreadPoolExecutor.runWorker(Unknown Source)
	at java.util.concurrent.ThreadPoolExecutor$Worker.run(Unknown Source)
	at hudson.remoting.Engine$1$1.run(Engine.java:63)
	at java.lang.Thread.run(Unknown Source)
Caused by: org.tmatesoft.sqljet.core.SqlJetException: SCHEMA: error code is SCHEMA
	at org.tmatesoft.sqljet.core.internal.table.SqlJetOptions.verifySchemaVersion(SqlJetOptions.java:269)
	at org.tmatesoft.sqljet.core.internal.table.SqlJetOptions.changeSchemaVersion(SqlJetOptions.java:282)
	at org.tmatesoft.sqljet.core.internal.schema.SqlJetSchema.createTableSafe(SqlJetSchema.java:527)
	at org.tmatesoft.sqljet.core.internal.schema.SqlJetSchema.createTable(SqlJetSchema.java:476)
	at org.tmatesoft.sqljet.core.table.SqlJetDb$5.run(SqlJetDb.java:270)
	at org.tmatesoft.sqljet.core.table.SqlJetDb$3.run(SqlJetDb.java:240)
	at org.tmatesoft.sqljet.core.table.engine.SqlJetEngine$12.runSynchronized(SqlJetEngine.java:533)
	at org.tmatesoft.sqljet.core.table.engine.SqlJetEngine.runSynchronized(SqlJetEngine.java:217)
	at org.tmatesoft.sqljet.core.table.engine.SqlJetEngine.runEngineTransaction(SqlJetEngine.java:529)
	at org.tmatesoft.sqljet.core.table.SqlJetDb.runTransaction(SqlJetDb.java:238)
	at org.tmatesoft.sqljet.core.table.SqlJetDb.runWriteTransaction(SqlJetDb.java:211)
	at org.tmatesoft.sqljet.core.table.SqlJetDb.createTable(SqlJetDb.java:268)
	at org.tmatesoft.svn.core.internal.wc17.db.statement.SVNWCDbCreateSchema$1.run(SVNWCDbCreateSchema.java:237)
	at org.tmatesoft.sqljet.core.table.SqlJetDb$3.run(SqlJetDb.java:240)
	at org.tmatesoft.sqljet.core.table.engine.SqlJetEngine$12.runSynchronized(SqlJetEngine.java:538)
	at org.tmatesoft.sqljet.core.table.engine.SqlJetEngine.runSynchronized(SqlJetEngine.java:217)
	at org.tmatesoft.sqljet.core.table.engine.SqlJetEngine.runEngineTransaction(SqlJetEngine.java:529)
	at org.tmatesoft.sqljet.core.table.SqlJetDb.runTransaction(SqlJetDb.java:238)
	at org.tmatesoft.sqljet.core.table.SqlJetDb.runWriteTransaction(SqlJetDb.java:211)
	at org.tmatesoft.svn.core.internal.wc17.db.statement.SVNWCDbCreateSchema.exec(SVNWCDbCreateSchema.java:221)
	at org.tmatesoft.svn.core.internal.db.SVNSqlJetStatement.done(SVNSqlJetStatement.java:420)
	at org.tmatesoft.svn.core.internal.wc17.db.SVNWCDb$BumpRevisionPostUpdate.bumpMovedAway(SVNWCDb.java:5185)
	at org.tmatesoft.svn.core.internal.wc17.db.SVNWCDb$BumpRevisionPostUpdate.transaction(SVNWCDb.java:5178)
	at org.tmatesoft.svn.core.internal.db.SVNSqlJetDb.runTransaction(SVNSqlJetDb.java:256)
	at org.tmatesoft.svn.core.internal.db.SVNSqlJetDb.runTransaction(SVNSqlJetDb.java:250)
	at org.tmatesoft.svn.core.internal.wc17.db.SVNWCDb.opBumpRevisionPostUpdate(SVNWCDb.java:5130)
	at org.tmatesoft.svn.core.internal.wc17.SVNUpdateEditor17.closeEdit(SVNUpdateEditor17.java:1728)
	at org.tmatesoft.svn.core.internal.wc.SVNCancellableEditor.closeEdit(SVNCancellableEditor.java:148)
	at org.tmatesoft.svn.core.internal.io.dav.handlers.DAVEditorHandler.endElement(DAVEditorHandler.java:488)
	at org.tmatesoft.svn.core.internal.io.dav.handlers.BasicDAVHandler.endElement(BasicDAVHandler.java:103)
	at com.sun.org.apache.xerces.internal.parsers.AbstractSAXParser.endElement(Unknown Source)
	at com.sun.org.apache.xerces.internal.impl.XMLDocumentFragmentScannerImpl.scanEndElement(Unknown
Source)
	at com.sun.org.apache.xerces.internal.impl.XMLDocumentFragmentScannerImpl$FragmentContentDriver.next(Unknown
Source)
	at com.sun.org.apache.xerces.internal.impl.XMLDocumentScannerImpl.next(Unknown Source)
	at com.sun.org.apache.xerces.internal.impl.XMLNSDocumentScannerImpl.next(Unknown Source)
	at com.sun.org.apache.xerces.internal.impl.XMLDocumentFragmentScannerImpl.scanDocument(Unknown
Source)
	at com.sun.org.apache.xerces.internal.parsers.XML11Configuration.parse(Unknown Source)
	at com.sun.org.apache.xerces.internal.parsers.XML11Configuration.parse(Unknown Source)
	at com.sun.org.apache.xerces.internal.parsers.XMLParser.parse(Unknown Source)
	at com.sun.org.apache.xerces.internal.parsers.AbstractSAXParser.parse(Unknown Source)
	at com.sun.org.apache.xerces.internal.jaxp.SAXParserImpl$JAXPSAXParser.parse(Unknown Source)
	at org.tmatesoft.svn.core.internal.io.dav.http.HTTPConnection.readData(HTTPConnection.java:898)
	at org.tmatesoft.svn.core.internal.io.dav.http.HTTPConnection.readData(HTTPConnection.java:863)
	at org.tmatesoft.svn.core.internal.io.dav.http.HTTPRequest.dispatch(HTTPRequest.java:220)
	at org.tmatesoft.svn.core.internal.io.dav.http.HTTPConnection.request(HTTPConnection.java:463)
	... 30 more
[WARNINGS] Skipping publisher since build result is FAILURE
Skipping Cobertura coverage report as build was not UNSTABLE or better ...

Mime
View raw message