uima-dev mailing list archives

Site index · List index
Message view « Date » · « Thread »
Top « Date » · « Thread »
From Apache Jenkins Server <jenk...@builds.apache.org>
Subject Build failed in Jenkins: UIMA-Ruta #650
Date Mon, 04 Jan 2016 10:59:35 GMT
See <https://builds.apache.org/job/UIMA-Ruta/650/changes>

Changes:

[pkluegl] UIMA-4707
- added some minimal documentation

[pkluegl] UIMA-4408
- merged with branch

------------------------------------------
[...truncated 3317 lines...]
Tests run: 1, Failures: 0, Errors: 0, Skipped: 0, Time elapsed: 0.076 sec - in org.apache.uima.ruta.IncrementalPartitioningTest
Running org.apache.uima.ruta.InlinedRulesTest
Tests run: 1, Failures: 1, Errors: 0, Skipped: 0, Time elapsed: 0.43 sec <<< FAILURE!
- in org.apache.uima.ruta.InlinedRulesTest
test(org.apache.uima.ruta.InlinedRulesTest)  Time elapsed: 0.429 sec  <<< FAILURE!
java.lang.AssertionError: size of expected annotations (2) does not match with actual size
(0).
	at org.apache.uima.ruta.engine.RutaTestUtils.assertAnnotationsEquals(RutaTestUtils.java:273)
	at org.apache.uima.ruta.InlinedRulesTest.test(InlinedRulesTest.java:57)

Running org.apache.uima.ruta.InvisibleWildcardMatchTest
Tests run: 1, Failures: 0, Errors: 0, Skipped: 0, Time elapsed: 0 sec - in org.apache.uima.ruta.InvisibleWildcardMatchTest
Running org.apache.uima.ruta.LiteralStringMatchTest
Tests run: 1, Failures: 0, Errors: 0, Skipped: 0, Time elapsed: 0 sec - in org.apache.uima.ruta.LiteralStringMatchTest
Running org.apache.uima.ruta.LoadResourceFromClassPathTest
Tests run: 2, Failures: 0, Errors: 0, Skipped: 0, Time elapsed: 0 sec - in org.apache.uima.ruta.LoadResourceFromClassPathTest
Running org.apache.uima.ruta.LoadScriptFromClassPathTest
Tests run: 1, Failures: 0, Errors: 0, Skipped: 0, Time elapsed: 0.002 sec - in org.apache.uima.ruta.LoadScriptFromClassPathTest
Running org.apache.uima.ruta.LongGreedy1Test
Tests run: 1, Failures: 0, Errors: 0, Skipped: 0, Time elapsed: 0 sec - in org.apache.uima.ruta.LongGreedy1Test
Running org.apache.uima.ruta.LongGreedy2Test
Tests run: 1, Failures: 0, Errors: 0, Skipped: 0, Time elapsed: 0 sec - in org.apache.uima.ruta.LongGreedy2Test
Running org.apache.uima.ruta.ManualAnchoringTest
Tests run: 1, Failures: 0, Errors: 0, Skipped: 0, Time elapsed: 0.058 sec - in org.apache.uima.ruta.ManualAnchoringTest
Running org.apache.uima.ruta.MarkFastWithFeatureProjectionTest
Tests run: 1, Failures: 0, Errors: 0, Skipped: 0, Time elapsed: 0.034 sec - in org.apache.uima.ruta.MarkFastWithFeatureProjectionTest
Running org.apache.uima.ruta.MarkInGreedyComposedTest
Tests run: 6, Failures: 0, Errors: 0, Skipped: 0, Time elapsed: 0.426 sec - in org.apache.uima.ruta.MarkInGreedyComposedTest
Running org.apache.uima.ruta.NBSPWSTest
Tests run: 1, Failures: 0, Errors: 0, Skipped: 0, Time elapsed: 0.059 sec - in org.apache.uima.ruta.NBSPWSTest
Running org.apache.uima.ruta.NestedDisjunctiveTest
Tests run: 1, Failures: 0, Errors: 0, Skipped: 0, Time elapsed: 0.035 sec - in org.apache.uima.ruta.NestedDisjunctiveTest
Running org.apache.uima.ruta.NewCASPipelineTest
Tests run: 1, Failures: 0, Errors: 0, Skipped: 0, Time elapsed: 0.184 sec - in org.apache.uima.ruta.NewCASPipelineTest
Running org.apache.uima.ruta.NullExpressionTest
Tests run: 1, Failures: 0, Errors: 0, Skipped: 0, Time elapsed: 0.051 sec - in org.apache.uima.ruta.NullExpressionTest
Running org.apache.uima.ruta.OptionalComposedEndTest
Tests run: 2, Failures: 0, Errors: 0, Skipped: 0, Time elapsed: 0.051 sec - in org.apache.uima.ruta.OptionalComposedEndTest
Running org.apache.uima.ruta.OptionalDisjunctiveBeforeAnchoringTest
Tests run: 1, Failures: 0, Errors: 0, Skipped: 0, Time elapsed: 0.033 sec - in org.apache.uima.ruta.OptionalDisjunctiveBeforeAnchoringTest
Running org.apache.uima.ruta.OutOfWindowTest
Tests run: 3, Failures: 0, Errors: 0, Skipped: 0, Time elapsed: 0.12 sec - in org.apache.uima.ruta.OutOfWindowTest
Running org.apache.uima.ruta.Quantifier1Test
Tests run: 1, Failures: 0, Errors: 0, Skipped: 0, Time elapsed: 0.031 sec - in org.apache.uima.ruta.Quantifier1Test
Running org.apache.uima.ruta.Quantifier2Test
Tests run: 1, Failures: 0, Errors: 0, Skipped: 0, Time elapsed: 0.04 sec - in org.apache.uima.ruta.Quantifier2Test
Running org.apache.uima.ruta.Quantifier3Test
Tests run: 1, Failures: 0, Errors: 0, Skipped: 0, Time elapsed: 0.055 sec - in org.apache.uima.ruta.Quantifier3Test
Running org.apache.uima.ruta.Quantifier4Test
Tests run: 1, Failures: 0, Errors: 0, Skipped: 0, Time elapsed: 0.024 sec - in org.apache.uima.ruta.Quantifier4Test
Running org.apache.uima.ruta.Quantifier5Test
Tests run: 1, Failures: 0, Errors: 0, Skipped: 0, Time elapsed: 0.022 sec - in org.apache.uima.ruta.Quantifier5Test
Running org.apache.uima.ruta.Quantifier6Test
Tests run: 1, Failures: 0, Errors: 0, Skipped: 0, Time elapsed: 0.024 sec - in org.apache.uima.ruta.Quantifier6Test
Running org.apache.uima.ruta.Quantifier7Test
Tests run: 1, Failures: 0, Errors: 0, Skipped: 0, Time elapsed: 0.057 sec - in org.apache.uima.ruta.Quantifier7Test
Running org.apache.uima.ruta.Quantifier8Test
Tests run: 1, Failures: 0, Errors: 0, Skipped: 0, Time elapsed: 0.028 sec - in org.apache.uima.ruta.Quantifier8Test
Running org.apache.uima.ruta.RegExpRuleTest
Tests run: 1, Failures: 0, Errors: 0, Skipped: 0, Time elapsed: 0.036 sec - in org.apache.uima.ruta.RegExpRuleTest
Running org.apache.uima.ruta.RemoveDocumentAnnotationTest
Tests run: 1, Failures: 0, Errors: 0, Skipped: 0, Time elapsed: 0.03 sec - in org.apache.uima.ruta.RemoveDocumentAnnotationTest
Running org.apache.uima.ruta.ReverseQuantifierTest
Tests run: 1, Failures: 0, Errors: 0, Skipped: 0, Time elapsed: 0.026 sec - in org.apache.uima.ruta.ReverseQuantifierTest
Running org.apache.uima.ruta.RuleInference1Test
Tests run: 1, Failures: 0, Errors: 0, Skipped: 0, Time elapsed: 0.035 sec - in org.apache.uima.ruta.RuleInference1Test
Running org.apache.uima.ruta.RuleInference2Test
Tests run: 1, Failures: 0, Errors: 0, Skipped: 0, Time elapsed: 0.038 sec - in org.apache.uima.ruta.RuleInference2Test
Running org.apache.uima.ruta.RuleInference3Test
Tests run: 1, Failures: 0, Errors: 0, Skipped: 0, Time elapsed: 0.078 sec - in org.apache.uima.ruta.RuleInference3Test
Running org.apache.uima.ruta.RutaParsingErrorTest
Tests run: 2, Failures: 0, Errors: 0, Skipped: 0, Time elapsed: 0.289 sec - in org.apache.uima.ruta.RutaParsingErrorTest
Running org.apache.uima.ruta.seed.DefaultSeederTest
Tests run: 2, Failures: 0, Errors: 0, Skipped: 0, Time elapsed: 0.107 sec - in org.apache.uima.ruta.seed.DefaultSeederTest
Running org.apache.uima.ruta.ShiftWithLowMemoryProfileTest
Tests run: 1, Failures: 0, Errors: 0, Skipped: 0, Time elapsed: 0.109 sec - in org.apache.uima.ruta.ShiftWithLowMemoryProfileTest
Running org.apache.uima.ruta.SidestepInComposedTest
Tests run: 1, Failures: 0, Errors: 0, Skipped: 0, Time elapsed: 0.029 sec - in org.apache.uima.ruta.SidestepInComposedTest
Running org.apache.uima.ruta.StrictImportTest
Jan 04, 2016 2:59:07 AM org.apache.uima.analysis_engine.impl.PrimitiveAnalysisEngine_impl
callAnalysisComponentProcess(417)
SEVERE: Exception occurred
org.apache.uima.analysis_engine.AnalysisEngineProcessException: Annotator processing failed.
   
	at org.apache.uima.ruta.engine.RutaEngine.process(RutaEngine.java:551)
	at org.apache.uima.analysis_component.JCasAnnotator_ImplBase.process(JCasAnnotator_ImplBase.java:48)
	at org.apache.uima.analysis_engine.impl.PrimitiveAnalysisEngine_impl.callAnalysisComponentProcess(PrimitiveAnalysisEngine_impl.java:385)
	at org.apache.uima.analysis_engine.impl.PrimitiveAnalysisEngine_impl.processAndOutputNewCASes(PrimitiveAnalysisEngine_impl.java:308)
	at org.apache.uima.analysis_engine.impl.AnalysisEngineImplBase.process(AnalysisEngineImplBase.java:269)
	at org.apache.uima.ruta.StrictImportTest.testUndeclaredTypeSystem(StrictImportTest.java:80)
	at sun.reflect.NativeMethodAccessorImpl.invoke0(Native Method)
	at sun.reflect.NativeMethodAccessorImpl.invoke(NativeMethodAccessorImpl.java:57)
	at sun.reflect.DelegatingMethodAccessorImpl.invoke(DelegatingMethodAccessorImpl.java:43)
	at java.lang.reflect.Method.invoke(Method.java:601)
	at org.junit.runners.model.FrameworkMethod$1.runReflectiveCall(FrameworkMethod.java:44)
	at org.junit.internal.runners.model.ReflectiveCallable.run(ReflectiveCallable.java:15)
	at org.junit.runners.model.FrameworkMethod.invokeExplosively(FrameworkMethod.java:41)
	at org.junit.internal.runners.statements.InvokeMethod.evaluate(InvokeMethod.java:20)
	at org.junit.internal.runners.statements.RunBefores.evaluate(RunBefores.java:28)
	at org.junit.internal.runners.statements.RunAfters.evaluate(RunAfters.java:31)
	at org.junit.runners.BlockJUnit4ClassRunner.runChild(BlockJUnit4ClassRunner.java:73)
	at org.junit.runners.BlockJUnit4ClassRunner.runChild(BlockJUnit4ClassRunner.java:46)
	at org.junit.runners.ParentRunner.runChildren(ParentRunner.java:180)
	at org.junit.runners.ParentRunner.access$000(ParentRunner.java:41)
	at org.junit.runners.ParentRunner$1.evaluate(ParentRunner.java:173)
	at org.junit.internal.runners.statements.RunBefores.evaluate(RunBefores.java:28)
	at org.junit.internal.runners.statements.RunAfters.evaluate(RunAfters.java:31)
	at org.junit.runners.ParentRunner.run(ParentRunner.java:220)
	at org.apache.maven.surefire.junit4.JUnit4Provider.execute(JUnit4Provider.java:264)
	at org.apache.maven.surefire.junit4.JUnit4Provider.executeTestSet(JUnit4Provider.java:153)
	at org.apache.maven.surefire.junit4.JUnit4Provider.invoke(JUnit4Provider.java:124)
	at org.apache.maven.surefire.booter.ForkedBooter.invokeProviderInSameClassLoader(ForkedBooter.java:200)
	at org.apache.maven.surefire.booter.ForkedBooter.runSuitesInProcess(ForkedBooter.java:153)
	at org.apache.maven.surefire.booter.ForkedBooter.main(ForkedBooter.java:103)
Caused by: java.lang.IllegalArgumentException: Not able to resolve type: MyType
	at org.apache.uima.ruta.expression.type.SimpleTypeExpression.getType(SimpleTypeExpression.java:48)
	at org.apache.uima.ruta.action.AbstractMarkAction.createAnnotation(AbstractMarkAction.java:42)
	at org.apache.uima.ruta.action.MarkAction.execute(MarkAction.java:60)
	at org.apache.uima.ruta.rule.AbstractRuleElement.apply(AbstractRuleElement.java:132)
	at org.apache.uima.ruta.rule.RuleElementCaretaker.applyRuleElements(RuleElementCaretaker.java:110)
	at org.apache.uima.ruta.rule.ComposedRuleElement.applyRuleElements(ComposedRuleElement.java:603)
	at org.apache.uima.ruta.rule.AbstractRuleElement.doneMatching(AbstractRuleElement.java:86)
	at org.apache.uima.ruta.rule.ComposedRuleElement.fallback(ComposedRuleElement.java:521)
	at org.apache.uima.ruta.rule.ComposedRuleElement.fallbackContinue(ComposedRuleElement.java:416)
	at org.apache.uima.ruta.rule.RutaRuleElement.startMatch(RutaRuleElement.java:103)
	at org.apache.uima.ruta.rule.ComposedRuleElement.startMatch(ComposedRuleElement.java:74)
	at org.apache.uima.ruta.rule.RutaRule.apply(RutaRule.java:53)
	at org.apache.uima.ruta.rule.RutaRule.apply(RutaRule.java:46)
	at org.apache.uima.ruta.rule.RutaRule.apply(RutaRule.java:32)
	at org.apache.uima.ruta.RutaScriptBlock.apply(RutaScriptBlock.java:63)
	at org.apache.uima.ruta.RutaModule.apply(RutaModule.java:48)
	at org.apache.uima.ruta.engine.RutaEngine.process(RutaEngine.java:549)
	... 29 more

Tests run: 3, Failures: 0, Errors: 0, Skipped: 0, Time elapsed: 0.301 sec - in org.apache.uima.ruta.StrictImportTest
Running org.apache.uima.ruta.SubAtomicTest
Tests run: 1, Failures: 0, Errors: 0, Skipped: 0, Time elapsed: 0.032 sec - in org.apache.uima.ruta.SubAtomicTest
Running org.apache.uima.ruta.TypeAliasTest
Tests run: 1, Failures: 0, Errors: 0, Skipped: 0, Time elapsed: 0.021 sec - in org.apache.uima.ruta.TypeAliasTest
Running org.apache.uima.ruta.verbalizer.ActionVerbalizerTest
Tests run: 1, Failures: 0, Errors: 0, Skipped: 0, Time elapsed: 0.003 sec - in org.apache.uima.ruta.verbalizer.ActionVerbalizerTest
Running org.apache.uima.ruta.verbalizer.ConditionVerbalizerTest
Tests run: 1, Failures: 0, Errors: 0, Skipped: 0, Time elapsed: 0.001 sec - in org.apache.uima.ruta.verbalizer.ConditionVerbalizerTest
Running org.apache.uima.ruta.verbalizer.ExpressionVerbalizerTest
Tests run: 1, Failures: 0, Errors: 0, Skipped: 0, Time elapsed: 0.002 sec - in org.apache.uima.ruta.verbalizer.ExpressionVerbalizerTest
Running org.apache.uima.ruta.WildCard1Test
Tests run: 1, Failures: 0, Errors: 0, Skipped: 0, Time elapsed: 0.104 sec - in org.apache.uima.ruta.WildCard1Test
Running org.apache.uima.ruta.WildCard2Test
Tests run: 2, Failures: 0, Errors: 0, Skipped: 0, Time elapsed: 0.573 sec - in org.apache.uima.ruta.WildCard2Test
Running org.apache.uima.ruta.WildCard3Test
Tests run: 1, Failures: 0, Errors: 0, Skipped: 0, Time elapsed: 0.223 sec - in org.apache.uima.ruta.WildCard3Test
Running org.apache.uima.ruta.WildCardInWindowTest
Tests run: 5, Failures: 0, Errors: 0, Skipped: 0, Time elapsed: 0.237 sec - in org.apache.uima.ruta.WildCardInWindowTest
Running org.apache.uima.ruta.WSDictionaryTest
Tests run: 3, Failures: 0, Errors: 0, Skipped: 0, Time elapsed: 0.194 sec - in org.apache.uima.ruta.WSDictionaryTest
Running org.apache.uima.ruta.ZeroLengthAnnotationTest
Tests run: 2, Failures: 0, Errors: 0, Skipped: 0, Time elapsed: 0.065 sec - in org.apache.uima.ruta.ZeroLengthAnnotationTest

Results :

Failed tests: 
  InlinedRulesTest.test:57 size of expected annotations (2) does not match with actual size
(0).

Tests run: 217, Failures: 1, Errors: 0, Skipped: 0

[ERROR] There are test failures.

Please refer to F:\jenkins\jenkins-slave\workspace\UIMA-Ruta\trunk\ruta-core\target\surefire-reports
for the individual test results.
[INFO] ------------------------------------------------------------------------
[INFO] Reactor Summary:
[INFO] 
[INFO] Apache UIMA Ruta: ruta-parent ..................... SUCCESS [28.320s]
[INFO] Apache UIMA Ruta: ruta-core ....................... FAILURE [57.528s]
[INFO] Apache UIMA Ruta: ruta-core-ext ................... SKIPPED
[INFO] Apache UIMA Ruta Eclipse: ruta-ep-engine .......... SKIPPED
[INFO] Apache UIMA Ruta Eclipse: ruta-ep-ide ............. SKIPPED
[INFO] Apache UIMA Ruta Eclipse: ruta-ep-ide-ui .......... SKIPPED
[INFO] Apache UIMA Ruta Eclipse: ruta-ep-caseditor ....... SKIPPED
[INFO] Apache UIMA Ruta Eclipse: ruta-ep-addons .......... SKIPPED
[INFO] Apache UIMA Ruta Eclipse: ruta-ep-textruler ....... SKIPPED
[INFO] Apache UIMA Ruta Eclipse: ruta-ep-core-ext ........ SKIPPED
[INFO] Apache UIMA Maven: ruta-maven-plugin .............. SKIPPED
[INFO] Apache UIMA Ruta Documentation .................... SKIPPED
[INFO] Apache UIMA Ruta Eclipse: ruta-eclipse-feature .... SKIPPED
[INFO] Apache UIMA Ruta: ruta-ep-example-extensions ...... SKIPPED
[INFO] Apache UIMA Ruta: ruta-maven-example .............. SKIPPED
[INFO] Apache UIMA Ruta: ruta ............................ SKIPPED
[INFO] ------------------------------------------------------------------------
[INFO] BUILD FAILURE
[INFO] ------------------------------------------------------------------------
[INFO] Total time: 1:38.676s
[INFO] Finished at: Mon Jan 04 02:59:09 PST 2016
[INFO] Final Memory: 51M/216M
[INFO] ------------------------------------------------------------------------
Sending e-mails to: dev@uima.apache.org
ERROR: Failed to parse POMs
hudson.util.IOException2: java.util.MissingResourceException: Unable to load resource jar:file:/C:/.jenkins/cache/jars/E1/2CFD76F12D93953A10911C2505CB59.jar!/hudson/maven/Messages.properties
	at hudson.maven.Maven3Builder.call(Maven3Builder.java:184)
	at hudson.maven.Maven3Builder.call(Maven3Builder.java:71)
	at hudson.remoting.UserRequest.perform(UserRequest.java:118)
	at hudson.remoting.UserRequest.perform(UserRequest.java:48)
	at hudson.remoting.Request$2.run(Request.java:328)
	at hudson.remoting.InterceptingExecutorService$1.call(InterceptingExecutorService.java:72)
	at java.util.concurrent.FutureTask$Sync.innerRun(FutureTask.java:334)
	at java.util.concurrent.FutureTask.run(FutureTask.java:166)
	at java.util.concurrent.ThreadPoolExecutor.runWorker(ThreadPoolExecutor.java:1110)
	at java.util.concurrent.ThreadPoolExecutor$Worker.run(ThreadPoolExecutor.java:603)
	at java.lang.Thread.run(Thread.java:722)
	at ......remote call to Channel to Maven [f:\jenkins\tools\java\latest-1.7-64/bin/java, -Xmx800m,
-XX:MaxPermSize=256m, -cp, f:\jenkins\jenkins-slave\maven3-agent.jar;f:\jenkins\jenkins-slave\tools\hudson.tasks.Maven_MavenInstallation\Maven_3.0.3\boot\plexus-classworlds-2.4.jar,
org.jvnet.hudson.maven3.agent.Maven3Main, f:\jenkins\jenkins-slave\tools\hudson.tasks.Maven_MavenInstallation\Maven_3.0.3,
F:\jenkins\jenkins-slave\slave.jar, f:\jenkins\jenkins-slave\maven3-interceptor.jar, f:\jenkins\jenkins-slave\maven3-interceptor-commons.jar,
50259](Native Method)
	at hudson.remoting.Channel.attachCallSiteStackTrace(Channel.java:1413)
	at hudson.remoting.UserResponse.retrieve(UserRequest.java:221)
	at hudson.remoting.Channel.call(Channel.java:778)
	at hudson.maven.ProcessCache$MavenProcess.call(ProcessCache.java:161)
	at hudson.maven.MavenModuleSetBuild$MavenModuleSetBuildExecution.doRun(MavenModuleSetBuild.java:853)
	at hudson.model.AbstractBuild$AbstractBuildExecution.run(AbstractBuild.java:536)
	at hudson.model.Run.execute(Run.java:1738)
	at hudson.maven.MavenModuleSetBuild.run(MavenModuleSetBuild.java:531)
	at hudson.model.ResourceController.execute(ResourceController.java:98)
	at hudson.model.Executor.run(Executor.java:381)
Caused by: java.util.MissingResourceException: Unable to load resource jar:file:/C:/.jenkins/cache/jars/E1/2CFD76F12D93953A10911C2505CB59.jar!/hudson/maven/Messages.properties
	at org.jvnet.localizer.ResourceBundleHolder.get(ResourceBundleHolder.java:121)
	at org.jvnet.localizer.ResourceBundleHolder.get(ResourceBundleHolder.java:128)
	at org.jvnet.localizer.ResourceBundleHolder.get(ResourceBundleHolder.java:128)
	at org.jvnet.localizer.ResourceBundleHolder.format(ResourceBundleHolder.java:170)
	at hudson.maven.Messages.MavenBuilder_Waiting(Messages.java:475)
	at hudson.maven.AbstractMavenBuilder.waitForAsynchronousExecutions(AbstractMavenBuilder.java:184)
	at hudson.maven.Maven3Builder.call(Maven3Builder.java:143)
	at hudson.maven.Maven3Builder.call(Maven3Builder.java:71)
	at hudson.remoting.UserRequest.perform(UserRequest.java:118)
	at hudson.remoting.UserRequest.perform(UserRequest.java:48)
	at hudson.remoting.Request$2.run(Request.java:328)
	at hudson.remoting.InterceptingExecutorService$1.call(InterceptingExecutorService.java:72)
	at java.util.concurrent.FutureTask$Sync.innerRun(FutureTask.java:334)
	at java.util.concurrent.FutureTask.run(FutureTask.java:166)
	at java.util.concurrent.ThreadPoolExecutor.runWorker(ThreadPoolExecutor.java:1110)
	at java.util.concurrent.ThreadPoolExecutor$Worker.run(ThreadPoolExecutor.java:603)
	at java.lang.Thread.run(Thread.java:722)
Caused by: java.util.zip.ZipException: zip file is empty
	at java.util.zip.ZipFile.open(Native Method)
	at java.util.zip.ZipFile.<init>(ZipFile.java:214)
	at java.util.zip.ZipFile.<init>(ZipFile.java:144)
	at java.util.jar.JarFile.<init>(JarFile.java:152)
	at java.util.jar.JarFile.<init>(JarFile.java:89)
	at sun.net.www.protocol.jar.URLJarFile.<init>(URLJarFile.java:93)
	at sun.net.www.protocol.jar.URLJarFile.getJarFile(URLJarFile.java:69)
	at sun.net.www.protocol.jar.JarFileFactory.get(JarFileFactory.java:98)
	at sun.net.www.protocol.jar.JarURLConnection.connect(JarURLConnection.java:122)
	at sun.net.www.protocol.jar.JarURLConnection.getInputStream(JarURLConnection.java:150)
	at org.jvnet.localizer.ResourceBundleHolder.get(ResourceBundleHolder.java:113)
	... 16 more
channel stopped
[WARNINGS] Skipping publisher since build result is FAILURE
Skipping Cobertura coverage report as build was not UNSTABLE or better ...

Mime
View raw message