uima-dev mailing list archives

Site index · List index
Message view « Date » · « Thread »
Top « Date » · « Thread »
From Apache Jenkins Server <jenk...@builds.apache.org>
Subject Build failed in Jenkins: UIMA-Ruta #667
Date Tue, 12 Jan 2016 13:58:46 GMT
See <https://builds.apache.org/job/UIMA-Ruta/667/changes>

Changes:

[pkluegl] UIMA-4734
- refactoring of list expressions

------------------------------------------
[...truncated 3146 lines...]
[ERROR] <https://builds.apache.org/job/UIMA-Ruta/ws/trunk/ruta-core/src/test/java/org/apache/uima/ruta/verbalizer/ExpressionVerbalizerTest.java>:[193,38]
cannot find symbol
  symbol:   class BooleanListVariableExpression
  location: class org.apache.uima.ruta.verbalizer.ExpressionVerbalizerTest
[ERROR] <https://builds.apache.org/job/UIMA-Ruta/ws/trunk/ruta-core/src/test/java/org/apache/uima/ruta/verbalizer/ExpressionVerbalizerTest.java>:[202,5]
cannot find symbol
  symbol:   class NumberListExpression
  location: class org.apache.uima.ruta.verbalizer.ExpressionVerbalizerTest
[ERROR] <https://builds.apache.org/job/UIMA-Ruta/ws/trunk/ruta-core/src/test/java/org/apache/uima/ruta/verbalizer/ExpressionVerbalizerTest.java>:[202,37]
cannot find symbol
  symbol:   class SimpleNumberListExpression
  location: class org.apache.uima.ruta.verbalizer.ExpressionVerbalizerTest
[ERROR] <https://builds.apache.org/job/UIMA-Ruta/ws/trunk/ruta-core/src/test/java/org/apache/uima/ruta/verbalizer/ExpressionVerbalizerTest.java>:[203,5]
cannot find symbol
  symbol:   class NumberListExpression
  location: class org.apache.uima.ruta.verbalizer.ExpressionVerbalizerTest
[ERROR] <https://builds.apache.org/job/UIMA-Ruta/ws/trunk/ruta-core/src/test/java/org/apache/uima/ruta/verbalizer/ExpressionVerbalizerTest.java>:[203,37]
cannot find symbol
  symbol:   class NumberListVariableExpression
  location: class org.apache.uima.ruta.verbalizer.ExpressionVerbalizerTest
[ERROR] <https://builds.apache.org/job/UIMA-Ruta/ws/trunk/ruta-core/src/test/java/org/apache/uima/ruta/verbalizer/ExpressionVerbalizerTest.java>:[212,5]
cannot find symbol
  symbol:   class TypeListExpression
  location: class org.apache.uima.ruta.verbalizer.ExpressionVerbalizerTest
[ERROR] <https://builds.apache.org/job/UIMA-Ruta/ws/trunk/ruta-core/src/test/java/org/apache/uima/ruta/verbalizer/ExpressionVerbalizerTest.java>:[212,35]
cannot find symbol
  symbol:   class SimpleTypeListExpression
  location: class org.apache.uima.ruta.verbalizer.ExpressionVerbalizerTest
[ERROR] <https://builds.apache.org/job/UIMA-Ruta/ws/trunk/ruta-core/src/test/java/org/apache/uima/ruta/verbalizer/ExpressionVerbalizerTest.java>:[213,5]
cannot find symbol
  symbol:   class TypeListExpression
  location: class org.apache.uima.ruta.verbalizer.ExpressionVerbalizerTest
[ERROR] <https://builds.apache.org/job/UIMA-Ruta/ws/trunk/ruta-core/src/test/java/org/apache/uima/ruta/verbalizer/ExpressionVerbalizerTest.java>:[213,35]
cannot find symbol
  symbol:   class TypeListVariableExpression
  location: class org.apache.uima.ruta.verbalizer.ExpressionVerbalizerTest
[ERROR] <https://builds.apache.org/job/UIMA-Ruta/ws/trunk/ruta-core/src/test/java/org/apache/uima/ruta/verbalizer/ActionVerbalizerTest.java>:[111,5]
cannot find symbol
  symbol:   class TypeListExpression
  location: class org.apache.uima.ruta.verbalizer.ActionVerbalizerTest
[ERROR] <https://builds.apache.org/job/UIMA-Ruta/ws/trunk/ruta-core/src/test/java/org/apache/uima/ruta/verbalizer/ActionVerbalizerTest.java>:[111,43]
cannot find symbol
  symbol:   class SimpleTypeListExpression
  location: class org.apache.uima.ruta.verbalizer.ActionVerbalizerTest
[ERROR] <https://builds.apache.org/job/UIMA-Ruta/ws/trunk/ruta-core/src/test/java/org/apache/uima/ruta/verbalizer/ActionVerbalizerTest.java>:[112,5]
cannot find symbol
  symbol:   class StringListExpression
  location: class org.apache.uima.ruta.verbalizer.ActionVerbalizerTest
[ERROR] <https://builds.apache.org/job/UIMA-Ruta/ws/trunk/ruta-core/src/test/java/org/apache/uima/ruta/verbalizer/ActionVerbalizerTest.java>:[112,47]
cannot find symbol
  symbol:   class SimpleStringListExpression
  location: class org.apache.uima.ruta.verbalizer.ActionVerbalizerTest
[ERROR] <https://builds.apache.org/job/UIMA-Ruta/ws/trunk/ruta-core/src/test/java/org/apache/uima/ruta/verbalizer/ActionVerbalizerTest.java>:[117,35]
cannot find symbol
  symbol:   class SimpleTypeListExpression
  location: class org.apache.uima.ruta.verbalizer.ActionVerbalizerTest
[ERROR] <https://builds.apache.org/job/UIMA-Ruta/ws/trunk/ruta-core/src/test/java/org/apache/uima/ruta/verbalizer/ConditionVerbalizerTest.java>:[90,5]
cannot find symbol
  symbol:   class TypeListExpression
  location: class org.apache.uima.ruta.verbalizer.ConditionVerbalizerTest
[ERROR] <https://builds.apache.org/job/UIMA-Ruta/ws/trunk/ruta-core/src/test/java/org/apache/uima/ruta/verbalizer/ConditionVerbalizerTest.java>:[90,43]
cannot find symbol
  symbol:   class SimpleTypeListExpression
  location: class org.apache.uima.ruta.verbalizer.ConditionVerbalizerTest
[ERROR] <https://builds.apache.org/job/UIMA-Ruta/ws/trunk/ruta-core/src/test/java/org/apache/uima/ruta/verbalizer/ConditionVerbalizerTest.java>:[91,5]
cannot find symbol
  symbol:   class StringListExpression
  location: class org.apache.uima.ruta.verbalizer.ConditionVerbalizerTest
[ERROR] <https://builds.apache.org/job/UIMA-Ruta/ws/trunk/ruta-core/src/test/java/org/apache/uima/ruta/verbalizer/ConditionVerbalizerTest.java>:[91,47]
cannot find symbol
  symbol:   class SimpleStringListExpression
  location: class org.apache.uima.ruta.verbalizer.ConditionVerbalizerTest
[INFO] 45 errors 
[INFO] -------------------------------------------------------------
[INFO] ------------------------------------------------------------------------
[INFO] Reactor Summary:
[INFO] 
[INFO] Apache UIMA Ruta: ruta-parent ..................... SUCCESS [20.391s]
[INFO] Apache UIMA Ruta: ruta-core ....................... FAILURE [20.297s]
[INFO] Apache UIMA Ruta: ruta-core-ext ................... SKIPPED
[INFO] Apache UIMA Ruta Eclipse: ruta-ep-engine .......... SKIPPED
[INFO] Apache UIMA Ruta Eclipse: ruta-ep-ide ............. SKIPPED
[INFO] Apache UIMA Ruta Eclipse: ruta-ep-ide-ui .......... SKIPPED
[INFO] Apache UIMA Ruta Eclipse: ruta-ep-caseditor ....... SKIPPED
[INFO] Apache UIMA Ruta Eclipse: ruta-ep-addons .......... SKIPPED
[INFO] Apache UIMA Ruta Eclipse: ruta-ep-textruler ....... SKIPPED
[INFO] Apache UIMA Ruta Eclipse: ruta-ep-core-ext ........ SKIPPED
[INFO] Apache UIMA Maven: ruta-maven-plugin .............. SKIPPED
[INFO] Apache UIMA Ruta Documentation .................... SKIPPED
[INFO] Apache UIMA Ruta Eclipse: ruta-eclipse-feature .... SKIPPED
[INFO] Apache UIMA Ruta: ruta-ep-example-extensions ...... SKIPPED
[INFO] Apache UIMA Ruta: ruta-maven-example .............. SKIPPED
[INFO] Apache UIMA Ruta: ruta ............................ SKIPPED
[INFO] ------------------------------------------------------------------------
[INFO] BUILD FAILURE
[INFO] ------------------------------------------------------------------------
[INFO] Total time: 45.097s
[INFO] Finished at: Tue Jan 12 13:58:43 UTC 2016
[INFO] Final Memory: 45M/610M
[INFO] ------------------------------------------------------------------------
Waiting for Jenkins to finish collecting data
[ERROR] Failed to execute goal org.apache.maven.plugins:maven-compiler-plugin:3.1:testCompile
(default-testCompile) on project ruta-core: Compilation failure: Compilation failure:
[ERROR] <https://builds.apache.org/job/UIMA-Ruta/ws/trunk/ruta-core/src/test/java/org/apache/uima/ruta/verbalizer/ExpressionVerbalizerTest.java>:[32,44]
cannot find symbol
[ERROR] symbol:   class BooleanListExpression
[ERROR] location: package org.apache.uima.ruta.expression.list
[ERROR] <https://builds.apache.org/job/UIMA-Ruta/ws/trunk/ruta-core/src/test/java/org/apache/uima/ruta/verbalizer/ExpressionVerbalizerTest.java>:[33,44]
cannot find symbol
[ERROR] symbol:   class BooleanListVariableExpression
[ERROR] location: package org.apache.uima.ruta.expression.list
[ERROR] <https://builds.apache.org/job/UIMA-Ruta/ws/trunk/ruta-core/src/test/java/org/apache/uima/ruta/verbalizer/ExpressionVerbalizerTest.java>:[34,44]
cannot find symbol
[ERROR] symbol:   class NumberListExpression
[ERROR] location: package org.apache.uima.ruta.expression.list
[ERROR] <https://builds.apache.org/job/UIMA-Ruta/ws/trunk/ruta-core/src/test/java/org/apache/uima/ruta/verbalizer/ExpressionVerbalizerTest.java>:[35,44]
cannot find symbol
[ERROR] symbol:   class NumberListVariableExpression
[ERROR] location: package org.apache.uima.ruta.expression.list
[ERROR] <https://builds.apache.org/job/UIMA-Ruta/ws/trunk/ruta-core/src/test/java/org/apache/uima/ruta/verbalizer/ExpressionVerbalizerTest.java>:[36,44]
cannot find symbol
[ERROR] symbol:   class SimpleBooleanListExpression
[ERROR] location: package org.apache.uima.ruta.expression.list
[ERROR] <https://builds.apache.org/job/UIMA-Ruta/ws/trunk/ruta-core/src/test/java/org/apache/uima/ruta/verbalizer/ExpressionVerbalizerTest.java>:[37,44]
cannot find symbol
[ERROR] symbol:   class SimpleNumberListExpression
[ERROR] location: package org.apache.uima.ruta.expression.list
[ERROR] <https://builds.apache.org/job/UIMA-Ruta/ws/trunk/ruta-core/src/test/java/org/apache/uima/ruta/verbalizer/ExpressionVerbalizerTest.java>:[38,44]
cannot find symbol
[ERROR] symbol:   class SimpleStringListExpression
[ERROR] location: package org.apache.uima.ruta.expression.list
[ERROR] <https://builds.apache.org/job/UIMA-Ruta/ws/trunk/ruta-core/src/test/java/org/apache/uima/ruta/verbalizer/ExpressionVerbalizerTest.java>:[39,44]
cannot find symbol
[ERROR] symbol:   class SimpleTypeListExpression
[ERROR] location: package org.apache.uima.ruta.expression.list
[ERROR] <https://builds.apache.org/job/UIMA-Ruta/ws/trunk/ruta-core/src/test/java/org/apache/uima/ruta/verbalizer/ExpressionVerbalizerTest.java>:[40,44]
cannot find symbol
[ERROR] symbol:   class StringListExpression
[ERROR] location: package org.apache.uima.ruta.expression.list
[ERROR] <https://builds.apache.org/job/UIMA-Ruta/ws/trunk/ruta-core/src/test/java/org/apache/uima/ruta/verbalizer/ExpressionVerbalizerTest.java>:[41,44]
cannot find symbol
[ERROR] symbol:   class StringListVariableExpression
[ERROR] location: package org.apache.uima.ruta.expression.list
[ERROR] <https://builds.apache.org/job/UIMA-Ruta/ws/trunk/ruta-core/src/test/java/org/apache/uima/ruta/verbalizer/ExpressionVerbalizerTest.java>:[42,44]
cannot find symbol
[ERROR] symbol:   class TypeListExpression
[ERROR] location: package org.apache.uima.ruta.expression.list
[ERROR] <https://builds.apache.org/job/UIMA-Ruta/ws/trunk/ruta-core/src/test/java/org/apache/uima/ruta/verbalizer/ExpressionVerbalizerTest.java>:[43,44]
cannot find symbol
[ERROR] symbol:   class TypeListVariableExpression
[ERROR] location: package org.apache.uima.ruta.expression.list
[ERROR] <https://builds.apache.org/job/UIMA-Ruta/ws/trunk/ruta-core/src/test/java/org/apache/uima/ruta/verbalizer/ActionVerbalizerTest.java>:[68,44]
cannot find symbol
[ERROR] symbol:   class SimpleStringListExpression
[ERROR] location: package org.apache.uima.ruta.expression.list
[ERROR] <https://builds.apache.org/job/UIMA-Ruta/ws/trunk/ruta-core/src/test/java/org/apache/uima/ruta/verbalizer/ActionVerbalizerTest.java>:[69,44]
cannot find symbol
[ERROR] symbol:   class SimpleTypeListExpression
[ERROR] location: package org.apache.uima.ruta.expression.list
[ERROR] <https://builds.apache.org/job/UIMA-Ruta/ws/trunk/ruta-core/src/test/java/org/apache/uima/ruta/verbalizer/ActionVerbalizerTest.java>:[70,44]
cannot find symbol
[ERROR] symbol:   class StringListExpression
[ERROR] location: package org.apache.uima.ruta.expression.list
[ERROR] <https://builds.apache.org/job/UIMA-Ruta/ws/trunk/ruta-core/src/test/java/org/apache/uima/ruta/verbalizer/ActionVerbalizerTest.java>:[71,44]
cannot find symbol
[ERROR] symbol:   class TypeListExpression
[ERROR] location: package org.apache.uima.ruta.expression.list
[ERROR] <https://builds.apache.org/job/UIMA-Ruta/ws/trunk/ruta-core/src/test/java/org/apache/uima/ruta/verbalizer/ConditionVerbalizerTest.java>:[57,44]
cannot find symbol
[ERROR] symbol:   class SimpleStringListExpression
[ERROR] location: package org.apache.uima.ruta.expression.list
[ERROR] <https://builds.apache.org/job/UIMA-Ruta/ws/trunk/ruta-core/src/test/java/org/apache/uima/ruta/verbalizer/ConditionVerbalizerTest.java>:[58,44]
cannot find symbol
[ERROR] symbol:   class SimpleTypeListExpression
[ERROR] location: package org.apache.uima.ruta.expression.list
[ERROR] <https://builds.apache.org/job/UIMA-Ruta/ws/trunk/ruta-core/src/test/java/org/apache/uima/ruta/verbalizer/ConditionVerbalizerTest.java>:[59,44]
cannot find symbol
[ERROR] symbol:   class StringListExpression
[ERROR] location: package org.apache.uima.ruta.expression.list
[ERROR] <https://builds.apache.org/job/UIMA-Ruta/ws/trunk/ruta-core/src/test/java/org/apache/uima/ruta/verbalizer/ConditionVerbalizerTest.java>:[60,44]
cannot find symbol
[ERROR] symbol:   class TypeListExpression
[ERROR] location: package org.apache.uima.ruta.expression.list
[ERROR] <https://builds.apache.org/job/UIMA-Ruta/ws/trunk/ruta-core/src/test/java/org/apache/uima/ruta/verbalizer/ExpressionVerbalizerTest.java>:[182,5]
cannot find symbol
[ERROR] symbol:   class StringListExpression
[ERROR] location: class org.apache.uima.ruta.verbalizer.ExpressionVerbalizerTest
[ERROR] <https://builds.apache.org/job/UIMA-Ruta/ws/trunk/ruta-core/src/test/java/org/apache/uima/ruta/verbalizer/ExpressionVerbalizerTest.java>:[182,37]
cannot find symbol
[ERROR] symbol:   class SimpleStringListExpression
[ERROR] location: class org.apache.uima.ruta.verbalizer.ExpressionVerbalizerTest
[ERROR] <https://builds.apache.org/job/UIMA-Ruta/ws/trunk/ruta-core/src/test/java/org/apache/uima/ruta/verbalizer/ExpressionVerbalizerTest.java>:[183,5]
cannot find symbol
[ERROR] symbol:   class StringListExpression
[ERROR] location: class org.apache.uima.ruta.verbalizer.ExpressionVerbalizerTest
[ERROR] <https://builds.apache.org/job/UIMA-Ruta/ws/trunk/ruta-core/src/test/java/org/apache/uima/ruta/verbalizer/ExpressionVerbalizerTest.java>:[183,37]
cannot find symbol
[ERROR] symbol:   class StringListVariableExpression
[ERROR] location: class org.apache.uima.ruta.verbalizer.ExpressionVerbalizerTest
[ERROR] <https://builds.apache.org/job/UIMA-Ruta/ws/trunk/ruta-core/src/test/java/org/apache/uima/ruta/verbalizer/ExpressionVerbalizerTest.java>:[192,5]
cannot find symbol
[ERROR] symbol:   class BooleanListExpression
[ERROR] location: class org.apache.uima.ruta.verbalizer.ExpressionVerbalizerTest
[ERROR] <https://builds.apache.org/job/UIMA-Ruta/ws/trunk/ruta-core/src/test/java/org/apache/uima/ruta/verbalizer/ExpressionVerbalizerTest.java>:[192,38]
cannot find symbol
[ERROR] symbol:   class SimpleBooleanListExpression
[ERROR] location: class org.apache.uima.ruta.verbalizer.ExpressionVerbalizerTest
[ERROR] <https://builds.apache.org/job/UIMA-Ruta/ws/trunk/ruta-core/src/test/java/org/apache/uima/ruta/verbalizer/ExpressionVerbalizerTest.java>:[193,5]
cannot find symbol
[ERROR] symbol:   class BooleanListExpression
[ERROR] location: class org.apache.uima.ruta.verbalizer.ExpressionVerbalizerTest
[ERROR] <https://builds.apache.org/job/UIMA-Ruta/ws/trunk/ruta-core/src/test/java/org/apache/uima/ruta/verbalizer/ExpressionVerbalizerTest.java>:[193,38]
cannot find symbol
[ERROR] symbol:   class BooleanListVariableExpression
[ERROR] location: class org.apache.uima.ruta.verbalizer.ExpressionVerbalizerTest
[ERROR] <https://builds.apache.org/job/UIMA-Ruta/ws/trunk/ruta-core/src/test/java/org/apache/uima/ruta/verbalizer/ExpressionVerbalizerTest.java>:[202,5]
cannot find symbol
[ERROR] symbol:   class NumberListExpression
[ERROR] location: class org.apache.uima.ruta.verbalizer.ExpressionVerbalizerTest
[ERROR] <https://builds.apache.org/job/UIMA-Ruta/ws/trunk/ruta-core/src/test/java/org/apache/uima/ruta/verbalizer/ExpressionVerbalizerTest.java>:[202,37]
cannot find symbol
[ERROR] symbol:   class SimpleNumberListExpression
[ERROR] location: class org.apache.uima.ruta.verbalizer.ExpressionVerbalizerTest
[ERROR] <https://builds.apache.org/job/UIMA-Ruta/ws/trunk/ruta-core/src/test/java/org/apache/uima/ruta/verbalizer/ExpressionVerbalizerTest.java>:[203,5]
cannot find symbol
[ERROR] symbol:   class NumberListExpression
[ERROR] location: class org.apache.uima.ruta.verbalizer.ExpressionVerbalizerTest
[ERROR] <https://builds.apache.org/job/UIMA-Ruta/ws/trunk/ruta-core/src/test/java/org/apache/uima/ruta/verbalizer/ExpressionVerbalizerTest.java>:[203,37]
cannot find symbol
[ERROR] symbol:   class NumberListVariableExpression
[ERROR] location: class org.apache.uima.ruta.verbalizer.ExpressionVerbalizerTest
[ERROR] <https://builds.apache.org/job/UIMA-Ruta/ws/trunk/ruta-core/src/test/java/org/apache/uima/ruta/verbalizer/ExpressionVerbalizerTest.java>:[212,5]
cannot find symbol
[ERROR] symbol:   class TypeListExpression
[ERROR] location: class org.apache.uima.ruta.verbalizer.ExpressionVerbalizerTest
[ERROR] <https://builds.apache.org/job/UIMA-Ruta/ws/trunk/ruta-core/src/test/java/org/apache/uima/ruta/verbalizer/ExpressionVerbalizerTest.java>:[212,35]
cannot find symbol
[ERROR] symbol:   class SimpleTypeListExpression
[ERROR] location: class org.apache.uima.ruta.verbalizer.ExpressionVerbalizerTest
[ERROR] <https://builds.apache.org/job/UIMA-Ruta/ws/trunk/ruta-core/src/test/java/org/apache/uima/ruta/verbalizer/ExpressionVerbalizerTest.java>:[213,5]
cannot find symbol
[ERROR] symbol:   class TypeListExpression
[ERROR] location: class org.apache.uima.ruta.verbalizer.ExpressionVerbalizerTest
[ERROR] <https://builds.apache.org/job/UIMA-Ruta/ws/trunk/ruta-core/src/test/java/org/apache/uima/ruta/verbalizer/ExpressionVerbalizerTest.java>:[213,35]
cannot find symbol
[ERROR] symbol:   class TypeListVariableExpression
[ERROR] location: class org.apache.uima.ruta.verbalizer.ExpressionVerbalizerTest
[ERROR] <https://builds.apache.org/job/UIMA-Ruta/ws/trunk/ruta-core/src/test/java/org/apache/uima/ruta/verbalizer/ActionVerbalizerTest.java>:[111,5]
cannot find symbol
[ERROR] symbol:   class TypeListExpression
[ERROR] location: class org.apache.uima.ruta.verbalizer.ActionVerbalizerTest
[ERROR] <https://builds.apache.org/job/UIMA-Ruta/ws/trunk/ruta-core/src/test/java/org/apache/uima/ruta/verbalizer/ActionVerbalizerTest.java>:[111,43]
cannot find symbol
[ERROR] symbol:   class SimpleTypeListExpression
[ERROR] location: class org.apache.uima.ruta.verbalizer.ActionVerbalizerTest
[ERROR] <https://builds.apache.org/job/UIMA-Ruta/ws/trunk/ruta-core/src/test/java/org/apache/uima/ruta/verbalizer/ActionVerbalizerTest.java>:[112,5]
cannot find symbol
[ERROR] symbol:   class StringListExpression
[ERROR] location: class org.apache.uima.ruta.verbalizer.ActionVerbalizerTest
[ERROR] <https://builds.apache.org/job/UIMA-Ruta/ws/trunk/ruta-core/src/test/java/org/apache/uima/ruta/verbalizer/ActionVerbalizerTest.java>:[112,47]
cannot find symbol
[ERROR] symbol:   class SimpleStringListExpression
[ERROR] location: class org.apache.uima.ruta.verbalizer.ActionVerbalizerTest
[ERROR] <https://builds.apache.org/job/UIMA-Ruta/ws/trunk/ruta-core/src/test/java/org/apache/uima/ruta/verbalizer/ActionVerbalizerTest.java>:[117,35]
cannot find symbol
[ERROR] symbol:   class SimpleTypeListExpression
[ERROR] location: class org.apache.uima.ruta.verbalizer.ActionVerbalizerTest
[ERROR] <https://builds.apache.org/job/UIMA-Ruta/ws/trunk/ruta-core/src/test/java/org/apache/uima/ruta/verbalizer/ConditionVerbalizerTest.java>:[90,5]
cannot find symbol
[ERROR] symbol:   class TypeListExpression
[ERROR] location: class org.apache.uima.ruta.verbalizer.ConditionVerbalizerTest
[ERROR] <https://builds.apache.org/job/UIMA-Ruta/ws/trunk/ruta-core/src/test/java/org/apache/uima/ruta/verbalizer/ConditionVerbalizerTest.java>:[90,43]
cannot find symbol
[ERROR] symbol:   class SimpleTypeListExpression
[ERROR] location: class org.apache.uima.ruta.verbalizer.ConditionVerbalizerTest
[ERROR] <https://builds.apache.org/job/UIMA-Ruta/ws/trunk/ruta-core/src/test/java/org/apache/uima/ruta/verbalizer/ConditionVerbalizerTest.java>:[91,5]
cannot find symbol
[ERROR] symbol:   class StringListExpression
[ERROR] location: class org.apache.uima.ruta.verbalizer.ConditionVerbalizerTest
[ERROR] <https://builds.apache.org/job/UIMA-Ruta/ws/trunk/ruta-core/src/test/java/org/apache/uima/ruta/verbalizer/ConditionVerbalizerTest.java>:[91,47]
cannot find symbol
[ERROR] symbol:   class SimpleStringListExpression
[ERROR] location: class org.apache.uima.ruta.verbalizer.ConditionVerbalizerTest
[ERROR] -> [Help 1]
[ERROR] 
[ERROR] To see the full stack trace of the errors, re-run Maven with the -e switch.
[ERROR] Re-run Maven using the -X switch to enable full debug logging.
[ERROR] 
[ERROR] For more information about the errors and possible solutions, please read the following
articles:
[ERROR] [Help 1] http://cwiki.apache.org/confluence/display/MAVEN/MojoFailureException
[ERROR] 
[ERROR] After correcting the problems, you can resume the build with the command
[ERROR]   mvn <goals> -rf :ruta-core
[JENKINS] Archiving <https://builds.apache.org/job/UIMA-Ruta/ws/trunk/ruta-ep-textruler/pom.xml>
to org.apache.uima/ruta-ep-textruler/2.4.0-SNAPSHOT/ruta-ep-textruler-2.4.0-SNAPSHOT.pom
[JENKINS] Archiving <https://builds.apache.org/job/UIMA-Ruta/ws/trunk/example-projects/ruta-maven-example/pom.xml>
to org.apache.uima/ruta-maven-example/2.4.0-SNAPSHOT/ruta-maven-example-2.4.0-SNAPSHOT.pom
[JENKINS] Archiving <https://builds.apache.org/job/UIMA-Ruta/ws/trunk/ruta-eclipse-feature/pom.xml>
to org.apache.uima/ruta-eclipse-feature/2.4.0-SNAPSHOT/ruta-eclipse-feature-2.4.0-SNAPSHOT.pom
[JENKINS] Archiving <https://builds.apache.org/job/UIMA-Ruta/ws/trunk/ruta-docbook/pom.xml>
to org.apache.uima/ruta-docbook/2.4.0-SNAPSHOT/ruta-docbook-2.4.0-SNAPSHOT.pom
[JENKINS] Archiving <https://builds.apache.org/job/UIMA-Ruta/ws/trunk/example-projects/ruta-ep-example-extensions/pom.xml>
to org.apache.uima/ruta-ep-example-extensions/2.4.0-SNAPSHOT/ruta-ep-example-extensions-2.4.0-SNAPSHOT.pom
[JENKINS] Archiving <https://builds.apache.org/job/UIMA-Ruta/ws/trunk/ruta-ep-core-ext/pom.xml>
to org.apache.uima/ruta-ep-core-ext/2.4.0-SNAPSHOT/ruta-ep-core-ext-2.4.0-SNAPSHOT.pom
[JENKINS] Archiving <https://builds.apache.org/job/UIMA-Ruta/ws/trunk/ruta-core/pom.xml>
to org.apache.uima/ruta-core/2.4.0-SNAPSHOT/ruta-core-2.4.0-SNAPSHOT.pom
[JENKINS] Archiving <https://builds.apache.org/job/UIMA-Ruta/ws/trunk/ruta-parent/pom.xml>
to org.apache.uima/ruta-parent/2.4.0-SNAPSHOT/ruta-parent-2.4.0-SNAPSHOT.pom
[JENKINS] Archiving <https://builds.apache.org/job/UIMA-Ruta/ws/trunk/ruta-ep-caseditor/pom.xml>
to org.apache.uima/ruta-ep-caseditor/2.4.0-SNAPSHOT/ruta-ep-caseditor-2.4.0-SNAPSHOT.pom
[JENKINS] Archiving <https://builds.apache.org/job/UIMA-Ruta/ws/trunk/ruta-ep-ide/pom.xml>
to org.apache.uima/ruta-ep-ide/2.4.0-SNAPSHOT/ruta-ep-ide-2.4.0-SNAPSHOT.pom
[JENKINS] Archiving <https://builds.apache.org/job/UIMA-Ruta/ws/trunk/ruta-ep-addons/pom.xml>
to org.apache.uima/ruta-ep-addons/2.4.0-SNAPSHOT/ruta-ep-addons-2.4.0-SNAPSHOT.pom
[JENKINS] Archiving <https://builds.apache.org/job/UIMA-Ruta/ws/trunk/ruta-maven-plugin/pom.xml>
to org.apache.uima/ruta-maven-plugin/2.4.0-SNAPSHOT/ruta-maven-plugin-2.4.0-SNAPSHOT.pom
[JENKINS] Archiving <https://builds.apache.org/job/UIMA-Ruta/ws/trunk/pom.xml> to org.apache.uima/ruta/2.4.0-SNAPSHOT/ruta-2.4.0-SNAPSHOT.pom
[JENKINS] Archiving <https://builds.apache.org/job/UIMA-Ruta/ws/trunk/ruta-ep-engine/pom.xml>
to org.apache.uima/ruta-ep-engine/2.4.0-SNAPSHOT/ruta-ep-engine-2.4.0-SNAPSHOT.pom
[JENKINS] Archiving <https://builds.apache.org/job/UIMA-Ruta/ws/trunk/ruta-core-ext/pom.xml>
to org.apache.uima/ruta-core-ext/2.4.0-SNAPSHOT/ruta-core-ext-2.4.0-SNAPSHOT.pom
[JENKINS] Archiving <https://builds.apache.org/job/UIMA-Ruta/ws/trunk/ruta-ep-ide-ui/pom.xml>
to org.apache.uima/ruta-ep-ide-ui/2.4.0-SNAPSHOT/ruta-ep-ide-ui-2.4.0-SNAPSHOT.pom
Sending e-mails to: dev@uima.apache.org
channel stopped
[WARNINGS] Skipping publisher since build result is FAILURE
Skipping Cobertura coverage report as build was not UNSTABLE or better ...

Mime
View raw message