uima-dev mailing list archives

Site index · List index
Message view « Date » · « Thread »
Top « Date » · « Thread »
From Apache Jenkins Server <jenk...@builds.apache.org>
Subject Build failed in Jenkins: UIMA-Ruta » Apache UIMA Ruta: ruta-core #667
Date Tue, 12 Jan 2016 13:58:44 GMT
See <https://builds.apache.org/job/UIMA-Ruta/org.apache.uima$ruta-core/667/changes>

Changes:

[pkluegl] UIMA-4734
- refactoring of list expressions

------------------------------------------
[...truncated 69 lines...]
[INFO] JCasGen: Found descriptor '<https://builds.apache.org/job/UIMA-Ruta/org.apache.uima$ruta-core/ws/src/main/resources/org/apache/uima/ruta/engine/PlainTextTypeSystem.xml'>
[INFO] JCasGen: Limiting generation to descriptors in '<https://builds.apache.org/job/UIMA-Ruta/org.apache.uima$ruta-core/ws/'>
[INFO] JCasGen: Output going to '<https://builds.apache.org/job/UIMA-Ruta/org.apache.uima$ruta-core/ws/target/generated-sources/jcasgen'>
[INFO] JCasGen: Reading the XML TAE descriptor, and creating types, for xml input file '<https://builds.apache.org/job/UIMA-Ruta/org.apache.uima$ruta-core/ws/target/jcasgen/typesystem.xml'.>
[INFO] JCasGen: Creating: 'org.apache.uima.ruta.type.AnyLine'.
[INFO] JCasGen: Creating: 'org.apache.uima.ruta.type.AnyLine_Type'.
[INFO] JCasGen: Creating: 'org.apache.uima.ruta.type.EmptyLine'.
[INFO] JCasGen: Creating: 'org.apache.uima.ruta.type.EmptyLine_Type'.
[INFO] JCasGen: Creating: 'org.apache.uima.ruta.type.Line'.
[INFO] JCasGen: Creating: 'org.apache.uima.ruta.type.Line_Type'.
[INFO] JCasGen: Creating: 'org.apache.uima.ruta.type.Paragraph'.
[INFO] JCasGen: Creating: 'org.apache.uima.ruta.type.Paragraph_Type'.
[INFO] JCasGen: Creating: 'org.apache.uima.ruta.type.WSLine'.
[INFO] JCasGen: Creating: 'org.apache.uima.ruta.type.WSLine_Type'.
[INFO] JCasGen: Creating: 'org.apache.uima.ruta.type.html.A'.
[INFO] JCasGen: Creating: 'org.apache.uima.ruta.type.html.A_Type'.
[INFO] JCasGen: Creating: 'org.apache.uima.ruta.type.html.B'.
[INFO] JCasGen: Creating: 'org.apache.uima.ruta.type.html.B_Type'.
[INFO] JCasGen: Creating: 'org.apache.uima.ruta.type.html.BIG'.
[INFO] JCasGen: Creating: 'org.apache.uima.ruta.type.html.BIG_Type'.
[INFO] JCasGen: Creating: 'org.apache.uima.ruta.type.html.BODY'.
[INFO] JCasGen: Creating: 'org.apache.uima.ruta.type.html.BODY_Type'.
[INFO] JCasGen: Creating: 'org.apache.uima.ruta.type.html.BR'.
[INFO] JCasGen: Creating: 'org.apache.uima.ruta.type.html.BR_Type'.
[INFO] JCasGen: Creating: 'org.apache.uima.ruta.type.html.COMMENT'.
[INFO] JCasGen: Creating: 'org.apache.uima.ruta.type.html.COMMENT_Type'.
[INFO] JCasGen: Creating: 'org.apache.uima.ruta.type.html.DIV'.
[INFO] JCasGen: Creating: 'org.apache.uima.ruta.type.html.DIV_Type'.
[INFO] JCasGen: Creating: 'org.apache.uima.ruta.type.html.EM'.
[INFO] JCasGen: Creating: 'org.apache.uima.ruta.type.html.EM_Type'.
[INFO] JCasGen: Creating: 'org.apache.uima.ruta.type.html.FONT'.
[INFO] JCasGen: Creating: 'org.apache.uima.ruta.type.html.FONT_Type'.
[INFO] JCasGen: Creating: 'org.apache.uima.ruta.type.html.FORM'.
[INFO] JCasGen: Creating: 'org.apache.uima.ruta.type.html.FORM_Type'.
[INFO] JCasGen: Creating: 'org.apache.uima.ruta.type.html.H1'.
[INFO] JCasGen: Creating: 'org.apache.uima.ruta.type.html.H1_Type'.
[INFO] JCasGen: Creating: 'org.apache.uima.ruta.type.html.H2'.
[INFO] JCasGen: Creating: 'org.apache.uima.ruta.type.html.H2_Type'.
[INFO] JCasGen: Creating: 'org.apache.uima.ruta.type.html.H3'.
[INFO] JCasGen: Creating: 'org.apache.uima.ruta.type.html.H3_Type'.
[INFO] JCasGen: Creating: 'org.apache.uima.ruta.type.html.H4'.
[INFO] JCasGen: Creating: 'org.apache.uima.ruta.type.html.H4_Type'.
[INFO] JCasGen: Creating: 'org.apache.uima.ruta.type.html.H5'.
[INFO] JCasGen: Creating: 'org.apache.uima.ruta.type.html.H5_Type'.
[INFO] JCasGen: Creating: 'org.apache.uima.ruta.type.html.H6'.
[INFO] JCasGen: Creating: 'org.apache.uima.ruta.type.html.H6_Type'.
[INFO] JCasGen: Creating: 'org.apache.uima.ruta.type.html.HEAD'.
[INFO] JCasGen: Creating: 'org.apache.uima.ruta.type.html.HEAD_Type'.
[INFO] JCasGen: Creating: 'org.apache.uima.ruta.type.html.HTML'.
[INFO] JCasGen: Creating: 'org.apache.uima.ruta.type.html.HTML_Type'.
[INFO] JCasGen: Creating: 'org.apache.uima.ruta.type.html.I'.
[INFO] JCasGen: Creating: 'org.apache.uima.ruta.type.html.I_Type'.
[INFO] JCasGen: Creating: 'org.apache.uima.ruta.type.html.IMG'.
[INFO] JCasGen: Creating: 'org.apache.uima.ruta.type.html.IMG_Type'.
[INFO] JCasGen: Creating: 'org.apache.uima.ruta.type.html.INPUT'.
[INFO] JCasGen: Creating: 'org.apache.uima.ruta.type.html.INPUT_Type'.
[INFO] JCasGen: Creating: 'org.apache.uima.ruta.type.html.LI'.
[INFO] JCasGen: Creating: 'org.apache.uima.ruta.type.html.LI_Type'.
[INFO] JCasGen: Creating: 'org.apache.uima.ruta.type.html.LINK'.
[INFO] JCasGen: Creating: 'org.apache.uima.ruta.type.html.LINK_Type'.
[INFO] JCasGen: Creating: 'org.apache.uima.ruta.type.html.META'.
[INFO] JCasGen: Creating: 'org.apache.uima.ruta.type.html.META_Type'.
[INFO] JCasGen: Creating: 'org.apache.uima.ruta.type.html.OL'.
[INFO] JCasGen: Creating: 'org.apache.uima.ruta.type.html.OL_Type'.
[INFO] JCasGen: Creating: 'org.apache.uima.ruta.type.html.P'.
[INFO] JCasGen: Creating: 'org.apache.uima.ruta.type.html.P_Type'.
[INFO] JCasGen: Creating: 'org.apache.uima.ruta.type.html.REMARK'.
[INFO] JCasGen: Creating: 'org.apache.uima.ruta.type.html.REMARK_Type'.
[INFO] JCasGen: Creating: 'org.apache.uima.ruta.type.html.SCRIPT'.
[INFO] JCasGen: Creating: 'org.apache.uima.ruta.type.html.SCRIPT_Type'.
[INFO] JCasGen: Creating: 'org.apache.uima.ruta.type.html.SMALL'.
[INFO] JCasGen: Creating: 'org.apache.uima.ruta.type.html.SMALL_Type'.
[INFO] JCasGen: Creating: 'org.apache.uima.ruta.type.html.SPAN'.
[INFO] JCasGen: Creating: 'org.apache.uima.ruta.type.html.SPAN_Type'.
[INFO] JCasGen: Creating: 'org.apache.uima.ruta.type.html.STYLE'.
[INFO] JCasGen: Creating: 'org.apache.uima.ruta.type.html.STYLE_Type'.
[INFO] JCasGen: Creating: 'org.apache.uima.ruta.type.html.TABLE'.
[INFO] JCasGen: Creating: 'org.apache.uima.ruta.type.html.TABLE_Type'.
[INFO] JCasGen: Creating: 'org.apache.uima.ruta.type.html.TAG'.
[INFO] JCasGen: Creating: 'org.apache.uima.ruta.type.html.TAG_Type'.
[INFO] JCasGen: Creating: 'org.apache.uima.ruta.type.html.TBODY'.
[INFO] JCasGen: Creating: 'org.apache.uima.ruta.type.html.TBODY_Type'.
[INFO] JCasGen: Creating: 'org.apache.uima.ruta.type.html.TD'.
[INFO] JCasGen: Creating: 'org.apache.uima.ruta.type.html.TD_Type'.
[INFO] JCasGen: Creating: 'org.apache.uima.ruta.type.html.TH'.
[INFO] JCasGen: Creating: 'org.apache.uima.ruta.type.html.TH_Type'.
[INFO] JCasGen: Creating: 'org.apache.uima.ruta.type.html.TITLE'.
[INFO] JCasGen: Creating: 'org.apache.uima.ruta.type.html.TITLE_Type'.
[INFO] JCasGen: Creating: 'org.apache.uima.ruta.type.html.TR'.
[INFO] JCasGen: Creating: 'org.apache.uima.ruta.type.html.TR_Type'.
[INFO] JCasGen: Creating: 'org.apache.uima.ruta.type.html.U'.
[INFO] JCasGen: Creating: 'org.apache.uima.ruta.type.html.U_Type'.
[INFO] JCasGen: Creating: 'org.apache.uima.ruta.type.html.UL'.
[INFO] JCasGen: Creating: 'org.apache.uima.ruta.type.html.UL_Type'.
[INFO] 
[INFO] --- maven-compiler-plugin:3.1:compile (default-compile) @ ruta-core ---
[INFO] Changes detected - recompiling the module!
[INFO] Compiling 480 source files to <https://builds.apache.org/job/UIMA-Ruta/org.apache.uima$ruta-core/ws/target/classes>
[WARNING] <https://builds.apache.org/job/UIMA-Ruta/org.apache.uima$ruta-core/ws/target/generated-sources/antlr3/org/apache/uima/ruta/parser/RutaParser.java>:
<https://builds.apache.org/job/UIMA-Ruta/org.apache.uima$ruta-core/ws/target/generated-sources/antlr3/org/apache/uima/ruta/parser/RutaParser.java>
uses unchecked or unsafe operations.
[WARNING] <https://builds.apache.org/job/UIMA-Ruta/org.apache.uima$ruta-core/ws/target/generated-sources/antlr3/org/apache/uima/ruta/parser/RutaParser.java>:
Recompile with -Xlint:unchecked for details.
[INFO] 
[INFO] --- maven-resources-plugin:2.6:testResources (default-testResources) @ ruta-core ---
[INFO] Using 'UTF-8' encoding to copy filtered resources.
[INFO] Copying 235 resources
[INFO] Copying 3 resources
[INFO] 
[INFO] --- maven-compiler-plugin:3.1:testCompile (default-testCompile) @ ruta-core ---
[INFO] Changes detected - recompiling the module!
[INFO] Compiling 159 source files to <https://builds.apache.org/job/UIMA-Ruta/org.apache.uima$ruta-core/ws/target/test-classes>
[INFO] -------------------------------------------------------------
[ERROR] COMPILATION ERROR : 
[INFO] -------------------------------------------------------------
[ERROR] <https://builds.apache.org/job/UIMA-Ruta/org.apache.uima$ruta-core/ws/src/test/java/org/apache/uima/ruta/verbalizer/ExpressionVerbalizerTest.java>:[32,44]
cannot find symbol
  symbol:   class BooleanListExpression
  location: package org.apache.uima.ruta.expression.list
[ERROR] <https://builds.apache.org/job/UIMA-Ruta/org.apache.uima$ruta-core/ws/src/test/java/org/apache/uima/ruta/verbalizer/ExpressionVerbalizerTest.java>:[33,44]
cannot find symbol
  symbol:   class BooleanListVariableExpression
  location: package org.apache.uima.ruta.expression.list
[ERROR] <https://builds.apache.org/job/UIMA-Ruta/org.apache.uima$ruta-core/ws/src/test/java/org/apache/uima/ruta/verbalizer/ExpressionVerbalizerTest.java>:[34,44]
cannot find symbol
  symbol:   class NumberListExpression
  location: package org.apache.uima.ruta.expression.list
[ERROR] <https://builds.apache.org/job/UIMA-Ruta/org.apache.uima$ruta-core/ws/src/test/java/org/apache/uima/ruta/verbalizer/ExpressionVerbalizerTest.java>:[35,44]
cannot find symbol
  symbol:   class NumberListVariableExpression
  location: package org.apache.uima.ruta.expression.list
[ERROR] <https://builds.apache.org/job/UIMA-Ruta/org.apache.uima$ruta-core/ws/src/test/java/org/apache/uima/ruta/verbalizer/ExpressionVerbalizerTest.java>:[36,44]
cannot find symbol
  symbol:   class SimpleBooleanListExpression
  location: package org.apache.uima.ruta.expression.list
[ERROR] <https://builds.apache.org/job/UIMA-Ruta/org.apache.uima$ruta-core/ws/src/test/java/org/apache/uima/ruta/verbalizer/ExpressionVerbalizerTest.java>:[37,44]
cannot find symbol
  symbol:   class SimpleNumberListExpression
  location: package org.apache.uima.ruta.expression.list
[ERROR] <https://builds.apache.org/job/UIMA-Ruta/org.apache.uima$ruta-core/ws/src/test/java/org/apache/uima/ruta/verbalizer/ExpressionVerbalizerTest.java>:[38,44]
cannot find symbol
  symbol:   class SimpleStringListExpression
  location: package org.apache.uima.ruta.expression.list
[ERROR] <https://builds.apache.org/job/UIMA-Ruta/org.apache.uima$ruta-core/ws/src/test/java/org/apache/uima/ruta/verbalizer/ExpressionVerbalizerTest.java>:[39,44]
cannot find symbol
  symbol:   class SimpleTypeListExpression
  location: package org.apache.uima.ruta.expression.list
[ERROR] <https://builds.apache.org/job/UIMA-Ruta/org.apache.uima$ruta-core/ws/src/test/java/org/apache/uima/ruta/verbalizer/ExpressionVerbalizerTest.java>:[40,44]
cannot find symbol
  symbol:   class StringListExpression
  location: package org.apache.uima.ruta.expression.list
[ERROR] <https://builds.apache.org/job/UIMA-Ruta/org.apache.uima$ruta-core/ws/src/test/java/org/apache/uima/ruta/verbalizer/ExpressionVerbalizerTest.java>:[41,44]
cannot find symbol
  symbol:   class StringListVariableExpression
  location: package org.apache.uima.ruta.expression.list
[ERROR] <https://builds.apache.org/job/UIMA-Ruta/org.apache.uima$ruta-core/ws/src/test/java/org/apache/uima/ruta/verbalizer/ExpressionVerbalizerTest.java>:[42,44]
cannot find symbol
  symbol:   class TypeListExpression
  location: package org.apache.uima.ruta.expression.list
[ERROR] <https://builds.apache.org/job/UIMA-Ruta/org.apache.uima$ruta-core/ws/src/test/java/org/apache/uima/ruta/verbalizer/ExpressionVerbalizerTest.java>:[43,44]
cannot find symbol
  symbol:   class TypeListVariableExpression
  location: package org.apache.uima.ruta.expression.list
[ERROR] <https://builds.apache.org/job/UIMA-Ruta/org.apache.uima$ruta-core/ws/src/test/java/org/apache/uima/ruta/verbalizer/ActionVerbalizerTest.java>:[68,44]
cannot find symbol
  symbol:   class SimpleStringListExpression
  location: package org.apache.uima.ruta.expression.list
[ERROR] <https://builds.apache.org/job/UIMA-Ruta/org.apache.uima$ruta-core/ws/src/test/java/org/apache/uima/ruta/verbalizer/ActionVerbalizerTest.java>:[69,44]
cannot find symbol
  symbol:   class SimpleTypeListExpression
  location: package org.apache.uima.ruta.expression.list
[ERROR] <https://builds.apache.org/job/UIMA-Ruta/org.apache.uima$ruta-core/ws/src/test/java/org/apache/uima/ruta/verbalizer/ActionVerbalizerTest.java>:[70,44]
cannot find symbol
  symbol:   class StringListExpression
  location: package org.apache.uima.ruta.expression.list
[ERROR] <https://builds.apache.org/job/UIMA-Ruta/org.apache.uima$ruta-core/ws/src/test/java/org/apache/uima/ruta/verbalizer/ActionVerbalizerTest.java>:[71,44]
cannot find symbol
  symbol:   class TypeListExpression
  location: package org.apache.uima.ruta.expression.list
[ERROR] <https://builds.apache.org/job/UIMA-Ruta/org.apache.uima$ruta-core/ws/src/test/java/org/apache/uima/ruta/verbalizer/ConditionVerbalizerTest.java>:[57,44]
cannot find symbol
  symbol:   class SimpleStringListExpression
  location: package org.apache.uima.ruta.expression.list
[ERROR] <https://builds.apache.org/job/UIMA-Ruta/org.apache.uima$ruta-core/ws/src/test/java/org/apache/uima/ruta/verbalizer/ConditionVerbalizerTest.java>:[58,44]
cannot find symbol
  symbol:   class SimpleTypeListExpression
  location: package org.apache.uima.ruta.expression.list
[ERROR] <https://builds.apache.org/job/UIMA-Ruta/org.apache.uima$ruta-core/ws/src/test/java/org/apache/uima/ruta/verbalizer/ConditionVerbalizerTest.java>:[59,44]
cannot find symbol
  symbol:   class StringListExpression
  location: package org.apache.uima.ruta.expression.list
[ERROR] <https://builds.apache.org/job/UIMA-Ruta/org.apache.uima$ruta-core/ws/src/test/java/org/apache/uima/ruta/verbalizer/ConditionVerbalizerTest.java>:[60,44]
cannot find symbol
  symbol:   class TypeListExpression
  location: package org.apache.uima.ruta.expression.list
[ERROR] <https://builds.apache.org/job/UIMA-Ruta/org.apache.uima$ruta-core/ws/src/test/java/org/apache/uima/ruta/verbalizer/ExpressionVerbalizerTest.java>:[182,5]
cannot find symbol
  symbol:   class StringListExpression
  location: class org.apache.uima.ruta.verbalizer.ExpressionVerbalizerTest
[ERROR] <https://builds.apache.org/job/UIMA-Ruta/org.apache.uima$ruta-core/ws/src/test/java/org/apache/uima/ruta/verbalizer/ExpressionVerbalizerTest.java>:[182,37]
cannot find symbol
  symbol:   class SimpleStringListExpression
  location: class org.apache.uima.ruta.verbalizer.ExpressionVerbalizerTest
[ERROR] <https://builds.apache.org/job/UIMA-Ruta/org.apache.uima$ruta-core/ws/src/test/java/org/apache/uima/ruta/verbalizer/ExpressionVerbalizerTest.java>:[183,5]
cannot find symbol
  symbol:   class StringListExpression
  location: class org.apache.uima.ruta.verbalizer.ExpressionVerbalizerTest
[ERROR] <https://builds.apache.org/job/UIMA-Ruta/org.apache.uima$ruta-core/ws/src/test/java/org/apache/uima/ruta/verbalizer/ExpressionVerbalizerTest.java>:[183,37]
cannot find symbol
  symbol:   class StringListVariableExpression
  location: class org.apache.uima.ruta.verbalizer.ExpressionVerbalizerTest
[ERROR] <https://builds.apache.org/job/UIMA-Ruta/org.apache.uima$ruta-core/ws/src/test/java/org/apache/uima/ruta/verbalizer/ExpressionVerbalizerTest.java>:[192,5]
cannot find symbol
  symbol:   class BooleanListExpression
  location: class org.apache.uima.ruta.verbalizer.ExpressionVerbalizerTest
[ERROR] <https://builds.apache.org/job/UIMA-Ruta/org.apache.uima$ruta-core/ws/src/test/java/org/apache/uima/ruta/verbalizer/ExpressionVerbalizerTest.java>:[192,38]
cannot find symbol
  symbol:   class SimpleBooleanListExpression
  location: class org.apache.uima.ruta.verbalizer.ExpressionVerbalizerTest
[ERROR] <https://builds.apache.org/job/UIMA-Ruta/org.apache.uima$ruta-core/ws/src/test/java/org/apache/uima/ruta/verbalizer/ExpressionVerbalizerTest.java>:[193,5]
cannot find symbol
  symbol:   class BooleanListExpression
  location: class org.apache.uima.ruta.verbalizer.ExpressionVerbalizerTest
[ERROR] <https://builds.apache.org/job/UIMA-Ruta/org.apache.uima$ruta-core/ws/src/test/java/org/apache/uima/ruta/verbalizer/ExpressionVerbalizerTest.java>:[193,38]
cannot find symbol
  symbol:   class BooleanListVariableExpression
  location: class org.apache.uima.ruta.verbalizer.ExpressionVerbalizerTest
[ERROR] <https://builds.apache.org/job/UIMA-Ruta/org.apache.uima$ruta-core/ws/src/test/java/org/apache/uima/ruta/verbalizer/ExpressionVerbalizerTest.java>:[202,5]
cannot find symbol
  symbol:   class NumberListExpression
  location: class org.apache.uima.ruta.verbalizer.ExpressionVerbalizerTest
[ERROR] <https://builds.apache.org/job/UIMA-Ruta/org.apache.uima$ruta-core/ws/src/test/java/org/apache/uima/ruta/verbalizer/ExpressionVerbalizerTest.java>:[202,37]
cannot find symbol
  symbol:   class SimpleNumberListExpression
  location: class org.apache.uima.ruta.verbalizer.ExpressionVerbalizerTest
[ERROR] <https://builds.apache.org/job/UIMA-Ruta/org.apache.uima$ruta-core/ws/src/test/java/org/apache/uima/ruta/verbalizer/ExpressionVerbalizerTest.java>:[203,5]
cannot find symbol
  symbol:   class NumberListExpression
  location: class org.apache.uima.ruta.verbalizer.ExpressionVerbalizerTest
[ERROR] <https://builds.apache.org/job/UIMA-Ruta/org.apache.uima$ruta-core/ws/src/test/java/org/apache/uima/ruta/verbalizer/ExpressionVerbalizerTest.java>:[203,37]
cannot find symbol
  symbol:   class NumberListVariableExpression
  location: class org.apache.uima.ruta.verbalizer.ExpressionVerbalizerTest
[ERROR] <https://builds.apache.org/job/UIMA-Ruta/org.apache.uima$ruta-core/ws/src/test/java/org/apache/uima/ruta/verbalizer/ExpressionVerbalizerTest.java>:[212,5]
cannot find symbol
  symbol:   class TypeListExpression
  location: class org.apache.uima.ruta.verbalizer.ExpressionVerbalizerTest
[ERROR] <https://builds.apache.org/job/UIMA-Ruta/org.apache.uima$ruta-core/ws/src/test/java/org/apache/uima/ruta/verbalizer/ExpressionVerbalizerTest.java>:[212,35]
cannot find symbol
  symbol:   class SimpleTypeListExpression
  location: class org.apache.uima.ruta.verbalizer.ExpressionVerbalizerTest
[ERROR] <https://builds.apache.org/job/UIMA-Ruta/org.apache.uima$ruta-core/ws/src/test/java/org/apache/uima/ruta/verbalizer/ExpressionVerbalizerTest.java>:[213,5]
cannot find symbol
  symbol:   class TypeListExpression
  location: class org.apache.uima.ruta.verbalizer.ExpressionVerbalizerTest
[ERROR] <https://builds.apache.org/job/UIMA-Ruta/org.apache.uima$ruta-core/ws/src/test/java/org/apache/uima/ruta/verbalizer/ExpressionVerbalizerTest.java>:[213,35]
cannot find symbol
  symbol:   class TypeListVariableExpression
  location: class org.apache.uima.ruta.verbalizer.ExpressionVerbalizerTest
[ERROR] <https://builds.apache.org/job/UIMA-Ruta/org.apache.uima$ruta-core/ws/src/test/java/org/apache/uima/ruta/verbalizer/ActionVerbalizerTest.java>:[111,5]
cannot find symbol
  symbol:   class TypeListExpression
  location: class org.apache.uima.ruta.verbalizer.ActionVerbalizerTest
[ERROR] <https://builds.apache.org/job/UIMA-Ruta/org.apache.uima$ruta-core/ws/src/test/java/org/apache/uima/ruta/verbalizer/ActionVerbalizerTest.java>:[111,43]
cannot find symbol
  symbol:   class SimpleTypeListExpression
  location: class org.apache.uima.ruta.verbalizer.ActionVerbalizerTest
[ERROR] <https://builds.apache.org/job/UIMA-Ruta/org.apache.uima$ruta-core/ws/src/test/java/org/apache/uima/ruta/verbalizer/ActionVerbalizerTest.java>:[112,5]
cannot find symbol
  symbol:   class StringListExpression
  location: class org.apache.uima.ruta.verbalizer.ActionVerbalizerTest
[ERROR] <https://builds.apache.org/job/UIMA-Ruta/org.apache.uima$ruta-core/ws/src/test/java/org/apache/uima/ruta/verbalizer/ActionVerbalizerTest.java>:[112,47]
cannot find symbol
  symbol:   class SimpleStringListExpression
  location: class org.apache.uima.ruta.verbalizer.ActionVerbalizerTest
[ERROR] <https://builds.apache.org/job/UIMA-Ruta/org.apache.uima$ruta-core/ws/src/test/java/org/apache/uima/ruta/verbalizer/ActionVerbalizerTest.java>:[117,35]
cannot find symbol
  symbol:   class SimpleTypeListExpression
  location: class org.apache.uima.ruta.verbalizer.ActionVerbalizerTest
[ERROR] <https://builds.apache.org/job/UIMA-Ruta/org.apache.uima$ruta-core/ws/src/test/java/org/apache/uima/ruta/verbalizer/ConditionVerbalizerTest.java>:[90,5]
cannot find symbol
  symbol:   class TypeListExpression
  location: class org.apache.uima.ruta.verbalizer.ConditionVerbalizerTest
[ERROR] <https://builds.apache.org/job/UIMA-Ruta/org.apache.uima$ruta-core/ws/src/test/java/org/apache/uima/ruta/verbalizer/ConditionVerbalizerTest.java>:[90,43]
cannot find symbol
  symbol:   class SimpleTypeListExpression
  location: class org.apache.uima.ruta.verbalizer.ConditionVerbalizerTest
[ERROR] <https://builds.apache.org/job/UIMA-Ruta/org.apache.uima$ruta-core/ws/src/test/java/org/apache/uima/ruta/verbalizer/ConditionVerbalizerTest.java>:[91,5]
cannot find symbol
  symbol:   class StringListExpression
  location: class org.apache.uima.ruta.verbalizer.ConditionVerbalizerTest
[ERROR] <https://builds.apache.org/job/UIMA-Ruta/org.apache.uima$ruta-core/ws/src/test/java/org/apache/uima/ruta/verbalizer/ConditionVerbalizerTest.java>:[91,47]
cannot find symbol
  symbol:   class SimpleStringListExpression
  location: class org.apache.uima.ruta.verbalizer.ConditionVerbalizerTest
[INFO] 45 errors 
[INFO] -------------------------------------------------------------

Mime
View raw message