uima-dev mailing list archives

Site index · List index
Message view « Date » · « Thread »
Top « Date » · « Thread »
From Apache Jenkins Server <jenk...@builds.apache.org>
Subject Build failed in Jenkins: UIMA-AS #398
Date Thu, 25 Feb 2016 17:31:17 GMT
See <https://builds.apache.org/job/UIMA-AS/398/changes>

Changes:

[cwiklik] UIMA-4806 Start broker in a foreground

[cwiklik] UIMA-4806 Start broker in a foreground

------------------------------------------
[...truncated 1982 lines...]
Downloading: http://repo1.maven.org/eclipse/org/apache/uima/uimaj-parent/2.8.1/uimaj-parent-2.8.1.pom
Downloading: http://repo1.maven.org/maven2/org/apache/uima/uimaj-parent/2.8.1/uimaj-parent-2.8.1.pom
Downloaded: http://repo1.maven.org/maven2/org/apache/uima/uimaj-parent/2.8.1/uimaj-parent-2.8.1.pom
(9 KB at 120.5 KB/sec)
Downloading: http://repo1.maven.org/eclipse/org/apache/uima/parent-pom/10/parent-pom-10.pom
Downloading: http://repo1.maven.org/maven2/org/apache/uima/parent-pom/10/parent-pom-10.pom
Downloaded: http://repo1.maven.org/maven2/org/apache/uima/parent-pom/10/parent-pom-10.pom
(112 KB at 802.1 KB/sec)
Downloading: http://repo1.maven.org/eclipse/org/apache/commons/commons-pool2/2.4.2/commons-pool2-2.4.2.pom
Downloading: http://repo1.maven.org/maven2/org/apache/commons/commons-pool2/2.4.2/commons-pool2-2.4.2.pom
Downloaded: http://repo1.maven.org/maven2/org/apache/commons/commons-pool2/2.4.2/commons-pool2-2.4.2.pom
(11 KB at 156.8 KB/sec)
Downloading: http://repo1.maven.org/eclipse/org/apache/commons/commons-parent/34/commons-parent-34.pom
Downloading: http://repo1.maven.org/maven2/org/apache/commons/commons-parent/34/commons-parent-34.pom
Downloaded: http://repo1.maven.org/maven2/org/apache/commons/commons-parent/34/commons-parent-34.pom
(55 KB at 479.2 KB/sec)
Downloading: http://repo1.maven.org/eclipse/com/thoughtworks/xstream/xstream/1.4.7/xstream-1.4.7.pom
Downloading: http://repo1.maven.org/maven2/com/thoughtworks/xstream/xstream/1.4.7/xstream-1.4.7.pom
Downloaded: http://repo1.maven.org/maven2/com/thoughtworks/xstream/xstream/1.4.7/xstream-1.4.7.pom
(11 KB at 156.8 KB/sec)
Downloading: http://repo1.maven.org/eclipse/com/thoughtworks/xstream/xstream-parent/1.4.7/xstream-parent-1.4.7.pom
Downloading: http://repo1.maven.org/maven2/com/thoughtworks/xstream/xstream-parent/1.4.7/xstream-parent-1.4.7.pom
Downloaded: http://repo1.maven.org/maven2/com/thoughtworks/xstream/xstream-parent/1.4.7/xstream-parent-1.4.7.pom
(26 KB at 278.6 KB/sec)
Downloading: http://repo1.maven.org/eclipse/org/codehaus/codehaus-parent/3/codehaus-parent-3.pom
Downloading: http://repo1.maven.org/maven2/org/codehaus/codehaus-parent/3/codehaus-parent-3.pom
Downloaded: http://repo1.maven.org/maven2/org/codehaus/codehaus-parent/3/codehaus-parent-3.pom
(5 KB at 59.0 KB/sec)
Downloading: http://repo1.maven.org/eclipse/xmlpull/xmlpull/1.1.3.1/xmlpull-1.1.3.1.pom
Downloading: http://repo1.maven.org/maven2/xmlpull/xmlpull/1.1.3.1/xmlpull-1.1.3.1.pom
Downloaded: http://repo1.maven.org/maven2/xmlpull/xmlpull/1.1.3.1/xmlpull-1.1.3.1.pom (386
B at 4.6 KB/sec)
Downloading: http://repo1.maven.org/eclipse/xpp3/xpp3_min/1.1.4c/xpp3_min-1.1.4c.pom
Downloading: http://repo1.maven.org/maven2/xpp3/xpp3_min/1.1.4c/xpp3_min-1.1.4c.pom
Downloaded: http://repo1.maven.org/maven2/xpp3/xpp3_min/1.1.4c/xpp3_min-1.1.4c.pom (2 KB at
22.5 KB/sec)
Downloading: http://repo1.maven.org/eclipse/org/apache/xmlbeans/xmlbeans/2.4.0/xmlbeans-2.4.0.pom
Downloading: http://repo1.maven.org/maven2/org/apache/xmlbeans/xmlbeans/2.4.0/xmlbeans-2.4.0.pom
Downloaded: http://repo1.maven.org/maven2/org/apache/xmlbeans/xmlbeans/2.4.0/xmlbeans-2.4.0.pom
(5 KB at 69.3 KB/sec)
Downloading: http://repo1.maven.org/eclipse/org/springframework/spring-core/3.2.11.RELEASE/spring-core-3.2.11.RELEASE.pom
Downloading: http://repo1.maven.org/maven2/org/springframework/spring-core/3.2.11.RELEASE/spring-core-3.2.11.RELEASE.pom
Downloaded: http://repo1.maven.org/maven2/org/springframework/spring-core/3.2.11.RELEASE/spring-core-3.2.11.RELEASE.pom
(3 KB at 29.6 KB/sec)
Downloading: http://repo1.maven.org/eclipse/commons-logging/commons-logging/1.1.3/commons-logging-1.1.3.pom
Downloading: http://repo1.maven.org/maven2/commons-logging/commons-logging/1.1.3/commons-logging-1.1.3.pom
Downloaded: http://repo1.maven.org/maven2/commons-logging/commons-logging/1.1.3/commons-logging-1.1.3.pom
(18 KB at 256.0 KB/sec)
Downloading: http://repo1.maven.org/eclipse/org/apache/commons/commons-parent/28/commons-parent-28.pom
Downloading: http://repo1.maven.org/maven2/org/apache/commons/commons-parent/28/commons-parent-28.pom
Downloaded: http://repo1.maven.org/maven2/org/apache/commons/commons-parent/28/commons-parent-28.pom
(49 KB at 425.9 KB/sec)
Downloading: http://repo1.maven.org/eclipse/org/springframework/spring-aop/3.2.11.RELEASE/spring-aop-3.2.11.RELEASE.pom
Downloading: http://repo1.maven.org/maven2/org/springframework/spring-aop/3.2.11.RELEASE/spring-aop-3.2.11.RELEASE.pom
Downloaded: http://repo1.maven.org/maven2/org/springframework/spring-aop/3.2.11.RELEASE/spring-aop-3.2.11.RELEASE.pom
(3 KB at 34.7 KB/sec)
Downloading: http://repo1.maven.org/eclipse/aopalliance/aopalliance/1.0/aopalliance-1.0.pom
Downloading: http://repo1.maven.org/maven2/aopalliance/aopalliance/1.0/aopalliance-1.0.pom
Downloaded: http://repo1.maven.org/maven2/aopalliance/aopalliance/1.0/aopalliance-1.0.pom
(363 B at 5.1 KB/sec)
Downloading: http://repo1.maven.org/eclipse/org/springframework/spring-beans/3.2.11.RELEASE/spring-beans-3.2.11.RELEASE.pom
Downloading: http://repo1.maven.org/maven2/org/springframework/spring-beans/3.2.11.RELEASE/spring-beans-3.2.11.RELEASE.pom
Downloaded: http://repo1.maven.org/maven2/org/springframework/spring-beans/3.2.11.RELEASE/spring-beans-3.2.11.RELEASE.pom
(2 KB at 27.2 KB/sec)
Downloading: http://repo1.maven.org/eclipse/org/springframework/spring-context/3.2.11.RELEASE/spring-context-3.2.11.RELEASE.pom
Downloading: http://repo1.maven.org/maven2/org/springframework/spring-context/3.2.11.RELEASE/spring-context-3.2.11.RELEASE.pom
Downloaded: http://repo1.maven.org/maven2/org/springframework/spring-context/3.2.11.RELEASE/spring-context-3.2.11.RELEASE.pom
(5 KB at 68.5 KB/sec)
Downloading: http://repo1.maven.org/eclipse/org/springframework/spring-expression/3.2.11.RELEASE/spring-expression-3.2.11.RELEASE.pom
Downloading: http://repo1.maven.org/maven2/org/springframework/spring-expression/3.2.11.RELEASE/spring-expression-3.2.11.RELEASE.pom
Downloaded: http://repo1.maven.org/maven2/org/springframework/spring-expression/3.2.11.RELEASE/spring-expression-3.2.11.RELEASE.pom
(2 KB at 21.9 KB/sec)
Downloading: http://repo1.maven.org/eclipse/org/springframework/spring-tx/3.2.11.RELEASE/spring-tx-3.2.11.RELEASE.pom
Downloading: http://repo1.maven.org/maven2/org/springframework/spring-tx/3.2.11.RELEASE/spring-tx-3.2.11.RELEASE.pom
Downloaded: http://repo1.maven.org/maven2/org/springframework/spring-tx/3.2.11.RELEASE/spring-tx-3.2.11.RELEASE.pom
(4 KB at 44.7 KB/sec)
Downloading: http://repo1.maven.org/eclipse/org/springframework/spring-jms/3.2.11.RELEASE/spring-jms-3.2.11.RELEASE.pom
Downloading: http://repo1.maven.org/maven2/org/springframework/spring-jms/3.2.11.RELEASE/spring-jms-3.2.11.RELEASE.pom
Downloaded: http://repo1.maven.org/maven2/org/springframework/spring-jms/3.2.11.RELEASE/spring-jms-3.2.11.RELEASE.pom
(4 KB at 51.2 KB/sec)
Downloading: http://repo1.maven.org/eclipse/org/apache/uima/uimaj-core/2.8.1/uimaj-core-2.8.1.jar
Downloading: http://repo1.maven.org/eclipse/org/apache/commons/commons-pool2/2.4.2/commons-pool2-2.4.2.jar
Downloading: http://repo1.maven.org/eclipse/xmlpull/xmlpull/1.1.3.1/xmlpull-1.1.3.1.jar
Downloading: http://repo1.maven.org/eclipse/com/thoughtworks/xstream/xstream/1.4.7/xstream-1.4.7.jar
Downloading: http://repo1.maven.org/eclipse/xpp3/xpp3_min/1.1.4c/xpp3_min-1.1.4c.jar
Downloading: http://repo1.maven.org/eclipse/org/apache/xmlbeans/xmlbeans/2.4.0/xmlbeans-2.4.0.jar
Downloading: http://repo1.maven.org/eclipse/org/springframework/spring-core/3.2.11.RELEASE/spring-core-3.2.11.RELEASE.jar
Downloading: http://repo1.maven.org/eclipse/commons-logging/commons-logging/1.1.3/commons-logging-1.1.3.jar
Downloading: http://repo1.maven.org/eclipse/org/springframework/spring-aop/3.2.11.RELEASE/spring-aop-3.2.11.RELEASE.jar
Downloading: http://repo1.maven.org/eclipse/aopalliance/aopalliance/1.0/aopalliance-1.0.jar
Downloading: http://repo1.maven.org/eclipse/org/springframework/spring-beans/3.2.11.RELEASE/spring-beans-3.2.11.RELEASE.jar
Downloading: http://repo1.maven.org/eclipse/org/springframework/spring-context/3.2.11.RELEASE/spring-context-3.2.11.RELEASE.jar
Downloading: http://repo1.maven.org/eclipse/org/springframework/spring-expression/3.2.11.RELEASE/spring-expression-3.2.11.RELEASE.jar
Downloading: http://repo1.maven.org/eclipse/org/springframework/spring-tx/3.2.11.RELEASE/spring-tx-3.2.11.RELEASE.jar
Downloading: http://repo1.maven.org/eclipse/org/springframework/spring-jms/3.2.11.RELEASE/spring-jms-3.2.11.RELEASE.jar
Downloading: http://repo1.maven.org/maven2/org/apache/uima/uimaj-core/2.8.1/uimaj-core-2.8.1.jar
Downloading: http://repo1.maven.org/maven2/org/apache/commons/commons-pool2/2.4.2/commons-pool2-2.4.2.jar
Downloading: http://repo1.maven.org/maven2/com/thoughtworks/xstream/xstream/1.4.7/xstream-1.4.7.jar
Downloading: http://repo1.maven.org/maven2/xmlpull/xmlpull/1.1.3.1/xmlpull-1.1.3.1.jar
Downloading: http://repo1.maven.org/maven2/xpp3/xpp3_min/1.1.4c/xpp3_min-1.1.4c.jar
Downloaded: http://repo1.maven.org/maven2/xmlpull/xmlpull/1.1.3.1/xmlpull-1.1.3.1.jar (8 KB
at 100.3 KB/sec)
Downloading: http://repo1.maven.org/maven2/org/apache/xmlbeans/xmlbeans/2.4.0/xmlbeans-2.4.0.jar
Downloaded: http://repo1.maven.org/maven2/xpp3/xpp3_min/1.1.4c/xpp3_min-1.1.4c.jar (25 KB
at 264.9 KB/sec)
Downloading: http://repo1.maven.org/maven2/org/springframework/spring-core/3.2.11.RELEASE/spring-core-3.2.11.RELEASE.jar
Downloaded: http://repo1.maven.org/maven2/org/apache/commons/commons-pool2/2.4.2/commons-pool2-2.4.2.jar
(110 KB at 786.7 KB/sec)
Downloading: http://repo1.maven.org/maven2/commons-logging/commons-logging/1.1.3/commons-logging-1.1.3.jar
Downloaded: http://repo1.maven.org/maven2/com/thoughtworks/xstream/xstream/1.4.7/xstream-1.4.7.jar
(520 KB at 2790.9 KB/sec)
Downloading: http://repo1.maven.org/maven2/org/springframework/spring-aop/3.2.11.RELEASE/spring-aop-3.2.11.RELEASE.jar
Downloaded: http://repo1.maven.org/maven2/commons-logging/commons-logging/1.1.3/commons-logging-1.1.3.jar
(61 KB at 1236.6 KB/sec)
Downloading: http://repo1.maven.org/maven2/aopalliance/aopalliance/1.0/aopalliance-1.0.jar
Downloaded: http://repo1.maven.org/maven2/aopalliance/aopalliance/1.0/aopalliance-1.0.jar
(5 KB at 89.0 KB/sec)
Downloading: http://repo1.maven.org/maven2/org/springframework/spring-beans/3.2.11.RELEASE/spring-beans-3.2.11.RELEASE.jar
Downloaded: http://repo1.maven.org/maven2/org/apache/uima/uimaj-core/2.8.1/uimaj-core-2.8.1.jar
(1533 KB at 6359.4 KB/sec)
Downloading: http://repo1.maven.org/maven2/org/springframework/spring-context/3.2.11.RELEASE/spring-context-3.2.11.RELEASE.jar
Downloaded: http://repo1.maven.org/maven2/org/springframework/spring-aop/3.2.11.RELEASE/spring-aop-3.2.11.RELEASE.jar
(331 KB at 4402.8 KB/sec)
Downloading: http://repo1.maven.org/maven2/org/springframework/spring-expression/3.2.11.RELEASE/spring-expression-3.2.11.RELEASE.jar
Downloaded: http://repo1.maven.org/maven2/org/springframework/spring-core/3.2.11.RELEASE/spring-core-3.2.11.RELEASE.jar
(865 KB at 4855.7 KB/sec)
Downloading: http://repo1.maven.org/maven2/org/springframework/spring-tx/3.2.11.RELEASE/spring-tx-3.2.11.RELEASE.jar
Downloaded: http://repo1.maven.org/maven2/org/springframework/spring-context/3.2.11.RELEASE/spring-context-3.2.11.RELEASE.jar
(847 KB at 11593.7 KB/sec)
Downloading: http://repo1.maven.org/maven2/org/springframework/spring-jms/3.2.11.RELEASE/spring-jms-3.2.11.RELEASE.jar
Downloaded: http://repo1.maven.org/maven2/org/apache/xmlbeans/xmlbeans/2.4.0/xmlbeans-2.4.0.jar
(2631 KB at 10738.4 KB/sec)
Downloaded: http://repo1.maven.org/maven2/org/springframework/spring-expression/3.2.11.RELEASE/spring-expression-3.2.11.RELEASE.jar
(192 KB at 3619.3 KB/sec)
Downloaded: http://repo1.maven.org/maven2/org/springframework/spring-tx/3.2.11.RELEASE/spring-tx-3.2.11.RELEASE.jar
(237 KB at 4386.0 KB/sec)
Downloaded: http://repo1.maven.org/maven2/org/springframework/spring-beans/3.2.11.RELEASE/spring-beans-3.2.11.RELEASE.jar
(599 KB at 4991.3 KB/sec)
Downloaded: http://repo1.maven.org/maven2/org/springframework/spring-jms/3.2.11.RELEASE/spring-jms-3.2.11.RELEASE.jar
(202 KB at 3663.2 KB/sec)
[INFO] 
[INFO] --- maven-clean-plugin:2.5:clean (default-clean) @ uimaj-as-core ---
[TASKS] Scanning folder '<https://builds.apache.org/job/UIMA-AS/ws/trunk/uimaj-as-core'>
for files matching the pattern '**/*.java' - excludes: 
[TASKS] Found 214 files to scan for tasks
Found 112 open tasks.
[TASKS] Computing warning deltas based on reference build #369
[INFO] 
[INFO] --- maven-enforcer-plugin:1.3.1:enforce (enforce-versions) @ uimaj-as-core ---
[INFO] 
[INFO] --- build-helper-maven-plugin:1.10:parse-version (parse-project-version) @ uimaj-as-core
---
Downloading: http://repo1.maven.org/maven2/junit/junit/4.12/junit-4.12.pom
Downloaded: http://repo1.maven.org/maven2/junit/junit/4.12/junit-4.12.pom (24 KB at 251.3
KB/sec)
Downloading: http://repo1.maven.org/maven2/org/codehaus/plexus/plexus-utils/3.0.22/plexus-utils-3.0.22.pom
Downloaded: http://repo1.maven.org/maven2/org/codehaus/plexus/plexus-utils/3.0.22/plexus-utils-3.0.22.pom
(4 KB at 79.6 KB/sec)
Downloading: http://repo1.maven.org/maven2/org/codehaus/plexus/plexus-utils/3.0.22/plexus-utils-3.0.22.jar
Downloaded: http://repo1.maven.org/maven2/org/codehaus/plexus/plexus-utils/3.0.22/plexus-utils-3.0.22.jar
(240 KB at 2079.6 KB/sec)
[INFO] 
[INFO] --- build-helper-maven-plugin:1.10:add-source (parse-version) @ uimaj-as-core ---
[INFO] Source directory: <https://builds.apache.org/job/UIMA-AS/ws/trunk/uimaj-as-core/target/generated-sources/releaseVersion>
added.
[INFO] 
[INFO] --- uima-build-helper-maven-plugin:7:parse-date-time (set buildYear and buildMonth)
@ uimaj-as-core ---
[INFO] 
[INFO] --- maven-resources-plugin:2.6:copy-resources (setVersions) @ uimaj-as-core ---
[INFO] Using 'UTF-8' encoding to copy filtered resources.
[INFO] Copying 1 resource
[INFO] 
[INFO] --- xmlbeans-maven-plugin:2.3.3:xmlbeans (gen-beans-id) @ uimaj-as-core ---
Downloading: http://repo1.maven.org/maven2/xml-resolver/xml-resolver/1.2/xml-resolver-1.2.pom
Downloaded: http://repo1.maven.org/maven2/xml-resolver/xml-resolver/1.2/xml-resolver-1.2.pom
(2 KB at 32.8 KB/sec)
Downloading: http://repo1.maven.org/maven2/xml-resolver/xml-resolver/1.2/xml-resolver-1.2.jar
Downloaded: http://repo1.maven.org/maven2/xml-resolver/xml-resolver/1.2/xml-resolver-1.2.jar
(83 KB at 1642.4 KB/sec)
[INFO] 
[INFO] --- maven-remote-resources-plugin:1.5:process (default) @ uimaj-as-core ---
[INFO] 
[INFO] --- maven-resources-plugin:2.6:resources (default-resources) @ uimaj-as-core ---
[INFO] Using 'UTF-8' encoding to copy filtered resources.
[INFO] Copying 1 resource
[INFO] Copying 172 resources
[INFO] Copying 3 resources
[INFO] 
[INFO] --- maven-compiler-plugin:3.1:compile (default-compile) @ uimaj-as-core ---
Downloading: http://repo1.maven.org/maven2/org/codehaus/plexus/plexus-utils/1.5.1/plexus-utils-1.5.1.pom
Downloaded: http://repo1.maven.org/maven2/org/codehaus/plexus/plexus-utils/1.5.1/plexus-utils-1.5.1.pom
(3 KB at 47.7 KB/sec)
Downloading: http://repo1.maven.org/maven2/org/apache/maven/maven-toolchain/1.0/maven-toolchain-1.0.pom
Downloaded: http://repo1.maven.org/maven2/org/apache/maven/maven-toolchain/1.0/maven-toolchain-1.0.pom
(4 KB at 70.9 KB/sec)
Downloading: http://repo1.maven.org/maven2/org/apache/maven/shared/maven-shared-utils/0.1/maven-shared-utils-0.1.pom
Downloaded: http://repo1.maven.org/maven2/org/apache/maven/shared/maven-shared-utils/0.1/maven-shared-utils-0.1.pom
(4 KB at 84.1 KB/sec)
Downloading: http://repo1.maven.org/maven2/org/apache/maven/shared/maven-shared-incremental/1.1/maven-shared-incremental-1.1.pom
Downloaded: http://repo1.maven.org/maven2/org/apache/maven/shared/maven-shared-incremental/1.1/maven-shared-incremental-1.1.pom
(5 KB at 98.5 KB/sec)
Downloading: http://repo1.maven.org/maven2/org/codehaus/plexus/plexus-compiler-api/2.2/plexus-compiler-api-2.2.pom
Downloaded: http://repo1.maven.org/maven2/org/codehaus/plexus/plexus-compiler-api/2.2/plexus-compiler-api-2.2.pom
(865 B at 18.0 KB/sec)
Downloading: http://repo1.maven.org/maven2/org/codehaus/plexus/plexus-compiler/2.2/plexus-compiler-2.2.pom
Downloaded: http://repo1.maven.org/maven2/org/codehaus/plexus/plexus-compiler/2.2/plexus-compiler-2.2.pom
(4 KB at 76.7 KB/sec)
Downloading: http://repo1.maven.org/maven2/org/codehaus/plexus/plexus-compiler-manager/2.2/plexus-compiler-manager-2.2.pom
Downloaded: http://repo1.maven.org/maven2/org/codehaus/plexus/plexus-compiler-manager/2.2/plexus-compiler-manager-2.2.pom
(690 B at 14.6 KB/sec)
Downloading: http://repo1.maven.org/maven2/org/codehaus/plexus/plexus-compiler-javac/2.2/plexus-compiler-javac-2.2.pom
Downloaded: http://repo1.maven.org/maven2/org/codehaus/plexus/plexus-compiler-javac/2.2/plexus-compiler-javac-2.2.pom
(769 B at 16.0 KB/sec)
Downloading: http://repo1.maven.org/maven2/org/codehaus/plexus/plexus-compilers/2.2/plexus-compilers-2.2.pom
Downloaded: http://repo1.maven.org/maven2/org/codehaus/plexus/plexus-compilers/2.2/plexus-compilers-2.2.pom
(2 KB at 25.2 KB/sec)
Downloading: http://repo1.maven.org/maven2/org/codehaus/plexus/plexus-utils/1.5.1/plexus-utils-1.5.1.jar
Downloading: http://repo1.maven.org/maven2/org/apache/maven/shared/maven-shared-utils/0.1/maven-shared-utils-0.1.jar
Downloading: http://repo1.maven.org/maven2/org/apache/maven/shared/maven-shared-incremental/1.1/maven-shared-incremental-1.1.jar
Downloading: http://repo1.maven.org/maven2/org/codehaus/plexus/plexus-compiler-api/2.2/plexus-compiler-api-2.2.jar
Downloading: http://repo1.maven.org/maven2/org/codehaus/plexus/plexus-compiler-manager/2.2/plexus-compiler-manager-2.2.jar
Downloaded: http://repo1.maven.org/maven2/org/codehaus/plexus/plexus-utils/1.5.1/plexus-utils-1.5.1.jar
(206 KB at 2939.2 KB/sec)
Downloading: http://repo1.maven.org/maven2/org/codehaus/plexus/plexus-compiler-javac/2.2/plexus-compiler-javac-2.2.jar
Downloaded: http://repo1.maven.org/maven2/org/codehaus/plexus/plexus-compiler-manager/2.2/plexus-compiler-manager-2.2.jar
(5 KB at 64.6 KB/sec)
Downloading: http://repo1.maven.org/maven2/com/google/collections/google-collections/1.0/google-collections-1.0.jar
Downloaded: http://repo1.maven.org/maven2/org/apache/maven/shared/maven-shared-incremental/1.1/maven-shared-incremental-1.1.jar
(14 KB at 145.3 KB/sec)
Downloading: http://repo1.maven.org/maven2/junit/junit/3.8.2/junit-3.8.2.jar
Downloaded: http://repo1.maven.org/maven2/org/codehaus/plexus/plexus-compiler-api/2.2/plexus-compiler-api-2.2.jar
(25 KB at 265.3 KB/sec)
Downloaded: http://repo1.maven.org/maven2/org/codehaus/plexus/plexus-compiler-javac/2.2/plexus-compiler-javac-2.2.jar
(19 KB at 394.2 KB/sec)
Downloaded: http://repo1.maven.org/maven2/org/apache/maven/shared/maven-shared-utils/0.1/maven-shared-utils-0.1.jar
(151 KB at 1101.4 KB/sec)
Downloaded: http://repo1.maven.org/maven2/junit/junit/3.8.2/junit-3.8.2.jar (118 KB at 1024.5
KB/sec)
Downloaded: http://repo1.maven.org/maven2/com/google/collections/google-collections/1.0/google-collections-1.0.jar
(625 KB at 3785.5 KB/sec)
[INFO] Changes detected - recompiling the module!
[INFO] Compiling 260 source files to <https://builds.apache.org/job/UIMA-AS/ws/trunk/uimaj-as-core/target/classes>
[INFO] -------------------------------------------------------------
[ERROR] COMPILATION ERROR : 
[INFO] -------------------------------------------------------------
[ERROR] javac: invalid target release: 1.7
Usage: javac <options> <source files>
use -help for a list of possible options

[INFO] 1 error
[INFO] -------------------------------------------------------------
[INFO] ------------------------------------------------------------------------
[INFO] Reactor Summary:
[INFO] 
[INFO] Apache UIMA-AS: uima-as-parent .................... SUCCESS [51.851s]
[INFO] Apache UIMA-AS: uimaj-as-core ..................... FAILURE [17.188s]
[INFO] Apache UIMA-AS: uimaj-as-jms ...................... SKIPPED
[INFO] Apache UIMA-AS: uimaj-as-activemq ................. SKIPPED
[INFO] Apache UIMA-AS Eclipse Plugin: uimaj-ep-runtime-deployeditor  SKIPPED
[INFO] Apache UIMA-AS Eclipse Plugin: uimaj-ep-deployeditor  SKIPPED
[INFO] Apache UIMA AS: uimaj-as-osgi-runtime ............. SKIPPED
[INFO] Apache UIMA-AS: uimaj-as-camel .................... SKIPPED
[INFO] Apache UIMA Eclipse: uimaj-eclipse-feature-deployeditor  SKIPPED
[INFO] Apache UIMA-AS Aggregate: aggregate-uima-as-eclipse-plugins  SKIPPED
[INFO] Apache UIMA-AS: uima-as-docbooks .................. SKIPPED
[INFO] Apache UIMA-AS Aggregate: aggregate-uima-as ....... SKIPPED
[INFO] Apache UIMA-AS: uima-as ........................... SKIPPED
[INFO] ------------------------------------------------------------------------
[INFO] BUILD FAILURE
[INFO] ------------------------------------------------------------------------
[INFO] Total time: 1:27.404s
[INFO] Finished at: Thu Feb 25 17:31:12 UTC 2016
[INFO] Final Memory: 41M/239M
[INFO] ------------------------------------------------------------------------
Waiting for Jenkins to finish collecting data
[ERROR] Failed to execute goal org.apache.maven.plugins:maven-compiler-plugin:3.1:compile
(default-compile) on project uimaj-as-core: Compilation failure
[ERROR] javac: invalid target release: 1.7
[ERROR] Usage: javac <options> <source files>
[ERROR] use -help for a list of possible options
[ERROR] -> [Help 1]
[ERROR] 
[ERROR] To see the full stack trace of the errors, re-run Maven with the -e switch.
[ERROR] Re-run Maven using the -X switch to enable full debug logging.
[ERROR] 
[ERROR] For more information about the errors and possible solutions, please read the following
articles:
[ERROR] [Help 1] http://cwiki.apache.org/confluence/display/MAVEN/MojoFailureException
[ERROR] 
[ERROR] After correcting the problems, you can resume the build with the command
[ERROR]   mvn <goals> -rf :uimaj-as-core
[JENKINS] Archiving <https://builds.apache.org/job/UIMA-AS/ws/trunk/aggregate-uima-as-eclipse-plugins/pom.xml>
to org.apache.uima/aggregate-uima-as-eclipse-plugins/2.8.2-SNAPSHOT/aggregate-uima-as-eclipse-plugins-2.8.2-SNAPSHOT.pom
[JENKINS] Archiving <https://builds.apache.org/job/UIMA-AS/ws/trunk/uima-as-parent/pom.xml>
to org.apache.uima/uima-as-parent/2.8.2-SNAPSHOT/uima-as-parent-2.8.2-SNAPSHOT.pom
No artifacts from UIMA-AS » Apache UIMA-AS: uima-as-parent #397 to compare, so performing
full copy of artifacts
[JENKINS] Archiving <https://builds.apache.org/job/UIMA-AS/ws/trunk/uimaj-as-camel/pom.xml>
to org.apache.uima/uimaj-as-camel/2.8.2-SNAPSHOT/uimaj-as-camel-2.8.2-SNAPSHOT.pom
[JENKINS] Archiving <https://builds.apache.org/job/UIMA-AS/ws/trunk/uimaj-as-core/pom.xml>
to org.apache.uima/uimaj-as-core/2.8.2-SNAPSHOT/uimaj-as-core-2.8.2-SNAPSHOT.pom
No artifacts from UIMA-AS » Apache UIMA-AS: uimaj-as-core #369 to compare, so performing
full copy of artifacts
[JENKINS] Archiving <https://builds.apache.org/job/UIMA-AS/ws/trunk/uimaj-ep-runtime-deployeditor/pom.xml>
to org.apache.uima/uimaj-ep-runtime-deployeditor/2.8.2-SNAPSHOT/uimaj-ep-runtime-deployeditor-2.8.2-SNAPSHOT.pom
[JENKINS] Archiving <https://builds.apache.org/job/UIMA-AS/ws/trunk/uimaj-as-activemq/pom.xml>
to org.apache.uima/uimaj-as-activemq/2.8.2-SNAPSHOT/uimaj-as-activemq-2.8.2-SNAPSHOT.pom
No artifacts from UIMA-AS » Apache UIMA-AS: uimaj-as-activemq #369 to compare, so performing
full copy of artifacts
[JENKINS] Archiving <https://builds.apache.org/job/UIMA-AS/ws/trunk/uimaj-ep-deployeditor/pom.xml>
to org.apache.uima/uimaj-ep-deployeditor/2.8.2-SNAPSHOT/uimaj-ep-deployeditor-2.8.2-SNAPSHOT.pom
[JENKINS] Archiving <https://builds.apache.org/job/UIMA-AS/ws/trunk/uima-as-docbooks/pom.xml>
to org.apache.uima/uima-as-docbooks/2.8.2-SNAPSHOT/uima-as-docbooks-2.8.2-SNAPSHOT.pom
[JENKINS] Archiving <https://builds.apache.org/job/UIMA-AS/ws/trunk/uimaj-as-osgi-runtime/pom.xml>
to org.apache.uima/uimaj-as-osgi-runtime/2.8.2-SNAPSHOT/uimaj-as-osgi-runtime-2.8.2-SNAPSHOT.pom
[JENKINS] Archiving <https://builds.apache.org/job/UIMA-AS/ws/trunk/aggregate-uima-as/pom.xml>
to org.apache.uima/aggregate-uima-as/2.8.2-SNAPSHOT/aggregate-uima-as-2.8.2-SNAPSHOT.pom
[JENKINS] Archiving <https://builds.apache.org/job/UIMA-AS/ws/trunk/uimaj-eclipse-feature-deployeditor/pom.xml>
to org.apache.uima/uimaj-eclipse-feature-deployeditor/2.8.2-SNAPSHOT/uimaj-eclipse-feature-deployeditor-2.8.2-SNAPSHOT.pom
[JENKINS] Archiving <https://builds.apache.org/job/UIMA-AS/ws/trunk/pom.xml> to org.apache.uima/uima-as/2.8.2-SNAPSHOT/uima-as-2.8.2-SNAPSHOT.pom
[JENKINS] Archiving <https://builds.apache.org/job/UIMA-AS/ws/trunk/uimaj-as-jms/pom.xml>
to org.apache.uima/uimaj-as-jms/2.8.2-SNAPSHOT/uimaj-as-jms-2.8.2-SNAPSHOT.pom
No artifacts from UIMA-AS » Apache UIMA-AS: uimaj-as-jms #369 to compare, so performing full
copy of artifacts
Sending e-mails to: dev@uima.apache.org
channel stopped
Skipping Cobertura coverage report as build was not UNSTABLE or better ...

Mime
View raw message