uima-dev mailing list archives

Site index · List index
Message view « Date » · « Thread »
Top « Date » · « Thread »
From Apache Jenkins Server <jenk...@builds.apache.org>
Subject Build failed in Jenkins: UIMA-SDK #789
Date Fri, 15 Apr 2016 15:03:19 GMT
See <https://builds.apache.org/job/UIMA-SDK/789/changes>

Changes:

[schor] [UIMA-4897] Add elide and caller trace methods

------------------------------------------
[...truncated 6136 lines...]
Apr 15, 2016 8:01:10 AM org.apache.uima.util.impl.JSR47Logger_implTest testMessageLogMethods(189)
INFO: My java.lang.Object@37b1dd84 test message
Apr 15, 2016 8:01:10 AM org.apache.uima.util.impl.JSR47Logger_implTest testMessageLogMethods(190)
INFO: My  test message
Apr 15, 2016 8:01:10 AM org.apache.uima.util.impl.JSR47Logger_implTest testMessageLogMethods(191)
INFO: My null test message
Apr 15, 2016 8:01:10 AM org.apache.uima.util.impl.JSR47Logger_implTest testMessageLogMethods(196)
INFO: My third test message
Apr 15, 2016 8:01:10 AM org.apache.uima.util.impl.JSR47Logger_implTest testMessageLogMethods(197)
INFO: My {0} test message
Apr 15, 2016 8:01:10 AM org.apache.uima.util.impl.JSR47Logger_implTest testMessageLogMethods(200)
INFO: My  test message
Apr 15, 2016 8:01:10 AM org.apache.uima.util.impl.JSR47Logger_implTest testMessageLogMethods(201)
INFO: My null test message
Apr 15, 2016 8:01:10 AM org.apache.uima.util.impl.JSR47Logger_implTest testMessageKeyLogMethods(245)
INFO: Exception test message
Apr 15, 2016 8:01:10 AM org.apache.uima.util.impl.JSR47Logger_implTest testMessageKeyLogMethods(247)
INFO: Exception test message
Apr 15, 2016 8:01:10 AM org.apache.uima.util.impl.JSR47Logger_implTest testMessageKeyLogMethods(248)
INFO: Exception test message
Apr 15, 2016 8:01:10 AM org.apache.uima
INFO: Exception test message
Apr 15, 2016 8:01:10 AM org.apache.uima
INFO: MESSAGE LOCALIZATION FAILED: null
Apr 15, 2016 8:01:10 AM testClass testMethod
INFO: Exception test message
Apr 15, 2016 8:01:10 AM org.apache.uima
INFO: Exception test message
Apr 15, 2016 8:01:10 AM org.apache.uima
INFO: Exception test message
Apr 15, 2016 8:01:10 AM org.apache.uima
INFO: MESSAGE LOCALIZATION FAILED: null
Apr 15, 2016 8:01:10 AM testClass testMethod
INFO: Exception test message
Apr 15, 2016 8:01:10 AM org.apache.uima
INFO: Exception test message
Apr 15, 2016 8:01:10 AM org.apache.uima
INFO: MESSAGE LOCALIZATION FAILED: null
Apr 15, 2016 8:01:10 AM testClass testMethod
INFO: Exception test message
Tests run: 4, Failures: 0, Errors: 0, Skipped: 0, Time elapsed: 0.002 sec - in org.apache.uima.util.impl.JSR47Logger_implTest
Running org.apache.uima.util.impl.Logger_implTest
Tests run: 2, Failures: 0, Errors: 0, Skipped: 0, Time elapsed: 0 sec - in org.apache.uima.util.impl.Logger_implTest
Running org.apache.uima.util.impl.LoggingTest
Apr 15, 2016 8:01:10 AM org.apache.uima.util.impl.LoggingTest testDefaultLoggerCreation(58)
SEVERE: Log test messege with Level SEVERE
Apr 15, 2016 8:01:10 AM org.apache.uima.util.impl.LoggingTest testClassLoggerCreation(83)
SEVERE: Log test messege with Level SEVERE
Tests run: 3, Failures: 0, Errors: 0, Skipped: 0, Time elapsed: 0.001 sec - in org.apache.uima.util.impl.LoggingTest
Running org.apache.uima.util.impl.OptimizeStringsTest
Tests run: 4, Failures: 0, Errors: 0, Skipped: 0, Time elapsed: 0 sec - in org.apache.uima.util.impl.OptimizeStringsTest
Running org.apache.uima.util.impl.ProcessTrace_implTest
Tests run: 6, Failures: 0, Errors: 0, Skipped: 0, Time elapsed: 0.165 sec - in org.apache.uima.util.impl.ProcessTrace_implTest
Running org.apache.uima.util.impl.TestLog4jLogger_impl
0 [main] INFO org.apache.uima.util.impl.TestLog4jLogger_impl  - ola
1 [main] INFO org.apache.uima.util.impl.TestLog4jLogger_impl  - OLA in info
1 [main] INFO org.apache.uima  - UIMA OLA in info
[TestLog4jLogger_impl.java:213] My first test message
[TestLog4jLogger_impl.java:219] My second test message
[TestLog4jLogger_impl.java:220] My java.lang.Object@2d164deb test message
[TestLog4jLogger_impl.java:221] My  test message
[TestLog4jLogger_impl.java:222] My null test message
[TestLog4jLogger_impl.java:227] My third test message
[TestLog4jLogger_impl.java:228] My {0} test message
[TestLog4jLogger_impl.java:231] My  test message
[TestLog4jLogger_impl.java:232] My null test message
[TestLog4jLogger_impl.java:237] My fourth test message
[TestLog4jLogger_impl.java:238] Exception occurred
[TestLog4jLogger_impl.java:239] Exception occurred
[TestLog4jLogger_impl.java:241] My fourth test message
[TestLog4jLogger_impl.java:243] Message from wrapper
[TestLog4jLogger_impl.java:250] My fifth test message
[TestLog4jLogger_impl.java:256] Exception occurred
[TestLog4jLogger_impl.java:296] Exception test message
[TestLog4jLogger_impl.java:298] Exception test message
[TestLog4jLogger_impl.java:299] Exception test message
[TestLog4jLogger_impl.java:302] Exception test message
[TestLog4jLogger_impl.java:304] MESSAGE LOCALIZATION FAILED: null
[TestLog4jLogger_impl.java:306] Exception test message
[TestLog4jLogger_impl.java:311] Exception test message
[TestLog4jLogger_impl.java:312] Exception test message
[TestLog4jLogger_impl.java:314] MESSAGE LOCALIZATION FAILED: null
[TestLog4jLogger_impl.java:316] Exception test message
[TestLog4jLogger_impl.java:321] Exception test message
[TestLog4jLogger_impl.java:324] MESSAGE LOCALIZATION FAILED: null
[TestLog4jLogger_impl.java:327] Exception test message
[TestLog4jLogger_impl.java:333] Exception test message
[TestLog4jLogger_impl.java:334] Exception occurred
[TestLog4jLogger_impl.java:335] MESSAGE LOCALIZATION FAILED: null
[TestLog4jLogger_impl.java:336] Exception occurred
[TestLog4jLogger_impl.java:338] Exception test message
Apr 15, 2016 8:01:10 AM org.apache.uima.util.impl.TestLog4jLogger_impl testLoggerFromUIMAFramework(358)
INFO: ------------------------------------------------------------
Apr 15, 2016 8:01:10 AM org.apache.uima.util.impl.TestLog4jLogger_impl testLoggerFromUIMAFramework(360)
INFO: My first test message
Tests run: 5, Failures: 0, Errors: 0, Skipped: 0, Time elapsed: 0.019 sec - in org.apache.uima.util.impl.TestLog4jLogger_impl
Running org.apache.uima.util.impl.XMLParser_implTest
Tests run: 7, Failures: 0, Errors: 0, Skipped: 0, Time elapsed: 0 sec - in org.apache.uima.util.impl.XMLParser_implTest
Running org.apache.uima.util.LevelTest
Tests run: 11, Failures: 0, Errors: 0, Skipped: 0, Time elapsed: 0.001 sec - in org.apache.uima.util.LevelTest
Running org.apache.uima.util.TestCollectionReader
Tests run: 0, Failures: 0, Errors: 0, Skipped: 0, Time elapsed: 0 sec - in org.apache.uima.util.TestCollectionReader
Running org.apache.uima.util.TypeSystemUtilTest
Tests run: 1, Failures: 0, Errors: 0, Skipped: 0, Time elapsed: 0 sec - in org.apache.uima.util.TypeSystemUtilTest
Running org.apache.uima.util.XMLSerializerTest
Trying to serialize non-XML 1.1 character:  , 0x0 at offset 2 in string starting with  ! "
Java version is Oracle Corporation 1.7.0 Java HotSpot(TM) 64-Bit Server VM 21.0-b17
  javax.xml.transform.TransformerFactory: null
  Transformer version: 1.1
Tests run: 5, Failures: 0, Errors: 0, Skipped: 0, Time elapsed: 0 sec - in org.apache.uima.util.XMLSerializerTest
[INFO] Cobertura: Loaded information on 917 classes.
[INFO] Cobertura: Saved information on 917 classes.

Results :

Tests run: 499, Failures: 0, Errors: 0, Skipped: 0

[JENKINS] Recording test results
[INFO] 
[INFO] --- cobertura-maven-plugin:2.7:cobertura (default) @ uimaj-core ---
[INFO] Cobertura 2.1.1 - GNU GPL License (NO WARRANTY) - See COPYRIGHT file
[INFO] Cobertura: Loaded information on 917 classes.
Report time: 9257ms

[INFO] Cobertura Report generation was successful.
[INFO] 
[INFO] --- maven-pmd-plugin:3.5:cpd (default) @ uimaj-core ---
[DRY] Finding all files that match the pattern cpd.xml
[DRY] Parsing 1 file in F:\jenkins\jenkins-slave\workspace\UIMA-SDK\trunk\uimaj-core\target
[DRY] Successfully parsed file F:\jenkins\jenkins-slave\workspace\UIMA-SDK\trunk\uimaj-core\target\cpd.xml
of module Apache UIMA Base: uimaj-core with 124 unique warnings and 0 duplicates.
[DRY] Computing warning deltas based on reference build #788
[INFO] 
[INFO] --- maven-pmd-plugin:3.5:pmd (default) @ uimaj-core ---
[PMD] Finding all files that match the pattern pmd.xml
[PMD] Parsing 1 file in F:\jenkins\jenkins-slave\workspace\UIMA-SDK\trunk\uimaj-core\target
[PMD] Successfully parsed file F:\jenkins\jenkins-slave\workspace\UIMA-SDK\trunk\uimaj-core\target\pmd.xml
of module Apache UIMA Base: uimaj-core with 2464 unique warnings and 0 duplicates.
[PMD] Computing warning deltas based on reference build #788
[INFO] 
[INFO] --- maven-enforcer-plugin:1.3.1:enforce (enforce-compatibility) @ uimaj-core ---
[INFO] Version specified as <2.8.0>
[INFO] Using <f:\jenkins\jenkins-slave\maven-repositories\0\org\apache\uima\uimaj-core\2.8.0\uimaj-core-2.8.0.jar>
as previous JAR
[INFO] Using <F:\jenkins\jenkins-slave\workspace\UIMA-SDK\trunk\uimaj-core\target\uima-core.jar>
as current JAR
Class org.apache.uima.util.Misc
 Added Field blanks, desc Ljava/lang/String;, access final public static
 Added Method getCallers, desc (II)Ljava/lang/StringBuilder;, access public static
 Added Method elide, desc (Ljava/lang/String;I)Ljava/lang/String;, access public static
 Added Method elide, desc (Ljava/lang/String;IZ)Ljava/lang/String;, access public static
 Added Method replaceWhiteSpace, desc (Ljava/lang/String;Ljava/lang/String;)Ljava/lang/String;,
access public static
 Added Method getCaller, desc ()Ljava/lang/String;, access public static
 Added Field dots, desc Ljava/lang/String;, access final public static
[WARNING] Rule 0: org.semver.enforcer.RequireBackwardCompatibility failed with message:
Current codebase is not backward compatible (BACKWARD_COMPATIBLE_IMPLEMENTER) with version
<2.8.0>. Compatibility type has been detected as <BACKWARD_COMPATIBLE_USER>
[INFO]                                                                         
[INFO] ------------------------------------------------------------------------
[INFO] Skipping Apache UIMA Java SDK: uimaj
[INFO] This project has been banned from the build due to previous failures.
[INFO] ------------------------------------------------------------------------
[INFO] ------------------------------------------------------------------------
[INFO] Reactor Summary:
[INFO] 
[INFO] Apache UIMA Java SDK: uimaj-parent ................ SUCCESS [26.545s]
[INFO] Apache UIMA Base: uimaj-test-util: JUnit utilities  SUCCESS [56.012s]
[INFO] Apache UIMA Base: uimaj-core ...................... FAILURE [8:28.949s]
[INFO] Apache UIMA Base: jVinci: Vinci Transport Library . SKIPPED
[INFO] Apache UIMA Base: uimaj-adapter-vinci: Vinci Adapter  SKIPPED
[INFO] Apache UIMA Base: uimaj-cpe: Collection Processing Engine  SKIPPED
[INFO] Apache UIMA Base: uimaj-document-annotation ....... SKIPPED
[INFO] Apache UIMA Base: uimaj-tools: Tools .............. SKIPPED
[INFO] Apache UIMA Base: uimaj-examples: SDK Examples .... SKIPPED
[INFO] Apache UIMA Base: uimaj-adapter-soap: SOAP Adapter  SKIPPED
[INFO] Apache UIMA Base: uimaj-component-test-util: for JUnit  SKIPPED
[INFO] Apache UIMA Eclipse: uimaj-ep-debug ............... SKIPPED
[INFO] Apache UIMA Eclipse: uimaj-ep-jcasgen ............. SKIPPED
[INFO] Apache UIMA Eclipse: uimaj-ep-configurator: Descriptor Editor  SKIPPED
[INFO] Apache UIMA Eclipse: uimaj-ep-pear-packager ....... SKIPPED
[INFO] Apache UIMA Eclipse: uimaj-ep-launcher ............ SKIPPED
[INFO] Apache UIMA Eclipse: uimaj-ep-cas-editor .......... SKIPPED
[INFO] Apache UIMA Eclipse: uimaj-ep-cas-editor-ide ...... SKIPPED
[INFO] Apache UIMA Eclipse: uimaj-ep-runtime ............. SKIPPED
[INFO] Apache UIMA Eclipse: uimaj-eclipse-feature-tools .. SKIPPED
[INFO] Apache UIMA Eclipse: uimaj-eclipse-feature-runtime  SKIPPED
[INFO] Apache UIMA Aggregate: aggregate-uimaj-eclipse-plugins  SKIPPED
[INFO] Apache UIMA SDK Documentation - overview and setup  SKIPPED
[INFO] Apache UIMA SDK Documentation - references ........ SKIPPED
[INFO] Apache UIMA SDK Documentation - tools ............. SKIPPED
[INFO] Apache UIMA SDK Documentation - tutorials and user's guides  SKIPPED
[INFO] Apache UIMA Aggregate: aggregate-uimaj-docbooks ... SKIPPED
[INFO] Apache UIMA Maven: PearPackagingMavenPlugin ....... SKIPPED
[INFO] Apache UIMA Maven: jcasgen-maven-plugin ........... SKIPPED
[INFO] Apache UIMA Base: uimaj-bootstrap ................. SKIPPED
[INFO] Apache UIMA Aggregate: aggregate-uimaj ............ SKIPPED
[INFO] Apache UIMA Base: uimaj-json: JSON ................ SKIPPED
[INFO] Apache UIMA Java SDK: uimaj ....................... SKIPPED
[INFO] ------------------------------------------------------------------------
[INFO] BUILD FAILURE
[INFO] ------------------------------------------------------------------------
[INFO] Total time: 10:06.974s
[INFO] Finished at: Fri Apr 15 08:01:59 PDT 2016
[INFO] Final Memory: 89M/239M
[INFO] ------------------------------------------------------------------------
Waiting for Jenkins to finish collecting data
[ERROR] Failed to execute goal org.apache.maven.plugins:maven-enforcer-plugin:1.3.1:enforce
(enforce-compatibility) on project uimaj-core: Some Enforcer rules have failed. Look above
for specific messages explaining why the rule failed. -> [Help 1]
[ERROR] 
[ERROR] To see the full stack trace of the errors, re-run Maven with the -e switch.
[ERROR] Re-run Maven using the -X switch to enable full debug logging.
[ERROR] 
[ERROR] For more information about the errors and possible solutions, please read the following
articles:
[ERROR] [Help 1] http://cwiki.apache.org/confluence/display/MAVEN/MojoExecutionException
[ERROR] 
[ERROR] After correcting the problems, you can resume the build with the command
[ERROR]   mvn <goals> -rf :uimaj-core
[JENKINS] Archiving F:\jenkins\jenkins-slave\workspace\UIMA-SDK\trunk\uimaj-adapter-soap\pom.xml
to org.apache.uima/uimaj-adapter-soap/2.8.2-SNAPSHOT/uimaj-adapter-soap-2.8.2-SNAPSHOT.pom
[JENKINS] Archiving F:\jenkins\jenkins-slave\workspace\UIMA-SDK\trunk\uimaj-core\pom.xml to
org.apache.uima/uimaj-core/2.8.2-SNAPSHOT/uimaj-core-2.8.2-SNAPSHOT.pom
[JENKINS] Archiving F:\jenkins\jenkins-slave\workspace\UIMA-SDK\trunk\uimaj-core\target\uima-core.jar
to org.apache.uima/uimaj-core/2.8.2-SNAPSHOT/uimaj-core-2.8.2-SNAPSHOT.jar
[JENKINS] Archiving F:\jenkins\jenkins-slave\workspace\UIMA-SDK\trunk\uimaj-test-util\pom.xml
to org.apache.uima/uimaj-test-util/2.8.2-SNAPSHOT/uimaj-test-util-2.8.2-SNAPSHOT.pom
[JENKINS] Archiving F:\jenkins\jenkins-slave\workspace\UIMA-SDK\trunk\uimaj-test-util\target\uimaj-test-util-2.8.2-SNAPSHOT.jar
to org.apache.uima/uimaj-test-util/2.8.2-SNAPSHOT/uimaj-test-util-2.8.2-SNAPSHOT.jar
[JENKINS] Archiving F:\jenkins\jenkins-slave\workspace\UIMA-SDK\trunk\uimaj-eclipse-feature-tools\pom.xml
to org.apache.uima/uimaj-eclipse-feature-tools/2.8.2-SNAPSHOT/uimaj-eclipse-feature-tools-2.8.2-SNAPSHOT.pom
[JENKINS] Archiving F:\jenkins\jenkins-slave\workspace\UIMA-SDK\trunk\PearPackagingMavenPlugin\pom.xml
to org.apache.uima/PearPackagingMavenPlugin/2.8.2-SNAPSHOT/PearPackagingMavenPlugin-2.8.2-SNAPSHOT.pom
[JENKINS] Archiving F:\jenkins\jenkins-slave\workspace\UIMA-SDK\trunk\uimaj-ep-cas-editor-ide\pom.xml
to org.apache.uima/uimaj-ep-cas-editor-ide/2.8.2-SNAPSHOT/uimaj-ep-cas-editor-ide-2.8.2-SNAPSHOT.pom
[JENKINS] Archiving F:\jenkins\jenkins-slave\workspace\UIMA-SDK\trunk\uimaj-ep-runtime\pom.xml
to org.apache.uima/uimaj-ep-runtime/2.8.2-SNAPSHOT/uimaj-ep-runtime-2.8.2-SNAPSHOT.pom
[JENKINS] Archiving F:\jenkins\jenkins-slave\workspace\UIMA-SDK\trunk\uimaj-tools\pom.xml
to org.apache.uima/uimaj-tools/2.8.2-SNAPSHOT/uimaj-tools-2.8.2-SNAPSHOT.pom
[JENKINS] Archiving F:\jenkins\jenkins-slave\workspace\UIMA-SDK\trunk\uimaj-ep-jcasgen\pom.xml
to org.apache.uima/uimaj-ep-jcasgen/2.8.2-SNAPSHOT/uimaj-ep-jcasgen-2.8.2-SNAPSHOT.pom
[JENKINS] Archiving F:\jenkins\jenkins-slave\workspace\UIMA-SDK\trunk\uimaj-ep-debug\pom.xml
to org.apache.uima/uimaj-ep-debug/2.8.2-SNAPSHOT/uimaj-ep-debug-2.8.2-SNAPSHOT.pom
[JENKINS] Archiving F:\jenkins\jenkins-slave\workspace\UIMA-SDK\trunk\aggregate-uimaj-eclipse-plugins\pom.xml
to org.apache.uima/aggregate-uimaj-eclipse-plugins/2.8.2-SNAPSHOT/aggregate-uimaj-eclipse-plugins-2.8.2-SNAPSHOT.pom
[JENKINS] Archiving F:\jenkins\jenkins-slave\workspace\UIMA-SDK\trunk\uima-docbook-tools\pom.xml
to org.apache.uima/uima-docbook-tools/2.8.2-SNAPSHOT/uima-docbook-tools-2.8.2-SNAPSHOT.pom
[JENKINS] Archiving F:\jenkins\jenkins-slave\workspace\UIMA-SDK\trunk\uimaj-eclipse-feature-runtime\pom.xml
to org.apache.uima/uimaj-eclipse-feature-runtime/2.8.2-SNAPSHOT/uimaj-eclipse-feature-runtime-2.8.2-SNAPSHOT.pom
[JENKINS] Archiving F:\jenkins\jenkins-slave\workspace\UIMA-SDK\trunk\uimaj-adapter-vinci\pom.xml
to org.apache.uima/uimaj-adapter-vinci/2.8.2-SNAPSHOT/uimaj-adapter-vinci-2.8.2-SNAPSHOT.pom
[JENKINS] Archiving F:\jenkins\jenkins-slave\workspace\UIMA-SDK\trunk\uimaj-bootstrap\pom.xml
to org.apache.uima/uimaj-bootstrap/2.8.2-SNAPSHOT/uimaj-bootstrap-2.8.2-SNAPSHOT.pom
[JENKINS] Archiving F:\jenkins\jenkins-slave\workspace\UIMA-SDK\trunk\uimaj-json\pom.xml to
org.apache.uima/uimaj-json/2.8.2-SNAPSHOT/uimaj-json-2.8.2-SNAPSHOT.pom
[JENKINS] Archiving F:\jenkins\jenkins-slave\workspace\UIMA-SDK\trunk\uimaj-ep-pear-packager\pom.xml
to org.apache.uima/uimaj-ep-pear-packager/2.8.2-SNAPSHOT/uimaj-ep-pear-packager-2.8.2-SNAPSHOT.pom
[JENKINS] Archiving F:\jenkins\jenkins-slave\workspace\UIMA-SDK\trunk\uimaj-parent\pom.xml
to org.apache.uima/uimaj-parent/2.8.2-SNAPSHOT/uimaj-parent-2.8.2-SNAPSHOT.pom
[JENKINS] Archiving F:\jenkins\jenkins-slave\workspace\UIMA-SDK\trunk\uimaj-examples\pom.xml
to org.apache.uima/uimaj-examples/2.8.2-SNAPSHOT/uimaj-examples-2.8.2-SNAPSHOT.pom
[JENKINS] Archiving F:\jenkins\jenkins-slave\workspace\UIMA-SDK\trunk\uimaj-ep-configurator\pom.xml
to org.apache.uima/uimaj-ep-configurator/2.8.2-SNAPSHOT/uimaj-ep-configurator-2.8.2-SNAPSHOT.pom
[JENKINS] Archiving F:\jenkins\jenkins-slave\workspace\UIMA-SDK\trunk\uima-docbook-overview-and-setup\pom.xml
to org.apache.uima/uima-docbook-overview-and-setup/2.8.2-SNAPSHOT/uima-docbook-overview-and-setup-2.8.2-SNAPSHOT.pom
[JENKINS] Archiving F:\jenkins\jenkins-slave\workspace\UIMA-SDK\trunk\uimaj-document-annotation\pom.xml
to org.apache.uima/uimaj-document-annotation/2.8.2-SNAPSHOT/uimaj-document-annotation-2.8.2-SNAPSHOT.pom
[JENKINS] Archiving F:\jenkins\jenkins-slave\workspace\UIMA-SDK\trunk\uimaj-cpe\pom.xml to
org.apache.uima/uimaj-cpe/2.8.2-SNAPSHOT/uimaj-cpe-2.8.2-SNAPSHOT.pom
[JENKINS] Archiving F:\jenkins\jenkins-slave\workspace\UIMA-SDK\trunk\uima-docbook-references\pom.xml
to org.apache.uima/uima-docbook-references/2.8.2-SNAPSHOT/uima-docbook-references-2.8.2-SNAPSHOT.pom
[JENKINS] Archiving F:\jenkins\jenkins-slave\workspace\UIMA-SDK\trunk\uimaj-ep-cas-editor\pom.xml
to org.apache.uima/uimaj-ep-cas-editor/2.8.2-SNAPSHOT/uimaj-ep-cas-editor-2.8.2-SNAPSHOT.pom
[JENKINS] Archiving F:\jenkins\jenkins-slave\workspace\UIMA-SDK\trunk\jcasgen-maven-plugin\pom.xml
to org.apache.uima/jcasgen-maven-plugin/2.8.2-SNAPSHOT/jcasgen-maven-plugin-2.8.2-SNAPSHOT.pom
[JENKINS] Archiving F:\jenkins\jenkins-slave\workspace\UIMA-SDK\trunk\uimaj-ep-launcher\pom.xml
to org.apache.uima/uimaj-ep-launcher/2.8.2-SNAPSHOT/uimaj-ep-launcher-2.8.2-SNAPSHOT.pom
[JENKINS] Archiving F:\jenkins\jenkins-slave\workspace\UIMA-SDK\trunk\aggregate-uimaj\pom.xml
to org.apache.uima/aggregate-uimaj/2.8.2-SNAPSHOT/aggregate-uimaj-2.8.2-SNAPSHOT.pom
[JENKINS] Archiving F:\jenkins\jenkins-slave\workspace\UIMA-SDK\trunk\aggregate-uimaj-docbooks\pom.xml
to org.apache.uima/aggregate-uimaj-docbooks/2.8.2-SNAPSHOT/aggregate-uimaj-docbooks-2.8.2-SNAPSHOT.pom
[JENKINS] Archiving <https://builds.apache.org/job/UIMA-SDK/ws/trunk\pom.xml> to org.apache.uima/uimaj/2.8.2-SNAPSHOT/uimaj-2.8.2-SNAPSHOT.pom
[JENKINS] Archiving F:\jenkins\jenkins-slave\workspace\UIMA-SDK\trunk\uimaj-component-test-util\pom.xml
to org.apache.uima/uimaj-component-test-util/2.8.2-SNAPSHOT/uimaj-component-test-util-2.8.2-SNAPSHOT.pom
[JENKINS] Archiving F:\jenkins\jenkins-slave\workspace\UIMA-SDK\trunk\uima-docbook-tutorials-and-users-guides\pom.xml
to org.apache.uima/uima-docbook-tutorials-and-users-guides/2.8.2-SNAPSHOT/uima-docbook-tutorials-and-users-guides-2.8.2-SNAPSHOT.pom
[JENKINS] Archiving F:\jenkins\jenkins-slave\workspace\UIMA-SDK\trunk\jVinci\pom.xml to org.apache.uima/jVinci/2.8.2-SNAPSHOT/jVinci-2.8.2-SNAPSHOT.pom
Sending e-mails to: dev@uima.apache.org
channel stopped
[WARNINGS] Skipping publisher since build result is FAILURE

Mime
View raw message