uima-dev mailing list archives

Site index · List index
Message view « Date » · « Thread »
Top « Date » · « Thread »
From Apache Jenkins Server <jenk...@builds.apache.org>
Subject Build failed in Jenkins: UIMA-SDK » Apache UIMA Base: uimaj-core #789
Date Fri, 15 Apr 2016 15:03:14 GMT
See <https://builds.apache.org/job/UIMA-SDK/org.apache.uima$uimaj-core/789/changes>

Changes:

[schor] [UIMA-4897] Add elide and caller trace methods

------------------------------------------
[...truncated 2189 lines...]
CasCopier speed for 400KB xcas is 2,363 microseconds on iteration 93
CasCopier speed for 400KB xcas is 2,358 microseconds on iteration 104
CasCopier speed for 400KB xcas is 2,355 microseconds on iteration 115
CasCopier speed for 400KB xcas is 2,354 microseconds on iteration 150
CasCopier speed for 400KB xcas is 2,351 microseconds on iteration 164
CasCopier speed for 400KB xcas is 2,350 microseconds on iteration 188
CasCopier speed for 400KB xcas is 2,348 microseconds on iteration 193
CasCopier speed for 400KB xcas is 2,343 microseconds on iteration 202
CasCopier speed for 400KB xcas is 2,336 microseconds on iteration 206
CasCopier speed for 400KB xcas is 2,333 microseconds on iteration 223
CasCopier speed for 400KB xcas is 2,294 microseconds on iteration 247
CasCopier speed for 400KB xcas is 2,281 microseconds on iteration 249
CasCopier speed for 400KB xcas is 2,272 microseconds on iteration 261
CasCopier speed for 400KB xcas is 2,265 microseconds on iteration 263
CasCopier speed for 400KB xcas is 2,263 microseconds on iteration 310
CasCopier speed for 400KB xcas is 2,253 microseconds on iteration 328
CasCopier speed for 400KB xcas is 2,252 microseconds on iteration 336
CasCopier speed for 400KB xcas is 2,243 microseconds on iteration 355
CasCopier speed for 400KB xcas is 2,236 microseconds on iteration 358
CasCopier speed for 400KB xcas is 2,232 microseconds on iteration 361
CasCopier speed for 400KB xcas is 2,224 microseconds on iteration 374
CasCopier speed for 400KB xcas is 2,219 microseconds on iteration 524
CasCopier speed for 400KB xcas is 2,215 microseconds on iteration 572
CasCopier speed for 400KB xcas is 2,213 microseconds on iteration 639
CasCopier speed for 400KB xcas is 2,208 microseconds on iteration 913
CasCopier speed for 400KB xcas is 2,198 microseconds on iteration 918
CasCopier speed for 400KB xcas is 2,192 microseconds on iteration 1,060
CasCopier speed for 400KB xcas is 2,191 microseconds on iteration 1,072
CasCopier speed for 400KB xcas is 2,183 microseconds on iteration 1,099
CasCopier speed for 400KB xcas is 2,181 microseconds on iteration 1,318
CasCopier speed for 400KB xcas is 2,176 microseconds on iteration 1,821
CasCopier speed for 400KB xcas is 2,169 microseconds on iteration 1,986
CasCopier speed for 400KB xcas is 2,168 microseconds on iteration 2,011
CasCopier speed for 400KB xcas is 2,166 microseconds on iteration 2,049
CasCopier speed for 400KB xcas is 2,165 microseconds on iteration 2,075
CasCopier speed for 400KB xcas is 2,164 microseconds on iteration 2,092
CasCopier speed for 400KB xcas is 2,163 microseconds on iteration 2,101
CasCopier speed for 400KB xcas is 2,156 microseconds on iteration 2,114
CasCopier speed for 400KB xcas is 2,148 microseconds on iteration 2,777
CasCopier speed for 400KB xcas is 2,147 microseconds on iteration 2,781
CasCopier speed for 400KB xcas is 2,145 microseconds on iteration 2,898
CasCopier speed for 400KB xcas is 2,142 microseconds on iteration 3,215
CasCopier speed for 400KB xcas is 2,137 microseconds on iteration 3,321
CasCopier speed for 400KB xcas is 2,134 microseconds on iteration 3,512
CasCopier speed for 400KB xcas is 2,133 microseconds on iteration 3,601
CasCopier speed for 400KB xcas is 2,130 microseconds on iteration 3,655
CasCopier speed for 400KB xcas is 2,129 microseconds on iteration 4,098
CasCopier speed for 400KB xcas is 2,126 microseconds on iteration 4,183
CasCopier speed for 400KB xcas is 2,125 microseconds on iteration 4,213
CasCopier speed for 400KB xcas is 2,122 microseconds on iteration 5,005
CasCopier speed for 400KB xcas is 2,118 microseconds on iteration 7,272
CasCopier speed for 400KB xcas is 2,116 microseconds on iteration 7,425
CasCopier speed for 400KB xcas is 2,114 microseconds on iteration 7,460
CasCopier speed for 400KB xcas is 2,112 microseconds on iteration 7,666
CasCopier speed for 400KB xcas is 2,109 microseconds on iteration 9,030
CasCopier speed for 400KB xcas is 2,108 microseconds on iteration 9,815
CasCopier speed for 400KB xcas is 2,103 microseconds on iteration 10,114
CasCopier speed for 400KB xcas is 2,102 microseconds on iteration 10,999
CasCopier speed for 400KB xcas is 2,098 microseconds on iteration 11,244
CasCopier speed for 400KB xcas is 2,094 microseconds on iteration 11,282
CasCopier speed for 400KB xcas is 2,090 microseconds on iteration 12,034
CasCopier speed for 400KB xcas is 2,087 microseconds on iteration 12,052
CasCopier speed for 400KB xcas is 2,084 microseconds on iteration 12,125
CasCopier speed for 400KB xcas is 2,083 microseconds on iteration 12,284
CasCopier speed for 400KB xcas is 2,082 microseconds on iteration 12,442
CasCopier speed for 400KB xcas is 2,080 microseconds on iteration 12,497
CasCopier speed for 400KB xcas is 2,079 microseconds on iteration 12,730
CasCopier speed for 400KB xcas is 2,078 microseconds on iteration 12,894
CasCopier speed for 400KB xcas is 2,077 microseconds on iteration 14,110
CasCopier speed for 400KB xcas is 2,076 microseconds on iteration 14,206
CasCopier speed for 400KB xcas is 2,074 microseconds on iteration 14,216
CasCopier speed for 400KB xcas is 2,073 microseconds on iteration 14,258
CasCopier speed for 400KB xcas is 2,072 microseconds on iteration 14,408
CasCopier speed for 400KB xcas is 2,070 microseconds on iteration 14,538
CasCopier speed for 400KB xcas is 2,069 microseconds on iteration 14,893
CasCopier speed for 400KB xcas is 2,068 microseconds on iteration 15,014
CasCopier speed for 400KB xcas is 2,067 microseconds on iteration 15,071
CasCopier speed for 400KB xcas is 2,065 microseconds on iteration 23,182
CasCopier speed for 400KB xcas is 2,063 microseconds on iteration 46,034
Tests run: 6, Failures: 0, Errors: 0, Skipped: 0, Time elapsed: 132.009 sec - in org.apache.uima.util.CasCopierTest
Running org.apache.uima.util.CasCreationUtilsTest
Tests run: 13, Failures: 0, Errors: 0, Skipped: 0, Time elapsed: 0.381 sec - in org.apache.uima.util.CasCreationUtilsTest
Running org.apache.uima.util.CasToInlineXmlTest
<?xml version="1.0" encoding="UTF-8"?>
<Document>
    <uima.tcas.DocumentAnnotation sofa="Sofa" begin="0" end="17" language="x-unspecified">
        <org.apache.uima.testTypeSystem_arrays.OfStrings sofa="Sofa" begin="0" end="0"
f1Strings="[0s,1s,2s]"/>
        <org.apache.uima.testTypeSystem_arrays.OfShorts sofa="Sofa" begin="0" end="0" f1Shorts="[0,1,2]"/>1
2 3 4 5 6 7 8 9</uima.tcas.DocumentAnnotation>
</Document>
Tests run: 2, Failures: 0, Errors: 0, Skipped: 0, Time elapsed: 0.054 sec - in org.apache.uima.util.CasToInlineXmlTest
Running org.apache.uima.util.FileUtilsTest
Tests run: 2, Failures: 0, Errors: 0, Skipped: 0, Time elapsed: 0 sec - in org.apache.uima.util.FileUtilsTest
Running org.apache.uima.util.impl.JSR47Logger_implTest
Apr 15, 2016 8:01:10 AM org.apache.uima.util.impl.JSR47Logger_implTest testMessageLogMethods(182)
INFO: My first test message
Apr 15, 2016 8:01:10 AM org.apache.uima.util.impl.JSR47Logger_implTest testMessageLogMethods(188)
INFO: My second test message
Apr 15, 2016 8:01:10 AM org.apache.uima.util.impl.JSR47Logger_implTest testMessageLogMethods(189)
INFO: My java.lang.Object@37b1dd84 test message
Apr 15, 2016 8:01:10 AM org.apache.uima.util.impl.JSR47Logger_implTest testMessageLogMethods(190)
INFO: My  test message
Apr 15, 2016 8:01:10 AM org.apache.uima.util.impl.JSR47Logger_implTest testMessageLogMethods(191)
INFO: My null test message
Apr 15, 2016 8:01:10 AM org.apache.uima.util.impl.JSR47Logger_implTest testMessageLogMethods(196)
INFO: My third test message
Apr 15, 2016 8:01:10 AM org.apache.uima.util.impl.JSR47Logger_implTest testMessageLogMethods(197)
INFO: My {0} test message
Apr 15, 2016 8:01:10 AM org.apache.uima.util.impl.JSR47Logger_implTest testMessageLogMethods(200)
INFO: My  test message
Apr 15, 2016 8:01:10 AM org.apache.uima.util.impl.JSR47Logger_implTest testMessageLogMethods(201)
INFO: My null test message
Apr 15, 2016 8:01:10 AM org.apache.uima.util.impl.JSR47Logger_implTest testMessageKeyLogMethods(245)
INFO: Exception test message
Apr 15, 2016 8:01:10 AM org.apache.uima.util.impl.JSR47Logger_implTest testMessageKeyLogMethods(247)
INFO: Exception test message
Apr 15, 2016 8:01:10 AM org.apache.uima.util.impl.JSR47Logger_implTest testMessageKeyLogMethods(248)
INFO: Exception test message
Apr 15, 2016 8:01:10 AM org.apache.uima
INFO: Exception test message
Apr 15, 2016 8:01:10 AM org.apache.uima
INFO: MESSAGE LOCALIZATION FAILED: null
Apr 15, 2016 8:01:10 AM testClass testMethod
INFO: Exception test message
Apr 15, 2016 8:01:10 AM org.apache.uima
INFO: Exception test message
Apr 15, 2016 8:01:10 AM org.apache.uima
INFO: Exception test message
Apr 15, 2016 8:01:10 AM org.apache.uima
INFO: MESSAGE LOCALIZATION FAILED: null
Apr 15, 2016 8:01:10 AM testClass testMethod
INFO: Exception test message
Apr 15, 2016 8:01:10 AM org.apache.uima
INFO: Exception test message
Apr 15, 2016 8:01:10 AM org.apache.uima
INFO: MESSAGE LOCALIZATION FAILED: null
Apr 15, 2016 8:01:10 AM testClass testMethod
INFO: Exception test message
Tests run: 4, Failures: 0, Errors: 0, Skipped: 0, Time elapsed: 0.002 sec - in org.apache.uima.util.impl.JSR47Logger_implTest
Running org.apache.uima.util.impl.Logger_implTest
Tests run: 2, Failures: 0, Errors: 0, Skipped: 0, Time elapsed: 0 sec - in org.apache.uima.util.impl.Logger_implTest
Running org.apache.uima.util.impl.LoggingTest
Apr 15, 2016 8:01:10 AM org.apache.uima.util.impl.LoggingTest testDefaultLoggerCreation(58)
SEVERE: Log test messege with Level SEVERE
Apr 15, 2016 8:01:10 AM org.apache.uima.util.impl.LoggingTest testClassLoggerCreation(83)
SEVERE: Log test messege with Level SEVERE
Tests run: 3, Failures: 0, Errors: 0, Skipped: 0, Time elapsed: 0.001 sec - in org.apache.uima.util.impl.LoggingTest
Running org.apache.uima.util.impl.OptimizeStringsTest
Tests run: 4, Failures: 0, Errors: 0, Skipped: 0, Time elapsed: 0 sec - in org.apache.uima.util.impl.OptimizeStringsTest
Running org.apache.uima.util.impl.ProcessTrace_implTest
Tests run: 6, Failures: 0, Errors: 0, Skipped: 0, Time elapsed: 0.165 sec - in org.apache.uima.util.impl.ProcessTrace_implTest
Running org.apache.uima.util.impl.TestLog4jLogger_impl
0 [main] INFO org.apache.uima.util.impl.TestLog4jLogger_impl  - ola
1 [main] INFO org.apache.uima.util.impl.TestLog4jLogger_impl  - OLA in info
1 [main] INFO org.apache.uima  - UIMA OLA in info
[TestLog4jLogger_impl.java:213] My first test message
[TestLog4jLogger_impl.java:219] My second test message
[TestLog4jLogger_impl.java:220] My java.lang.Object@2d164deb test message
[TestLog4jLogger_impl.java:221] My  test message
[TestLog4jLogger_impl.java:222] My null test message
[TestLog4jLogger_impl.java:227] My third test message
[TestLog4jLogger_impl.java:228] My {0} test message
[TestLog4jLogger_impl.java:231] My  test message
[TestLog4jLogger_impl.java:232] My null test message
[TestLog4jLogger_impl.java:237] My fourth test message
[TestLog4jLogger_impl.java:238] Exception occurred
[TestLog4jLogger_impl.java:239] Exception occurred
[TestLog4jLogger_impl.java:241] My fourth test message
[TestLog4jLogger_impl.java:243] Message from wrapper
[TestLog4jLogger_impl.java:250] My fifth test message
[TestLog4jLogger_impl.java:256] Exception occurred
[TestLog4jLogger_impl.java:296] Exception test message
[TestLog4jLogger_impl.java:298] Exception test message
[TestLog4jLogger_impl.java:299] Exception test message
[TestLog4jLogger_impl.java:302] Exception test message
[TestLog4jLogger_impl.java:304] MESSAGE LOCALIZATION FAILED: null
[TestLog4jLogger_impl.java:306] Exception test message
[TestLog4jLogger_impl.java:311] Exception test message
[TestLog4jLogger_impl.java:312] Exception test message
[TestLog4jLogger_impl.java:314] MESSAGE LOCALIZATION FAILED: null
[TestLog4jLogger_impl.java:316] Exception test message
[TestLog4jLogger_impl.java:321] Exception test message
[TestLog4jLogger_impl.java:324] MESSAGE LOCALIZATION FAILED: null
[TestLog4jLogger_impl.java:327] Exception test message
[TestLog4jLogger_impl.java:333] Exception test message
[TestLog4jLogger_impl.java:334] Exception occurred
[TestLog4jLogger_impl.java:335] MESSAGE LOCALIZATION FAILED: null
[TestLog4jLogger_impl.java:336] Exception occurred
[TestLog4jLogger_impl.java:338] Exception test message
Apr 15, 2016 8:01:10 AM org.apache.uima.util.impl.TestLog4jLogger_impl testLoggerFromUIMAFramework(358)
INFO: ------------------------------------------------------------
Apr 15, 2016 8:01:10 AM org.apache.uima.util.impl.TestLog4jLogger_impl testLoggerFromUIMAFramework(360)
INFO: My first test message
Tests run: 5, Failures: 0, Errors: 0, Skipped: 0, Time elapsed: 0.019 sec - in org.apache.uima.util.impl.TestLog4jLogger_impl
Running org.apache.uima.util.impl.XMLParser_implTest
Tests run: 7, Failures: 0, Errors: 0, Skipped: 0, Time elapsed: 0 sec - in org.apache.uima.util.impl.XMLParser_implTest
Running org.apache.uima.util.LevelTest
Tests run: 11, Failures: 0, Errors: 0, Skipped: 0, Time elapsed: 0.001 sec - in org.apache.uima.util.LevelTest
Running org.apache.uima.util.TestCollectionReader
Tests run: 0, Failures: 0, Errors: 0, Skipped: 0, Time elapsed: 0 sec - in org.apache.uima.util.TestCollectionReader
Running org.apache.uima.util.TypeSystemUtilTest
Tests run: 1, Failures: 0, Errors: 0, Skipped: 0, Time elapsed: 0 sec - in org.apache.uima.util.TypeSystemUtilTest
Running org.apache.uima.util.XMLSerializerTest
Trying to serialize non-XML 1.1 character:  , 0x0 at offset 2 in string starting with  ! "
Java version is Oracle Corporation 1.7.0 Java HotSpot(TM) 64-Bit Server VM 21.0-b17
  javax.xml.transform.TransformerFactory: null
  Transformer version: 1.1
Tests run: 5, Failures: 0, Errors: 0, Skipped: 0, Time elapsed: 0 sec - in org.apache.uima.util.XMLSerializerTest
[INFO] Cobertura: Loaded information on 917 classes.
[INFO] Cobertura: Saved information on 917 classes.

Results :

Tests run: 499, Failures: 0, Errors: 0, Skipped: 0

[JENKINS] Recording test results
[INFO] 
[INFO] --- cobertura-maven-plugin:2.7:cobertura (default) @ uimaj-core ---
[INFO] Cobertura 2.1.1 - GNU GPL License (NO WARRANTY) - See COPYRIGHT file
[INFO] Cobertura: Loaded information on 917 classes.
Report time: 9257ms

[INFO] Cobertura Report generation was successful.
[INFO] 
[INFO] --- maven-pmd-plugin:3.5:cpd (default) @ uimaj-core ---
[DRY] Finding all files that match the pattern cpd.xml
[DRY] Parsing 1 file in F:\jenkins\jenkins-slave\workspace\UIMA-SDK\trunk\uimaj-core\target
[DRY] Successfully parsed file F:\jenkins\jenkins-slave\workspace\UIMA-SDK\trunk\uimaj-core\target\cpd.xml
of module Apache UIMA Base: uimaj-core with 124 unique warnings and 0 duplicates.
[DRY] Computing warning deltas based on reference build #788
[INFO] 
[INFO] --- maven-pmd-plugin:3.5:pmd (default) @ uimaj-core ---
[PMD] Finding all files that match the pattern pmd.xml
[PMD] Parsing 1 file in F:\jenkins\jenkins-slave\workspace\UIMA-SDK\trunk\uimaj-core\target
[PMD] Successfully parsed file F:\jenkins\jenkins-slave\workspace\UIMA-SDK\trunk\uimaj-core\target\pmd.xml
of module Apache UIMA Base: uimaj-core with 2464 unique warnings and 0 duplicates.
[PMD] Computing warning deltas based on reference build #788
[INFO] 
[INFO] --- maven-enforcer-plugin:1.3.1:enforce (enforce-compatibility) @ uimaj-core ---
[INFO] Version specified as <2.8.0>
[INFO] Using <f:\jenkins\jenkins-slave\maven-repositories\0\org\apache\uima\uimaj-core\2.8.0\uimaj-core-2.8.0.jar>
as previous JAR
[INFO] Using <F:\jenkins\jenkins-slave\workspace\UIMA-SDK\trunk\uimaj-core\target\uima-core.jar>
as current JAR
Class org.apache.uima.util.Misc
 Added Field blanks, desc Ljava/lang/String;, access final public static
 Added Method getCallers, desc (II)Ljava/lang/StringBuilder;, access public static
 Added Method elide, desc (Ljava/lang/String;I)Ljava/lang/String;, access public static
 Added Method elide, desc (Ljava/lang/String;IZ)Ljava/lang/String;, access public static
 Added Method replaceWhiteSpace, desc (Ljava/lang/String;Ljava/lang/String;)Ljava/lang/String;,
access public static
 Added Method getCaller, desc ()Ljava/lang/String;, access public static
 Added Field dots, desc Ljava/lang/String;, access final public static
[WARNING] Rule 0: org.semver.enforcer.RequireBackwardCompatibility failed with message:
Current codebase is not backward compatible (BACKWARD_COMPATIBLE_IMPLEMENTER) with version
<2.8.0>. Compatibility type has been detected as <BACKWARD_COMPATIBLE_USER>

Mime
View raw message