uima-dev mailing list archives

Site index · List index
Message view « Date » · « Thread »
Top « Date » · « Thread »
From Apache Jenkins Server <jenk...@builds.apache.org>
Subject Build failed in Jenkins: UIMAJ-SDK_java8 #308
Date Sat, 16 Apr 2016 17:25:45 GMT
See <https://builds.apache.org/job/UIMAJ-SDK_java8/308/changes>

Changes:

[schor] no Jira - remove temporary patch used to profile speed of cas copier - should not
have been checked in. Add one more test for annotation copying

------------------------------------------
[...truncated 5840 lines...]
Running org.apache.uima.flow.impl.FixedFlowControllerTest
Tests run: 3, Failures: 0, Errors: 0, Skipped: 0, Time elapsed: 0.004 sec - in org.apache.uima.flow.impl.FixedFlowControllerTest
Running org.apache.uima.resource.impl.CasManager_implTest
Tests run: 1, Failures: 0, Errors: 0, Skipped: 0, Time elapsed: 0.001 sec - in org.apache.uima.resource.impl.CasManager_implTest
Running org.apache.uima.resource.impl.TestResourceInterface_impl
Tests run: 0, Failures: 0, Errors: 0, Skipped: 0, Time elapsed: 0 sec - in org.apache.uima.resource.impl.TestResourceInterface_impl
Running org.apache.uima.resource.impl.RelativePathResolver_implTest
Tests run: 2, Failures: 0, Errors: 0, Skipped: 0, Time elapsed: 0 sec - in org.apache.uima.resource.impl.RelativePathResolver_implTest
Running org.apache.uima.resource.impl.FileLanguageResource_implTest
Tests run: 1, Failures: 0, Errors: 0, Skipped: 0, Time elapsed: 0 sec - in org.apache.uima.resource.impl.FileLanguageResource_implTest
Running org.apache.uima.resource.impl.URISpecifier_implTest
Tests run: 1, Failures: 0, Errors: 0, Skipped: 0, Time elapsed: 0.002 sec - in org.apache.uima.resource.impl.URISpecifier_implTest
Running org.apache.uima.resource.impl.ResourceCreationSpecifier_implTest
Tests run: 1, Failures: 0, Errors: 0, Skipped: 0, Time elapsed: 0.005 sec - in org.apache.uima.resource.impl.ResourceCreationSpecifier_implTest
Running org.apache.uima.resource.impl.PearSpecifier_implTest
Tests run: 2, Failures: 0, Errors: 0, Skipped: 0, Time elapsed: 0.004 sec - in org.apache.uima.resource.impl.PearSpecifier_implTest
Running org.apache.uima.resource.impl.DataResource_implTest
Tests run: 2, Failures: 0, Errors: 0, Skipped: 0, Time elapsed: 0 sec - in org.apache.uima.resource.impl.DataResource_implTest
Running org.apache.uima.resource.impl.ResourceManager_implTest
Apr 16, 2016 5:25:11 PM org.apache.uima.resource.impl.ResourceManager_impl initializeExternalResources
WARNING: The external resource named MyFileLanguageResource has been declared multiple times
with different definitions. The definition of the resource in component /Annotator1/ will
be used.  The definition in component /Annotator2/ will be ignored.
Tests run: 4, Failures: 0, Errors: 0, Skipped: 0, Time elapsed: 0.017 sec - in org.apache.uima.resource.impl.ResourceManager_implTest
Running org.apache.uima.resource.impl.ConfigurableDataResourceSpecifier_implTest
Tests run: 1, Failures: 0, Errors: 0, Skipped: 0, Time elapsed: 0.004 sec - in org.apache.uima.resource.impl.ConfigurableDataResourceSpecifier_implTest
Running org.apache.uima.resource.impl.ConfigurableDataResource_implTest
Tests run: 1, Failures: 0, Errors: 0, Skipped: 0, Time elapsed: 0 sec - in org.apache.uima.resource.impl.ConfigurableDataResource_implTest
Running org.apache.uima.resource.service.impl.ResourceService_implTest
Tests run: 1, Failures: 0, Errors: 0, Skipped: 0, Time elapsed: 0 sec - in org.apache.uima.resource.service.impl.ResourceService_implTest
Running org.apache.uima.resource.service.impl.ResourceServiceAdapter_implTest
Tests run: 1, Failures: 0, Errors: 0, Skipped: 0, Time elapsed: 0 sec - in org.apache.uima.resource.service.impl.ResourceServiceAdapter_implTest
Running org.apache.uima.resource.service.impl.TestResourceServiceStub
Tests run: 0, Failures: 0, Errors: 0, Skipped: 0, Time elapsed: 0 sec - in org.apache.uima.resource.service.impl.TestResourceServiceStub
Running org.apache.uima.resource.metadata.impl.TestFruitBagObject
Tests run: 0, Failures: 0, Errors: 0, Skipped: 0, Time elapsed: 0 sec - in org.apache.uima.resource.metadata.impl.TestFruitBagObject
Running org.apache.uima.resource.metadata.impl.TestFruitObject
Tests run: 0, Failures: 0, Errors: 0, Skipped: 0, Time elapsed: 0 sec - in org.apache.uima.resource.metadata.impl.TestFruitObject
Running org.apache.uima.resource.metadata.impl.ConfigurationParameterDeclarations_implTest
Tests run: 1, Failures: 0, Errors: 0, Skipped: 0, Time elapsed: 0.006 sec - in org.apache.uima.resource.metadata.impl.ConfigurationParameterDeclarations_implTest
Running org.apache.uima.resource.metadata.impl.ResourceManagerConfiguration_implTest
Tests run: 3, Failures: 0, Errors: 0, Skipped: 0, Time elapsed: 0.025 sec - in org.apache.uima.resource.metadata.impl.ResourceManagerConfiguration_implTest
Running org.apache.uima.resource.metadata.impl.TypePriorities_implTest
Tests run: 3, Failures: 0, Errors: 0, Skipped: 0, Time elapsed: 0.028 sec - in org.apache.uima.resource.metadata.impl.TypePriorities_implTest
Running org.apache.uima.resource.metadata.impl.TypeSystemDescription_implTest
Tests run: 3, Failures: 0, Errors: 0, Skipped: 0, Time elapsed: 0.048 sec - in org.apache.uima.resource.metadata.impl.TypeSystemDescription_implTest
Running org.apache.uima.resource.metadata.impl.FsIndexCollection_implTest
Tests run: 2, Failures: 0, Errors: 0, Skipped: 0, Time elapsed: 0.018 sec - in org.apache.uima.resource.metadata.impl.FsIndexCollection_implTest
Running org.apache.uima.resource.metadata.impl.MetaDataObject_implTest
true
Tests run: 5, Failures: 0, Errors: 0, Skipped: 0, Time elapsed: 0.019 sec - in org.apache.uima.resource.metadata.impl.MetaDataObject_implTest
Running org.apache.uima.resource.metadata.impl.Import_implTest
Tests run: 3, Failures: 0, Errors: 0, Skipped: 0, Time elapsed: 0.014 sec - in org.apache.uima.resource.metadata.impl.Import_implTest
Running org.apache.uima.resource.ConfigurableResource_implTest
Tests run: 2, Failures: 0, Errors: 0, Skipped: 0, Time elapsed: 0.013 sec - in org.apache.uima.resource.ConfigurableResource_implTest
Running org.apache.uima.resource.TestCasConsumer
Tests run: 0, Failures: 0, Errors: 0, Skipped: 0, Time elapsed: 0 sec - in org.apache.uima.resource.TestCasConsumer
Running org.apache.uima.analysis_engine.impl.TestAnnotator2
Tests run: 0, Failures: 0, Errors: 0, Skipped: 0, Time elapsed: 0 sec - in org.apache.uima.analysis_engine.impl.TestAnnotator2
Running org.apache.uima.analysis_engine.impl.FlowControllerForErrorTest
Tests run: 0, Failures: 0, Errors: 0, Skipped: 0, Time elapsed: 0 sec - in org.apache.uima.analysis_engine.impl.FlowControllerForErrorTest
Running org.apache.uima.analysis_engine.impl.AnalysisEngine_implTest
Expected exception: org.apache.uima.resource.ResourceConfigurationException: External override
variable "bad" references the undefined variable "missing"
Expected exception: java.io.IOException: Premature EOF - missing ']'
Apr 16, 2016 5:25:12 PM org.apache.uima.resource.metadata.impl.ResourceMetaData_impl validateConfigurationParameterSettings(264)
WARNING: Ignoring error in parameter setting: Configuration parameter "IntegerArrayParam"
in component "Annotator With Configuration Groups" is multi-valued and must be assigned an
array for its value.
Tests run: 16, Failures: 0, Errors: 0, Skipped: 0, Time elapsed: 0.653 sec - in org.apache.uima.analysis_engine.impl.AnalysisEngine_implTest
Running org.apache.uima.analysis_engine.impl.TaeDescription_implTest
Tests run: 2, Failures: 0, Errors: 0, Skipped: 0, Time elapsed: 0.03 sec - in org.apache.uima.analysis_engine.impl.TaeDescription_implTest
Running org.apache.uima.analysis_engine.impl.AnalysisEngineDescription_implTest
test multicore initialize with 50 threads
Tests run: 10, Failures: 0, Errors: 0, Skipped: 0, Time elapsed: 3.857 sec - in org.apache.uima.analysis_engine.impl.AnalysisEngineDescription_implTest
Running org.apache.uima.analysis_engine.impl.AnnotatorForCollectionProcessCompleteTest
Tests run: 0, Failures: 0, Errors: 0, Skipped: 0, Time elapsed: 0 sec - in org.apache.uima.analysis_engine.impl.AnnotatorForCollectionProcessCompleteTest
Running org.apache.uima.analysis_engine.impl.metadata.SofaMapping_implTest
Tests run: 1, Failures: 0, Errors: 0, Skipped: 0, Time elapsed: 0.003 sec - in org.apache.uima.analysis_engine.impl.metadata.SofaMapping_implTest
Running org.apache.uima.analysis_engine.impl.ResultSpecification_implTest
Tests run: 19, Failures: 0, Errors: 0, Skipped: 0, Time elapsed: 0.01 sec - in org.apache.uima.analysis_engine.impl.ResultSpecification_implTest
Running org.apache.uima.analysis_engine.impl.MultiprocessingAnalysisEngine_implTest
Tests run: 7, Failures: 0, Errors: 0, Skipped: 0, Time elapsed: 12.034 sec - in org.apache.uima.analysis_engine.impl.MultiprocessingAnalysisEngine_implTest
Running org.apache.uima.analysis_engine.impl.TestAnnotator
Tests run: 0, Failures: 0, Errors: 0, Skipped: 0, Time elapsed: 0 sec - in org.apache.uima.analysis_engine.impl.TestAnnotator
Running org.apache.uima.analysis_engine.impl.ResultSpecWithTypeSystemTest
Tests run: 4, Failures: 0, Errors: 0, Skipped: 0, Time elapsed: 0.004 sec - in org.apache.uima.analysis_engine.impl.ResultSpecWithTypeSystemTest
Running org.apache.uima.analysis_engine.impl.AnnotatorContext_implTest
Apr 16, 2016 5:25:28 PM org.apache.uima.impl.RootUimaContext_impl getResourceURL
WARNING: The unmanaged resource org/apache/uima/analysis_engine/impl/testDataFile3.dat was
accessed.This feature is deprecated, and support may be removed in future versions.
Apr 16, 2016 5:25:28 PM org.apache.uima.impl.RootUimaContext_impl getResourceURL
WARNING: The unmanaged resource testDataFile.dat was accessed.This feature is deprecated,
and support may be removed in future versions.
Apr 16, 2016 5:25:28 PM org.apache.uima.impl.RootUimaContext_impl getResourceURL
WARNING: The unmanaged resource subdir was accessed.This feature is deprecated, and support
may be removed in future versions.
Apr 16, 2016 5:25:28 PM org.apache.uima.impl.RootUimaContext_impl getResourceURL
WARNING: The unmanaged resource org/apache/uima/analysis_engine/impl/testDataFile3.dat was
accessed.This feature is deprecated, and support may be removed in future versions.
Apr 16, 2016 5:25:28 PM org.apache.uima.impl.RootUimaContext_impl getResourceURL
WARNING: The unmanaged resource testDataFile.dat was accessed.This feature is deprecated,
and support may be removed in future versions.
Apr 16, 2016 5:25:28 PM org.apache.uima.impl.RootUimaContext_impl getResourceURL
WARNING: The unmanaged resource subdir was accessed.This feature is deprecated, and support
may be removed in future versions.
Apr 16, 2016 5:25:28 PM org.apache.uima.impl.RootUimaContext_impl getResourceURL
WARNING: The unmanaged resource org/apache/uima/analysis_engine/impl/testDataFile3.dat was
accessed.This feature is deprecated, and support may be removed in future versions.
Apr 16, 2016 5:25:28 PM org.apache.uima.impl.RootUimaContext_impl getResourceURL
WARNING: The unmanaged resource testDataFile.dat was accessed.This feature is deprecated,
and support may be removed in future versions.
Apr 16, 2016 5:25:28 PM org.apache.uima.impl.RootUimaContext_impl getResourceURL
WARNING: The unmanaged resource subdir was accessed.This feature is deprecated, and support
may be removed in future versions.
Apr 16, 2016 5:25:28 PM org.apache.uima.impl.RootUimaContext_impl getResourceAsStream
WARNING: The unmanaged resource org/apache/uima/analysis_engine/impl/testDataFile3.dat was
accessed.This feature is deprecated, and support may be removed in future versions.
Apr 16, 2016 5:25:28 PM org.apache.uima.impl.RootUimaContext_impl getResourceAsStream
WARNING: The unmanaged resource subdir was accessed.This feature is deprecated, and support
may be removed in future versions.
Apr 16, 2016 5:25:28 PM org.apache.uima.impl.RootUimaContext_impl getResourceAsStream
WARNING: The unmanaged resource testDataFile.dat was accessed.This feature is deprecated,
and support may be removed in future versions.
Tests run: 16, Failures: 0, Errors: 0, Skipped: 0, Time elapsed: 0.407 sec - in org.apache.uima.analysis_engine.impl.AnnotatorContext_implTest
Running org.apache.uima.analysis_engine.impl.sequencer.SequencerCapabilityLanguageTest
Tests run: 24, Failures: 0, Errors: 0, Skipped: 0, Time elapsed: 0.383 sec - in org.apache.uima.analysis_engine.impl.sequencer.SequencerCapabilityLanguageTest
Running org.apache.uima.analysis_engine.impl.sequencer.SequencerFixedTest
Tests run: 7, Failures: 0, Errors: 0, Skipped: 0, Time elapsed: 0.106 sec - in org.apache.uima.analysis_engine.impl.sequencer.SequencerFixedTest
Running org.apache.uima.analysis_engine.impl.AnalysisEngineManagementImplTest
test multicore AnalysisEngineManagementImpl getRootName with 50 threads
Tests run: 1, Failures: 0, Errors: 0, Skipped: 0, Time elapsed: 0.282 sec - in org.apache.uima.analysis_engine.impl.AnalysisEngineManagementImplTest
Running org.apache.uima.analysis_engine.impl.ResultSpecTest
Tests run: 3, Failures: 0, Errors: 0, Skipped: 0, Time elapsed: 0.017 sec - in org.apache.uima.analysis_engine.impl.ResultSpecTest
[INFO] Cobertura: Loaded information on 917 classes.
[INFO] Cobertura: Saved information on 917 classes.

Results :

Tests run: 499, Failures: 0, Errors: 0, Skipped: 0

[JENKINS] Recording test results
[INFO] 
[INFO] --- cobertura-maven-plugin:2.7:cobertura (default) @ uimaj-core ---
[INFO] Cobertura 2.1.1 - GNU GPL License (NO WARRANTY) - See COPYRIGHT file
[INFO] Cobertura: Loaded information on 917 classes.
Report time: 2959ms

[INFO] Cobertura Report generation was successful.
[INFO] 
[INFO] --- maven-pmd-plugin:3.5:cpd (default) @ uimaj-core ---
[INFO] 
[INFO] --- maven-pmd-plugin:3.5:pmd (default) @ uimaj-core ---
[INFO] 
[INFO] --- maven-enforcer-plugin:1.3.1:enforce (enforce-compatibility) @ uimaj-core ---
[INFO] Version specified as <2.8.0>
[INFO] Using </home/jenkins/jenkins-slave/maven-repositories/0/org/apache/uima/uimaj-core/2.8.0/uimaj-core-2.8.0.jar>
as previous JAR
[INFO] Using <<https://builds.apache.org/job/UIMAJ-SDK_java8/ws/uimaj-core/target/uima-core.jar>>
as current JAR
Class org.apache.uima.util.Misc
 Added Method getCallers, desc (II)Ljava/lang/StringBuilder;, access public static
 Added Method replaceWhiteSpace, desc (Ljava/lang/String;Ljava/lang/String;)Ljava/lang/String;,
access public static
 Added Field dots, desc Ljava/lang/String;, access final public static
 Added Method elide, desc (Ljava/lang/String;IZ)Ljava/lang/String;, access public static
 Added Method getCaller, desc ()Ljava/lang/String;, access public static
 Added Field blanks, desc Ljava/lang/String;, access final public static
 Added Method elide, desc (Ljava/lang/String;I)Ljava/lang/String;, access public static
[WARNING] Rule 0: org.semver.enforcer.RequireBackwardCompatibility failed with message:
Current codebase is not backward compatible (BACKWARD_COMPATIBLE_IMPLEMENTER) with version
<2.8.0>. Compatibility type has been detected as <BACKWARD_COMPATIBLE_USER>
[INFO]                                                                         
[INFO] ------------------------------------------------------------------------
[INFO] Skipping Apache UIMA Java SDK: uimaj
[INFO] This project has been banned from the build due to previous failures.
[INFO] ------------------------------------------------------------------------
[INFO] ------------------------------------------------------------------------
[INFO] Reactor Summary:
[INFO] 
[INFO] Apache UIMA Java SDK: uimaj-parent ................ SUCCESS [10.228s]
[INFO] Apache UIMA Base: uimaj-test-util: JUnit utilities  SUCCESS [14.796s]
[INFO] Apache UIMA Base: uimaj-core ...................... FAILURE [3:08.399s]
[INFO] Apache UIMA Base: jVinci: Vinci Transport Library . SKIPPED
[INFO] Apache UIMA Base: uimaj-adapter-vinci: Vinci Adapter  SKIPPED
[INFO] Apache UIMA Base: uimaj-cpe: Collection Processing Engine  SKIPPED
[INFO] Apache UIMA Base: uimaj-document-annotation ....... SKIPPED
[INFO] Apache UIMA Base: uimaj-tools: Tools .............. SKIPPED
[INFO] Apache UIMA Base: uimaj-examples: SDK Examples .... SKIPPED
[INFO] Apache UIMA Base: uimaj-adapter-soap: SOAP Adapter  SKIPPED
[INFO] Apache UIMA Base: uimaj-component-test-util: for JUnit  SKIPPED
[INFO] Apache UIMA Eclipse: uimaj-ep-debug ............... SKIPPED
[INFO] Apache UIMA Eclipse: uimaj-ep-jcasgen ............. SKIPPED
[INFO] Apache UIMA Eclipse: uimaj-ep-configurator: Descriptor Editor  SKIPPED
[INFO] Apache UIMA Eclipse: uimaj-ep-pear-packager ....... SKIPPED
[INFO] Apache UIMA Eclipse: uimaj-ep-launcher ............ SKIPPED
[INFO] Apache UIMA Eclipse: uimaj-ep-cas-editor .......... SKIPPED
[INFO] Apache UIMA Eclipse: uimaj-ep-cas-editor-ide ...... SKIPPED
[INFO] Apache UIMA Eclipse: uimaj-ep-runtime ............. SKIPPED
[INFO] Apache UIMA Eclipse: uimaj-eclipse-feature-tools .. SKIPPED
[INFO] Apache UIMA Eclipse: uimaj-eclipse-feature-runtime  SKIPPED
[INFO] Apache UIMA Aggregate: aggregate-uimaj-eclipse-plugins  SKIPPED
[INFO] Apache UIMA SDK Documentation - overview and setup  SKIPPED
[INFO] Apache UIMA SDK Documentation - references ........ SKIPPED
[INFO] Apache UIMA SDK Documentation - tools ............. SKIPPED
[INFO] Apache UIMA SDK Documentation - tutorials and user's guides  SKIPPED
[INFO] Apache UIMA Aggregate: aggregate-uimaj-docbooks ... SKIPPED
[INFO] Apache UIMA Maven: PearPackagingMavenPlugin ....... SKIPPED
[INFO] Apache UIMA Maven: jcasgen-maven-plugin ........... SKIPPED
[INFO] Apache UIMA Base: uimaj-bootstrap ................. SKIPPED
[INFO] Apache UIMA Aggregate: aggregate-uimaj ............ SKIPPED
[INFO] Apache UIMA Base: uimaj-json: JSON ................ SKIPPED
[INFO] Apache UIMA Java SDK: uimaj ....................... SKIPPED
[INFO] ------------------------------------------------------------------------
[INFO] BUILD FAILURE
[INFO] ------------------------------------------------------------------------
[INFO] Total time: 3:36.729s
[INFO] Finished at: Sat Apr 16 17:25:43 UTC 2016
[INFO] Final Memory: 89M/874M
[INFO] ------------------------------------------------------------------------
Waiting for Jenkins to finish collecting data[ERROR] Failed to execute goal org.apache.maven.plugins:maven-enforcer-plugin:1.3.1:enforce
(enforce-compatibility) on project uimaj-core: Some Enforcer rules have failed. Look above
for specific messages explaining why the rule failed. -> [Help 1]
[ERROR] 
[ERROR] To see the full stack trace of the errors, re-run Maven with the -e switch.
[ERROR] Re-run Maven using the -X switch to enable full debug logging.
[ERROR] 
[ERROR] For more information about the errors and possible solutions, please read the following
articles:
[ERROR] [Help 1] http://cwiki.apache.org/confluence/display/MAVEN/MojoExecutionException
[ERROR] 
[ERROR] After correcting the problems, you can resume the build with the command
[ERROR]   mvn <goals> -rf :uimaj-core

[JENKINS] Archiving <https://builds.apache.org/job/UIMAJ-SDK_java8/ws/uimaj-adapter-soap/pom.xml>
to org.apache.uima/uimaj-adapter-soap/2.8.2-SNAPSHOT/uimaj-adapter-soap-2.8.2-SNAPSHOT.pom
[JENKINS] Archiving <https://builds.apache.org/job/UIMAJ-SDK_java8/ws/uimaj-core/pom.xml>
to org.apache.uima/uimaj-core/2.8.2-SNAPSHOT/uimaj-core-2.8.2-SNAPSHOT.pom
[JENKINS] Archiving <https://builds.apache.org/job/UIMAJ-SDK_java8/ws/uimaj-core/target/uima-core.jar>
to org.apache.uima/uimaj-core/2.8.2-SNAPSHOT/uimaj-core-2.8.2-SNAPSHOT.jar
[JENKINS] Archiving <https://builds.apache.org/job/UIMAJ-SDK_java8/ws/uimaj-test-util/pom.xml>
to org.apache.uima/uimaj-test-util/2.8.2-SNAPSHOT/uimaj-test-util-2.8.2-SNAPSHOT.pom
[JENKINS] Archiving <https://builds.apache.org/job/UIMAJ-SDK_java8/ws/uimaj-test-util/target/uimaj-test-util-2.8.2-SNAPSHOT.jar>
to org.apache.uima/uimaj-test-util/2.8.2-SNAPSHOT/uimaj-test-util-2.8.2-SNAPSHOT.jar
[JENKINS] Archiving <https://builds.apache.org/job/UIMAJ-SDK_java8/ws/uimaj-eclipse-feature-tools/pom.xml>
to org.apache.uima/uimaj-eclipse-feature-tools/2.8.2-SNAPSHOT/uimaj-eclipse-feature-tools-2.8.2-SNAPSHOT.pom
[JENKINS] Archiving <https://builds.apache.org/job/UIMAJ-SDK_java8/ws/PearPackagingMavenPlugin/pom.xml>
to org.apache.uima/PearPackagingMavenPlugin/2.8.2-SNAPSHOT/PearPackagingMavenPlugin-2.8.2-SNAPSHOT.pom
[JENKINS] Archiving <https://builds.apache.org/job/UIMAJ-SDK_java8/ws/uimaj-ep-cas-editor-ide/pom.xml>
to org.apache.uima/uimaj-ep-cas-editor-ide/2.8.2-SNAPSHOT/uimaj-ep-cas-editor-ide-2.8.2-SNAPSHOT.pom
[JENKINS] Archiving <https://builds.apache.org/job/UIMAJ-SDK_java8/ws/uimaj-ep-runtime/pom.xml>
to org.apache.uima/uimaj-ep-runtime/2.8.2-SNAPSHOT/uimaj-ep-runtime-2.8.2-SNAPSHOT.pom
[JENKINS] Archiving <https://builds.apache.org/job/UIMAJ-SDK_java8/ws/uimaj-tools/pom.xml>
to org.apache.uima/uimaj-tools/2.8.2-SNAPSHOT/uimaj-tools-2.8.2-SNAPSHOT.pom
[JENKINS] Archiving <https://builds.apache.org/job/UIMAJ-SDK_java8/ws/uimaj-ep-jcasgen/pom.xml>
to org.apache.uima/uimaj-ep-jcasgen/2.8.2-SNAPSHOT/uimaj-ep-jcasgen-2.8.2-SNAPSHOT.pom
[JENKINS] Archiving <https://builds.apache.org/job/UIMAJ-SDK_java8/ws/uimaj-ep-debug/pom.xml>
to org.apache.uima/uimaj-ep-debug/2.8.2-SNAPSHOT/uimaj-ep-debug-2.8.2-SNAPSHOT.pom
[JENKINS] Archiving <https://builds.apache.org/job/UIMAJ-SDK_java8/ws/aggregate-uimaj-eclipse-plugins/pom.xml>
to org.apache.uima/aggregate-uimaj-eclipse-plugins/2.8.2-SNAPSHOT/aggregate-uimaj-eclipse-plugins-2.8.2-SNAPSHOT.pom
[JENKINS] Archiving <https://builds.apache.org/job/UIMAJ-SDK_java8/ws/uima-docbook-tools/pom.xml>
to org.apache.uima/uima-docbook-tools/2.8.2-SNAPSHOT/uima-docbook-tools-2.8.2-SNAPSHOT.pom
[JENKINS] Archiving <https://builds.apache.org/job/UIMAJ-SDK_java8/ws/uimaj-eclipse-feature-runtime/pom.xml>
to org.apache.uima/uimaj-eclipse-feature-runtime/2.8.2-SNAPSHOT/uimaj-eclipse-feature-runtime-2.8.2-SNAPSHOT.pom
[JENKINS] Archiving <https://builds.apache.org/job/UIMAJ-SDK_java8/ws/uimaj-adapter-vinci/pom.xml>
to org.apache.uima/uimaj-adapter-vinci/2.8.2-SNAPSHOT/uimaj-adapter-vinci-2.8.2-SNAPSHOT.pom
[JENKINS] Archiving <https://builds.apache.org/job/UIMAJ-SDK_java8/ws/uimaj-bootstrap/pom.xml>
to org.apache.uima/uimaj-bootstrap/2.8.2-SNAPSHOT/uimaj-bootstrap-2.8.2-SNAPSHOT.pom
[JENKINS] Archiving <https://builds.apache.org/job/UIMAJ-SDK_java8/ws/uimaj-json/pom.xml>
to org.apache.uima/uimaj-json/2.8.2-SNAPSHOT/uimaj-json-2.8.2-SNAPSHOT.pom
[JENKINS] Archiving <https://builds.apache.org/job/UIMAJ-SDK_java8/ws/uimaj-ep-pear-packager/pom.xml>
to org.apache.uima/uimaj-ep-pear-packager/2.8.2-SNAPSHOT/uimaj-ep-pear-packager-2.8.2-SNAPSHOT.pom
[JENKINS] Archiving <https://builds.apache.org/job/UIMAJ-SDK_java8/ws/uimaj-parent/pom.xml>
to org.apache.uima/uimaj-parent/2.8.2-SNAPSHOT/uimaj-parent-2.8.2-SNAPSHOT.pom
No artifacts from UIMAJ-SDK_java8 ยป Apache UIMA Java SDK: uimaj-parent #307 to compare, so
performing full copy of artifacts
[JENKINS] Archiving <https://builds.apache.org/job/UIMAJ-SDK_java8/ws/uimaj-examples/pom.xml>
to org.apache.uima/uimaj-examples/2.8.2-SNAPSHOT/uimaj-examples-2.8.2-SNAPSHOT.pom
[JENKINS] Archiving <https://builds.apache.org/job/UIMAJ-SDK_java8/ws/uimaj-ep-configurator/pom.xml>
to org.apache.uima/uimaj-ep-configurator/2.8.2-SNAPSHOT/uimaj-ep-configurator-2.8.2-SNAPSHOT.pom
[JENKINS] Archiving <https://builds.apache.org/job/UIMAJ-SDK_java8/ws/uima-docbook-overview-and-setup/pom.xml>
to org.apache.uima/uima-docbook-overview-and-setup/2.8.2-SNAPSHOT/uima-docbook-overview-and-setup-2.8.2-SNAPSHOT.pom
[JENKINS] Archiving <https://builds.apache.org/job/UIMAJ-SDK_java8/ws/uimaj-document-annotation/pom.xml>
to org.apache.uima/uimaj-document-annotation/2.8.2-SNAPSHOT/uimaj-document-annotation-2.8.2-SNAPSHOT.pom
[JENKINS] Archiving <https://builds.apache.org/job/UIMAJ-SDK_java8/ws/uimaj-cpe/pom.xml>
to org.apache.uima/uimaj-cpe/2.8.2-SNAPSHOT/uimaj-cpe-2.8.2-SNAPSHOT.pom
[JENKINS] Archiving <https://builds.apache.org/job/UIMAJ-SDK_java8/ws/uima-docbook-references/pom.xml>
to org.apache.uima/uima-docbook-references/2.8.2-SNAPSHOT/uima-docbook-references-2.8.2-SNAPSHOT.pom
[JENKINS] Archiving <https://builds.apache.org/job/UIMAJ-SDK_java8/ws/uimaj-ep-cas-editor/pom.xml>
to org.apache.uima/uimaj-ep-cas-editor/2.8.2-SNAPSHOT/uimaj-ep-cas-editor-2.8.2-SNAPSHOT.pom
[JENKINS] Archiving <https://builds.apache.org/job/UIMAJ-SDK_java8/ws/jcasgen-maven-plugin/pom.xml>
to org.apache.uima/jcasgen-maven-plugin/2.8.2-SNAPSHOT/jcasgen-maven-plugin-2.8.2-SNAPSHOT.pom
[JENKINS] Archiving <https://builds.apache.org/job/UIMAJ-SDK_java8/ws/uimaj-ep-launcher/pom.xml>
to org.apache.uima/uimaj-ep-launcher/2.8.2-SNAPSHOT/uimaj-ep-launcher-2.8.2-SNAPSHOT.pom
[JENKINS] Archiving <https://builds.apache.org/job/UIMAJ-SDK_java8/ws/aggregate-uimaj/pom.xml>
to org.apache.uima/aggregate-uimaj/2.8.2-SNAPSHOT/aggregate-uimaj-2.8.2-SNAPSHOT.pom
[JENKINS] Archiving <https://builds.apache.org/job/UIMAJ-SDK_java8/ws/aggregate-uimaj-docbooks/pom.xml>
to org.apache.uima/aggregate-uimaj-docbooks/2.8.2-SNAPSHOT/aggregate-uimaj-docbooks-2.8.2-SNAPSHOT.pom
[JENKINS] Archiving <https://builds.apache.org/job/UIMAJ-SDK_java8/ws/pom.xml> to org.apache.uima/uimaj/2.8.2-SNAPSHOT/uimaj-2.8.2-SNAPSHOT.pom
[JENKINS] Archiving <https://builds.apache.org/job/UIMAJ-SDK_java8/ws/uimaj-component-test-util/pom.xml>
to org.apache.uima/uimaj-component-test-util/2.8.2-SNAPSHOT/uimaj-component-test-util-2.8.2-SNAPSHOT.pom
[JENKINS] Archiving <https://builds.apache.org/job/UIMAJ-SDK_java8/ws/uima-docbook-tutorials-and-users-guides/pom.xml>
to org.apache.uima/uima-docbook-tutorials-and-users-guides/2.8.2-SNAPSHOT/uima-docbook-tutorials-and-users-guides-2.8.2-SNAPSHOT.pom
[JENKINS] Archiving <https://builds.apache.org/job/UIMAJ-SDK_java8/ws/jVinci/pom.xml>
to org.apache.uima/jVinci/2.8.2-SNAPSHOT/jVinci-2.8.2-SNAPSHOT.pom
Sending e-mails to: dev@uima.apache.org
Sending e-mails to: dev@uima.apache.org
channel stopped

Mime
View raw message