uima-dev mailing list archives

Site index · List index
Message view « Date » · « Thread »
Top « Date » · « Thread »
From Apache Jenkins Server <jenk...@builds.apache.org>
Subject Build failed in Jenkins: UIMA-SDK #791
Date Sat, 16 Apr 2016 05:01:51 GMT
See <https://builds.apache.org/job/UIMA-SDK/791/changes>

Changes:

[schor] no Jira - remove temporary patch used to profile speed of cas copier - should not
have been checked in. Add one more test for annotation copying

------------------------------------------
[...truncated 5885 lines...]
JCas Type "org.apache.lang.LanguagePair" implements getters and setters for feature "description",
but the type system doesnt define that feature.

Apr 16, 2016 4:59:40 AM org.apache.uima.jcas.impl.JCasImpl getJCas(768)
WARNING: 
JCas Type "org.apache.lang.LanguagePair" implements getters and setters for feature "description",
but the type system doesnt define that feature.

Apr 16, 2016 4:59:40 AM org.apache.uima.jcas.impl.JCasImpl getJCas(768)
WARNING: 
JCas Type "org.apache.lang.LanguagePair" implements getters and setters for feature "description",
but the type system doesnt define that feature.

Apr 16, 2016 4:59:40 AM org.apache.uima.jcas.impl.JCasImpl getJCas(768)
WARNING: 
JCas Type "org.apache.lang.LanguagePair" implements getters and setters for feature "description",
but the type system doesnt define that feature.

Apr 16, 2016 4:59:40 AM org.apache.uima.jcas.impl.JCasImpl getJCas(768)
WARNING: 
JCas Type "org.apache.lang.LanguagePair" implements getters and setters for feature "description",
but the type system doesnt define that feature.

Apr 16, 2016 4:59:40 AM org.apache.uima.jcas.impl.JCasImpl getJCas(768)
WARNING: 
JCas Type "org.apache.lang.LanguagePair" implements getters and setters for feature "description",
but the type system doesnt define that feature.

Apr 16, 2016 4:59:40 AM org.apache.uima.jcas.impl.JCasImpl getJCas(768)
WARNING: 
JCas Type "org.apache.lang.LanguagePair" implements getters and setters for feature "description",
but the type system doesnt define that feature.

Apr 16, 2016 4:59:40 AM org.apache.uima.jcas.impl.JCasImpl getJCas(768)
WARNING: 
JCas Type "org.apache.lang.LanguagePair" implements getters and setters for feature "description",
but the type system doesnt define that feature.

Apr 16, 2016 4:59:40 AM org.apache.uima.jcas.impl.JCasImpl getJCas(768)
WARNING: 
JCas Type "org.apache.lang.LanguagePair" implements getters and setters for feature "description",
but the type system doesnt define that feature.

Apr 16, 2016 4:59:40 AM org.apache.uima.jcas.impl.JCasImpl getJCas(768)
WARNING: 
JCas Type "org.apache.lang.LanguagePair" implements getters and setters for feature "description",
but the type system doesnt define that feature.

Apr 16, 2016 4:59:40 AM org.apache.uima.jcas.impl.JCasImpl getJCas(768)
WARNING: 
JCas Type "org.apache.lang.LanguagePair" implements getters and setters for feature "description",
but the type system doesnt define that feature.

Apr 16, 2016 4:59:40 AM org.apache.uima.jcas.impl.JCasImpl getJCas(768)
WARNING: 
JCas Type "org.apache.lang.LanguagePair" implements getters and setters for feature "description",
but the type system doesnt define that feature.

Apr 16, 2016 4:59:40 AM org.apache.uima.jcas.impl.JCasImpl getJCas(768)
WARNING: 
JCas Type "org.apache.lang.LanguagePair" implements getters and setters for feature "description",
but the type system doesnt define that feature.

Apr 16, 2016 4:59:40 AM org.apache.uima.jcas.impl.JCasImpl getJCas(768)
WARNING: 
JCas Type "org.apache.lang.LanguagePair" implements getters and setters for feature "description",
but the type system doesnt define that feature.

test multicore iterator with 20 threads
Apr 16, 2016 4:59:42 AM org.apache.uima.jcas.impl.JCasImpl getJCas(768)
WARNING: 
JCas Type "org.apache.lang.LanguagePair" implements getters and setters for feature "description",
but the type system doesnt define that feature.

Apr 16, 2016 4:59:42 AM org.apache.uima.jcas.impl.JCasImpl getJCas(768)
WARNING: 
JCas Type "org.apache.lang.LanguagePair" implements getters and setters for feature "description",
but the type system doesnt define that feature.

Apr 16, 2016 4:59:42 AM org.apache.uima.jcas.impl.JCasImpl getJCas(768)
WARNING: 
JCas Type "org.apache.lang.LanguagePair" implements getters and setters for feature "description",
but the type system doesnt define that feature.

Apr 16, 2016 4:59:42 AM org.apache.uima.jcas.impl.JCasImpl getJCas(768)
WARNING: 
JCas Type "org.apache.lang.LanguagePair" implements getters and setters for feature "description",
but the type system doesnt define that feature.

Apr 16, 2016 4:59:42 AM org.apache.uima.jcas.impl.JCasImpl getJCas(768)
WARNING: 
JCas Type "org.apache.lang.LanguagePair" implements getters and setters for feature "description",
but the type system doesnt define that feature.

Apr 16, 2016 4:59:42 AM org.apache.uima.jcas.impl.JCasImpl getJCas(768)
WARNING: 
JCas Type "org.apache.lang.LanguagePair" implements getters and setters for feature "description",
but the type system doesnt define that feature.

Tests run: 10, Failures: 0, Errors: 0, Skipped: 0, Time elapsed: 2.281 sec - in org.apache.uima.cas.test.IteratorTest
Running org.apache.uima.cas.test.JcasSofaTest
Tests run: 4, Failures: 0, Errors: 0, Skipped: 0, Time elapsed: 0.055 sec - in org.apache.uima.cas.test.JcasSofaTest
Running org.apache.uima.cas.test.TestAnnotator
Tests run: 0, Failures: 0, Errors: 0, Skipped: 0, Time elapsed: 0 sec - in org.apache.uima.cas.test.TestAnnotator
Running org.apache.uima.cas.test.GrowingTheCasTest
JCasHashMap concurrency reduced, capacity: 256 DefaultConcur: 128, concur: 8

Tests run: 1, Failures: 0, Errors: 0, Skipped: 0, Time elapsed: 5.62 sec - in org.apache.uima.cas.test.GrowingTheCasTest
Running org.apache.uima.cas.test.CompleteSerializationTest
Tests run: 1, Failures: 0, Errors: 0, Skipped: 0, Time elapsed: 0.01 sec - in org.apache.uima.cas.test.CompleteSerializationTest
Running org.apache.uima.cas.test.AnnotationTreeTest
Tests run: 1, Failures: 0, Errors: 0, Skipped: 0, Time elapsed: 0.031 sec - in org.apache.uima.cas.test.AnnotationTreeTest
Running org.apache.uima.cas.test.CASTest
Tests run: 7, Failures: 0, Errors: 0, Skipped: 0, Time elapsed: 0.067 sec - in org.apache.uima.cas.test.CASTest
Running org.apache.uima.cas.test.FilteredIteratorTest
Tests run: 5, Failures: 0, Errors: 0, Skipped: 0, Time elapsed: 0.014 sec - in org.apache.uima.cas.test.FilteredIteratorTest
Running org.apache.uima.cas.test.IntArrayFSTest
Tests run: 2, Failures: 0, Errors: 0, Skipped: 0, Time elapsed: 0.003 sec - in org.apache.uima.cas.test.IntArrayFSTest
Running org.apache.uima.cas.test.TypeSystemReinitTest
Tests run: 2, Failures: 0, Errors: 0, Skipped: 0, Time elapsed: 0.018 sec - in org.apache.uima.cas.test.TypeSystemReinitTest
Running org.apache.uima.cas.test.SerializationNoMDTest
Tests run: 1, Failures: 0, Errors: 0, Skipped: 0, Time elapsed: 0.394 sec - in org.apache.uima.cas.test.SerializationNoMDTest
Running org.apache.uima.cas.test.TypePriorityTest
Tests run: 3, Failures: 0, Errors: 0, Skipped: 0, Time elapsed: 0.125 sec - in org.apache.uima.cas.test.TypePriorityTest
Running org.apache.uima.cas.test.ArrayIndexTest
Tests run: 1, Failures: 0, Errors: 0, Skipped: 0, Time elapsed: 0.012 sec - in org.apache.uima.cas.test.ArrayIndexTest
Running org.apache.uima.cas.test.FloatArrayFSTest
Tests run: 2, Failures: 0, Errors: 0, Skipped: 0, Time elapsed: 0.005 sec - in org.apache.uima.cas.test.FloatArrayFSTest
Running org.apache.uima.cas.test.StringArrayTest
Tests run: 4, Failures: 0, Errors: 0, Skipped: 0, Time elapsed: 0.011 sec - in org.apache.uima.cas.test.StringArrayTest
[INFO] Cobertura: Loaded information on 917 classes.
[INFO] Cobertura: Saved information on 917 classes.

Results :

Tests run: 499, Failures: 0, Errors: 0, Skipped: 0

[JENKINS] Recording test results
[INFO] 
[INFO] --- cobertura-maven-plugin:2.7:cobertura (default) @ uimaj-core ---
[INFO] Cobertura 2.1.1 - GNU GPL License (NO WARRANTY) - See COPYRIGHT file
[INFO] Cobertura: Loaded information on 917 classes.
Report time: 5608ms

[INFO] Cobertura Report generation was successful.
[INFO] 
[INFO] --- maven-pmd-plugin:3.5:cpd (default) @ uimaj-core ---
[DRY] Finding all files that match the pattern cpd.xml
[DRY] Parsing 1 file in <https://builds.apache.org/job/UIMA-SDK/ws/trunk/uimaj-core/target>
[DRY] Successfully parsed file <https://builds.apache.org/job/UIMA-SDK/ws/trunk/uimaj-core/target/cpd.xml>
of module Apache UIMA Base: uimaj-core with 124 unique warnings and 0 duplicates.
[DRY] Computing warning deltas based on reference build #788
[INFO] 
[INFO] --- maven-pmd-plugin:3.5:pmd (default) @ uimaj-core ---
[PMD] Finding all files that match the pattern pmd.xml
[PMD] Parsing 1 file in <https://builds.apache.org/job/UIMA-SDK/ws/trunk/uimaj-core/target>
[PMD] Successfully parsed file <https://builds.apache.org/job/UIMA-SDK/ws/trunk/uimaj-core/target/pmd.xml>
of module Apache UIMA Base: uimaj-core with 2464 unique warnings and 0 duplicates.
[PMD] Computing warning deltas based on reference build #788
[INFO] 
[INFO] --- maven-enforcer-plugin:1.3.1:enforce (enforce-compatibility) @ uimaj-core ---
[INFO] Version specified as <2.8.0>
[INFO] Using </home/jenkins/jenkins-slave/maven-repositories/0/org/apache/uima/uimaj-core/2.8.0/uimaj-core-2.8.0.jar>
as previous JAR
[INFO] Using <<https://builds.apache.org/job/UIMA-SDK/ws/trunk/uimaj-core/target/uima-core.jar>>
as current JAR
Class org.apache.uima.util.Misc
 Added Method getCaller, desc ()Ljava/lang/String;, access public static
 Added Field dots, desc Ljava/lang/String;, access final public static
 Added Method elide, desc (Ljava/lang/String;I)Ljava/lang/String;, access public static
 Added Field blanks, desc Ljava/lang/String;, access final public static
 Added Method getCallers, desc (II)Ljava/lang/StringBuilder;, access public static
 Added Method replaceWhiteSpace, desc (Ljava/lang/String;Ljava/lang/String;)Ljava/lang/String;,
access public static
 Added Method elide, desc (Ljava/lang/String;IZ)Ljava/lang/String;, access public static
[WARNING] Rule 0: org.semver.enforcer.RequireBackwardCompatibility failed with message:
Current codebase is not backward compatible (BACKWARD_COMPATIBLE_IMPLEMENTER) with version
<2.8.0>. Compatibility type has been detected as <BACKWARD_COMPATIBLE_USER>
[INFO]                                                                         
[INFO] ------------------------------------------------------------------------
[INFO] Skipping Apache UIMA Java SDK: uimaj
[INFO] This project has been banned from the build due to previous failures.
[INFO] ------------------------------------------------------------------------
[INFO] ------------------------------------------------------------------------
[INFO] Reactor Summary:
[INFO] 
[INFO] Apache UIMA Java SDK: uimaj-parent ................ SUCCESS [54.259s]
[INFO] Apache UIMA Base: uimaj-test-util: JUnit utilities  SUCCESS [1:34.863s]
[INFO] Apache UIMA Base: uimaj-core ...................... FAILURE [5:51.442s]
[INFO] Apache UIMA Base: jVinci: Vinci Transport Library . SKIPPED
[INFO] Apache UIMA Base: uimaj-adapter-vinci: Vinci Adapter  SKIPPED
[INFO] Apache UIMA Base: uimaj-cpe: Collection Processing Engine  SKIPPED
[INFO] Apache UIMA Base: uimaj-document-annotation ....... SKIPPED
[INFO] Apache UIMA Base: uimaj-tools: Tools .............. SKIPPED
[INFO] Apache UIMA Base: uimaj-examples: SDK Examples .... SKIPPED
[INFO] Apache UIMA Base: uimaj-adapter-soap: SOAP Adapter  SKIPPED
[INFO] Apache UIMA Base: uimaj-component-test-util: for JUnit  SKIPPED
[INFO] Apache UIMA Eclipse: uimaj-ep-debug ............... SKIPPED
[INFO] Apache UIMA Eclipse: uimaj-ep-jcasgen ............. SKIPPED
[INFO] Apache UIMA Eclipse: uimaj-ep-configurator: Descriptor Editor  SKIPPED
[INFO] Apache UIMA Eclipse: uimaj-ep-pear-packager ....... SKIPPED
[INFO] Apache UIMA Eclipse: uimaj-ep-launcher ............ SKIPPED
[INFO] Apache UIMA Eclipse: uimaj-ep-cas-editor .......... SKIPPED
[INFO] Apache UIMA Eclipse: uimaj-ep-cas-editor-ide ...... SKIPPED
[INFO] Apache UIMA Eclipse: uimaj-ep-runtime ............. SKIPPED
[INFO] Apache UIMA Eclipse: uimaj-eclipse-feature-tools .. SKIPPED
[INFO] Apache UIMA Eclipse: uimaj-eclipse-feature-runtime  SKIPPED
[INFO] Apache UIMA Aggregate: aggregate-uimaj-eclipse-plugins  SKIPPED
[INFO] Apache UIMA SDK Documentation - overview and setup  SKIPPED
[INFO] Apache UIMA SDK Documentation - references ........ SKIPPED
[INFO] Apache UIMA SDK Documentation - tools ............. SKIPPED
[INFO] Apache UIMA SDK Documentation - tutorials and user's guides  SKIPPED
[INFO] Apache UIMA Aggregate: aggregate-uimaj-docbooks ... SKIPPED
[INFO] Apache UIMA Maven: PearPackagingMavenPlugin ....... SKIPPED
[INFO] Apache UIMA Maven: jcasgen-maven-plugin ........... SKIPPED
[INFO] Apache UIMA Base: uimaj-bootstrap ................. SKIPPED
[INFO] Apache UIMA Aggregate: aggregate-uimaj ............ SKIPPED
[INFO] Apache UIMA Base: uimaj-json: JSON ................ SKIPPED
[INFO] Apache UIMA Java SDK: uimaj ....................... SKIPPED
[INFO] ------------------------------------------------------------------------
[INFO] BUILD FAILURE
[INFO] ------------------------------------------------------------------------
[INFO] Total time: 8:35.206s
[INFO] Finished at: Sat Apr 16 05:01:29 UTC 2016
[INFO] Final Memory: 85M/396M
[INFO] ------------------------------------------------------------------------
Waiting for Jenkins to finish collecting data
[ERROR] Failed to execute goal org.apache.maven.plugins:maven-enforcer-plugin:1.3.1:enforce
(enforce-compatibility) on project uimaj-core: Some Enforcer rules have failed. Look above
for specific messages explaining why the rule failed. -> [Help 1]
[ERROR] 
[ERROR] To see the full stack trace of the errors, re-run Maven with the -e switch.
[ERROR] Re-run Maven using the -X switch to enable full debug logging.
[ERROR] 
[ERROR] For more information about the errors and possible solutions, please read the following
articles:
[ERROR] [Help 1] http://cwiki.apache.org/confluence/display/MAVEN/MojoExecutionException
[ERROR] 
[ERROR] After correcting the problems, you can resume the build with the command
[ERROR]   mvn <goals> -rf :uimaj-core
[JENKINS] Archiving <https://builds.apache.org/job/UIMA-SDK/ws/trunk/uimaj-adapter-soap/pom.xml>
to org.apache.uima/uimaj-adapter-soap/2.8.2-SNAPSHOT/uimaj-adapter-soap-2.8.2-SNAPSHOT.pom
[JENKINS] Archiving <https://builds.apache.org/job/UIMA-SDK/ws/trunk/uimaj-core/pom.xml>
to org.apache.uima/uimaj-core/2.8.2-SNAPSHOT/uimaj-core-2.8.2-SNAPSHOT.pom
[JENKINS] Archiving <https://builds.apache.org/job/UIMA-SDK/ws/trunk/uimaj-core/target/uima-core.jar>
to org.apache.uima/uimaj-core/2.8.2-SNAPSHOT/uimaj-core-2.8.2-SNAPSHOT.jar
[JENKINS] Archiving <https://builds.apache.org/job/UIMA-SDK/ws/trunk/uimaj-test-util/pom.xml>
to org.apache.uima/uimaj-test-util/2.8.2-SNAPSHOT/uimaj-test-util-2.8.2-SNAPSHOT.pom
[JENKINS] Archiving <https://builds.apache.org/job/UIMA-SDK/ws/trunk/uimaj-test-util/target/uimaj-test-util-2.8.2-SNAPSHOT.jar>
to org.apache.uima/uimaj-test-util/2.8.2-SNAPSHOT/uimaj-test-util-2.8.2-SNAPSHOT.jar
[JENKINS] Archiving <https://builds.apache.org/job/UIMA-SDK/ws/trunk/uimaj-eclipse-feature-tools/pom.xml>
to org.apache.uima/uimaj-eclipse-feature-tools/2.8.2-SNAPSHOT/uimaj-eclipse-feature-tools-2.8.2-SNAPSHOT.pom
[JENKINS] Archiving <https://builds.apache.org/job/UIMA-SDK/ws/trunk/PearPackagingMavenPlugin/pom.xml>
to org.apache.uima/PearPackagingMavenPlugin/2.8.2-SNAPSHOT/PearPackagingMavenPlugin-2.8.2-SNAPSHOT.pom
[JENKINS] Archiving <https://builds.apache.org/job/UIMA-SDK/ws/trunk/uimaj-ep-cas-editor-ide/pom.xml>
to org.apache.uima/uimaj-ep-cas-editor-ide/2.8.2-SNAPSHOT/uimaj-ep-cas-editor-ide-2.8.2-SNAPSHOT.pom
[JENKINS] Archiving <https://builds.apache.org/job/UIMA-SDK/ws/trunk/uimaj-ep-runtime/pom.xml>
to org.apache.uima/uimaj-ep-runtime/2.8.2-SNAPSHOT/uimaj-ep-runtime-2.8.2-SNAPSHOT.pom
[JENKINS] Archiving <https://builds.apache.org/job/UIMA-SDK/ws/trunk/uimaj-tools/pom.xml>
to org.apache.uima/uimaj-tools/2.8.2-SNAPSHOT/uimaj-tools-2.8.2-SNAPSHOT.pom
[JENKINS] Archiving <https://builds.apache.org/job/UIMA-SDK/ws/trunk/uimaj-ep-jcasgen/pom.xml>
to org.apache.uima/uimaj-ep-jcasgen/2.8.2-SNAPSHOT/uimaj-ep-jcasgen-2.8.2-SNAPSHOT.pom
[JENKINS] Archiving <https://builds.apache.org/job/UIMA-SDK/ws/trunk/uimaj-ep-debug/pom.xml>
to org.apache.uima/uimaj-ep-debug/2.8.2-SNAPSHOT/uimaj-ep-debug-2.8.2-SNAPSHOT.pom
[JENKINS] Archiving <https://builds.apache.org/job/UIMA-SDK/ws/trunk/aggregate-uimaj-eclipse-plugins/pom.xml>
to org.apache.uima/aggregate-uimaj-eclipse-plugins/2.8.2-SNAPSHOT/aggregate-uimaj-eclipse-plugins-2.8.2-SNAPSHOT.pom
[JENKINS] Archiving <https://builds.apache.org/job/UIMA-SDK/ws/trunk/uima-docbook-tools/pom.xml>
to org.apache.uima/uima-docbook-tools/2.8.2-SNAPSHOT/uima-docbook-tools-2.8.2-SNAPSHOT.pom
[JENKINS] Archiving <https://builds.apache.org/job/UIMA-SDK/ws/trunk/uimaj-eclipse-feature-runtime/pom.xml>
to org.apache.uima/uimaj-eclipse-feature-runtime/2.8.2-SNAPSHOT/uimaj-eclipse-feature-runtime-2.8.2-SNAPSHOT.pom
[JENKINS] Archiving <https://builds.apache.org/job/UIMA-SDK/ws/trunk/uimaj-adapter-vinci/pom.xml>
to org.apache.uima/uimaj-adapter-vinci/2.8.2-SNAPSHOT/uimaj-adapter-vinci-2.8.2-SNAPSHOT.pom
[JENKINS] Archiving <https://builds.apache.org/job/UIMA-SDK/ws/trunk/uimaj-bootstrap/pom.xml>
to org.apache.uima/uimaj-bootstrap/2.8.2-SNAPSHOT/uimaj-bootstrap-2.8.2-SNAPSHOT.pom
[JENKINS] Archiving <https://builds.apache.org/job/UIMA-SDK/ws/trunk/uimaj-json/pom.xml>
to org.apache.uima/uimaj-json/2.8.2-SNAPSHOT/uimaj-json-2.8.2-SNAPSHOT.pom
[JENKINS] Archiving <https://builds.apache.org/job/UIMA-SDK/ws/trunk/uimaj-ep-pear-packager/pom.xml>
to org.apache.uima/uimaj-ep-pear-packager/2.8.2-SNAPSHOT/uimaj-ep-pear-packager-2.8.2-SNAPSHOT.pom
[JENKINS] Archiving <https://builds.apache.org/job/UIMA-SDK/ws/trunk/uimaj-parent/pom.xml>
to org.apache.uima/uimaj-parent/2.8.2-SNAPSHOT/uimaj-parent-2.8.2-SNAPSHOT.pom
[JENKINS] Archiving <https://builds.apache.org/job/UIMA-SDK/ws/trunk/uimaj-examples/pom.xml>
to org.apache.uima/uimaj-examples/2.8.2-SNAPSHOT/uimaj-examples-2.8.2-SNAPSHOT.pom
[JENKINS] Archiving <https://builds.apache.org/job/UIMA-SDK/ws/trunk/uimaj-ep-configurator/pom.xml>
to org.apache.uima/uimaj-ep-configurator/2.8.2-SNAPSHOT/uimaj-ep-configurator-2.8.2-SNAPSHOT.pom
[JENKINS] Archiving <https://builds.apache.org/job/UIMA-SDK/ws/trunk/uima-docbook-overview-and-setup/pom.xml>
to org.apache.uima/uima-docbook-overview-and-setup/2.8.2-SNAPSHOT/uima-docbook-overview-and-setup-2.8.2-SNAPSHOT.pom
[JENKINS] Archiving <https://builds.apache.org/job/UIMA-SDK/ws/trunk/uimaj-document-annotation/pom.xml>
to org.apache.uima/uimaj-document-annotation/2.8.2-SNAPSHOT/uimaj-document-annotation-2.8.2-SNAPSHOT.pom
[JENKINS] Archiving <https://builds.apache.org/job/UIMA-SDK/ws/trunk/uimaj-cpe/pom.xml>
to org.apache.uima/uimaj-cpe/2.8.2-SNAPSHOT/uimaj-cpe-2.8.2-SNAPSHOT.pom
[JENKINS] Archiving <https://builds.apache.org/job/UIMA-SDK/ws/trunk/uima-docbook-references/pom.xml>
to org.apache.uima/uima-docbook-references/2.8.2-SNAPSHOT/uima-docbook-references-2.8.2-SNAPSHOT.pom
[JENKINS] Archiving <https://builds.apache.org/job/UIMA-SDK/ws/trunk/uimaj-ep-cas-editor/pom.xml>
to org.apache.uima/uimaj-ep-cas-editor/2.8.2-SNAPSHOT/uimaj-ep-cas-editor-2.8.2-SNAPSHOT.pom
[JENKINS] Archiving <https://builds.apache.org/job/UIMA-SDK/ws/trunk/jcasgen-maven-plugin/pom.xml>
to org.apache.uima/jcasgen-maven-plugin/2.8.2-SNAPSHOT/jcasgen-maven-plugin-2.8.2-SNAPSHOT.pom
[JENKINS] Archiving <https://builds.apache.org/job/UIMA-SDK/ws/trunk/uimaj-ep-launcher/pom.xml>
to org.apache.uima/uimaj-ep-launcher/2.8.2-SNAPSHOT/uimaj-ep-launcher-2.8.2-SNAPSHOT.pom
[JENKINS] Archiving <https://builds.apache.org/job/UIMA-SDK/ws/trunk/aggregate-uimaj/pom.xml>
to org.apache.uima/aggregate-uimaj/2.8.2-SNAPSHOT/aggregate-uimaj-2.8.2-SNAPSHOT.pom
[JENKINS] Archiving <https://builds.apache.org/job/UIMA-SDK/ws/trunk/aggregate-uimaj-docbooks/pom.xml>
to org.apache.uima/aggregate-uimaj-docbooks/2.8.2-SNAPSHOT/aggregate-uimaj-docbooks-2.8.2-SNAPSHOT.pom
[JENKINS] Archiving <https://builds.apache.org/job/UIMA-SDK/ws/trunk/pom.xml> to org.apache.uima/uimaj/2.8.2-SNAPSHOT/uimaj-2.8.2-SNAPSHOT.pom
[JENKINS] Archiving <https://builds.apache.org/job/UIMA-SDK/ws/trunk/uimaj-component-test-util/pom.xml>
to org.apache.uima/uimaj-component-test-util/2.8.2-SNAPSHOT/uimaj-component-test-util-2.8.2-SNAPSHOT.pom
[JENKINS] Archiving <https://builds.apache.org/job/UIMA-SDK/ws/trunk/uima-docbook-tutorials-and-users-guides/pom.xml>
to org.apache.uima/uima-docbook-tutorials-and-users-guides/2.8.2-SNAPSHOT/uima-docbook-tutorials-and-users-guides-2.8.2-SNAPSHOT.pom
[JENKINS] Archiving <https://builds.apache.org/job/UIMA-SDK/ws/trunk/jVinci/pom.xml>
to org.apache.uima/jVinci/2.8.2-SNAPSHOT/jVinci-2.8.2-SNAPSHOT.pom
Sending e-mails to: dev@uima.apache.org
channel stopped
[WARNINGS] Skipping publisher since build result is FAILURE

Mime
View raw message