uima-dev mailing list archives

Site index · List index
Message view « Date » · « Thread »
Top « Date » · « Thread »
From Apache Jenkins Server <jenk...@builds.apache.org>
Subject Build failed in Jenkins: UIMA-DUCC #771
Date Fri, 08 Apr 2016 21:13:57 GMT
See <https://builds.apache.org/job/UIMA-DUCC/771/changes>

Changes:

[degenaro] UIMA-4732 DUCC Web Server (WS) broker and database are shown as down on Daemons
page

------------------------------------------
[...truncated 10794 lines...]
[PMD] Finding all files that match the pattern pmd.xml
[PMD] Parsing 1 file in <https://builds.apache.org/job/UIMA-DUCC/ws/trunk/uima-ducc-examples/target>
[PMD] Successfully parsed file <https://builds.apache.org/job/UIMA-DUCC/ws/trunk/uima-ducc-examples/target/pmd.xml>
of module Apache UIMA DUCC: uima-ducc-examples with 31 unique warnings and 0 duplicates.
[PMD] Computing warning deltas based on reference build #770
[INFO] 
[INFO] --- maven-pmd-plugin:3.6:cpd (default-cli) @ uima-ducc-examples ---
[DRY] Finding all files that match the pattern cpd.xml
[DRY] Parsing 1 file in <https://builds.apache.org/job/UIMA-DUCC/ws/trunk/uima-ducc-examples/target>
[DRY] Successfully parsed file <https://builds.apache.org/job/UIMA-DUCC/ws/trunk/uima-ducc-examples/target/cpd.xml>
of module Apache UIMA DUCC: uima-ducc-examples with 4 unique warnings and 0 duplicates.
[DRY] Computing warning deltas based on reference build #770
[INFO] 
[INFO] --- findbugs-maven-plugin:3.0.3:findbugs (default-cli) @ uima-ducc-examples ---
[INFO] Fork Value is true
     [java] Warnings generated: 48
[INFO] Done FindBugs Analysis....
[FINDBUGS] Finding all files that match the pattern findbugsXml.xml
[FINDBUGS] Parsing 1 file in <https://builds.apache.org/job/UIMA-DUCC/ws/trunk/uima-ducc-examples/target>
[FINDBUGS] Successfully parsed file <https://builds.apache.org/job/UIMA-DUCC/ws/trunk/uima-ducc-examples/target/findbugsXml.xml>
of module Apache UIMA DUCC: uima-ducc-examples with 48 unique warnings and 0 duplicates.
[FINDBUGS] Computing warning deltas based on reference build #770
[INFO] 
[INFO] --- maven-enforcer-plugin:1.3.1:enforce (enforce-versions) @ uima-ducc-examples ---
[INFO] 
[INFO] --- build-helper-maven-plugin:1.8:parse-version (parse-project-version) @ uima-ducc-examples
---
[INFO] 
[INFO] --- uima-build-helper-maven-plugin:7:parse-date-time (set buildYear and buildMonth)
@ uima-ducc-examples ---
[INFO] 
[INFO] --- maven-remote-resources-plugin:1.5:process (default) @ uima-ducc-examples ---
[INFO] 
[INFO] --- maven-resources-plugin:2.6:resources (default-resources) @ uima-ducc-examples ---
[INFO] Using 'UTF-8' encoding to copy filtered resources.
[INFO] Copying 64 resources
[INFO] Copying 3 resources
[INFO] Copying 3 resources
[INFO] 
[INFO] --- maven-compiler-plugin:3.1:compile (default-compile) @ uima-ducc-examples ---
[INFO] Nothing to compile - all classes are up to date
[INFO] 
[INFO] --- cobertura-maven-plugin:2.7:instrument (default-cli) @ uima-ducc-examples ---
[INFO] Cobertura 2.1.1 - GNU GPL License (NO WARRANTY) - See COPYRIGHT file
[INFO] Cobertura: Saved information on 30 classes.
[INFO] Cobertura: Saved information on 30 classes.

[ERROR] SLF4J: Class path contains multiple SLF4J bindings.
SLF4J: Found binding in [jar:file:/home/jenkins/jenkins-slave/maven-repositories/0/ch/qos/logback/logback-classic/1.0.13/logback-classic-1.0.13.jar!/org/slf4j/impl/StaticLoggerBinder.class]
SLF4J: Found binding in [jar:file:/home/jenkins/jenkins-slave/maven-repositories/0/org/slf4j/slf4j-log4j12/1.7.6/slf4j-log4j12-1.7.6.jar!/org/slf4j/impl/StaticLoggerBinder.class]
SLF4J: Found binding in [jar:file:/home/jenkins/jenkins-slave/maven-repositories/0/org/apache/activemq/activemq-all/5.7.0/activemq-all-5.7.0.jar!/org/slf4j/impl/StaticLoggerBinder.class]
SLF4J: See http://www.slf4j.org/codes.html#multiple_bindings for an explanation.
SLF4J: Actual binding is of type [ch.qos.logback.classic.util.ContextSelectorStaticBinder]

[INFO] Instrumentation was successful.
[INFO] NOT adding cobertura ser file to attached artifacts list.
[INFO] 
[INFO] --- maven-resources-plugin:2.6:testResources (default-testResources) @ uima-ducc-examples
---
[INFO] Using 'UTF-8' encoding to copy filtered resources.
[INFO] skip non existing resourceDirectory <https://builds.apache.org/job/UIMA-DUCC/ws/trunk/uima-ducc-examples/src/test/resources>
[INFO] Copying 3 resources
[INFO] Copying 3 resources
[INFO] 
[INFO] --- maven-compiler-plugin:3.1:testCompile (default-testCompile) @ uima-ducc-examples
---
[INFO] No sources to compile
[INFO] 
[INFO] --- maven-surefire-plugin:2.16:test (default-test) @ uima-ducc-examples ---
[JENKINS] Recording test results
[INFO] 
[INFO] --- cobertura-maven-plugin:2.7:cobertura (default-cli) @ uima-ducc-examples ---
[INFO] Cobertura 2.1.1 - GNU GPL License (NO WARRANTY) - See COPYRIGHT file
[INFO] Cobertura: Loaded information on 30 classes.
Report time: 706ms

[INFO] Cobertura Report generation was successful.
[INFO] 
[INFO] --- maven-enforcer-plugin:1.3.1:enforce (enforce-versions) @ uima-ducc-examples ---
[INFO] 
[INFO] --- build-helper-maven-plugin:1.8:parse-version (parse-project-version) @ uima-ducc-examples
---
[INFO] 
[INFO] --- uima-build-helper-maven-plugin:7:parse-date-time (set buildYear and buildMonth)
@ uima-ducc-examples ---
[WARNING] Failed to getClass for org.apache.maven.plugin.javadoc.JavadocReport
[INFO] 
[INFO] --- maven-javadoc-plugin:2.9.1:javadoc (default-cli) @ uima-ducc-examples ---
[INFO] 
1 warning
[WARNING] Javadoc Warnings
[WARNING] warning: [options] bootstrap class path not set in conjunction with -source 1.5
[JENKINS] Archiving  javadoc
[INFO]                                                                         
[INFO] ------------------------------------------------------------------------
[INFO] Building uima-ducc-spawn 2.1.0-SNAPSHOT
[INFO] ------------------------------------------------------------------------
[INFO] 
[INFO] --- maven-clean-plugin:2.5:clean (default-clean) @ uima-ducc-spawn ---
[TASKS] Scanning folder '<https://builds.apache.org/job/UIMA-DUCC/ws/trunk/uima-ducc-spawn'>
for files matching the pattern '**/*.java' - excludes: 
[TASKS] Found 0 files to scan for tasks
Found 0 open tasks.
[TASKS] Computing warning deltas based on reference build #770
[INFO] 
[INFO] --- maven-enforcer-plugin:1.3.1:enforce (enforce-versions) @ uima-ducc-spawn ---
[INFO] 
[INFO] --- build-helper-maven-plugin:1.8:parse-version (parse-project-version) @ uima-ducc-spawn
---
[INFO] 
[INFO] --- uima-build-helper-maven-plugin:7:parse-date-time (set buildYear and buildMonth)
@ uima-ducc-spawn ---
[INFO] 
[INFO] --- maven-remote-resources-plugin:1.5:process (default) @ uima-ducc-spawn ---
[INFO] 
[INFO] --- maven-antrun-plugin:1.7:run (dup-meta-jar-cleanup) @ uima-ducc-spawn ---
[INFO] Executing tasks

main:
[INFO] Executed tasks
[INFO] 
[INFO] --- maven-site-plugin:3.3:attach-descriptor (attach-descriptor) @ uima-ducc-spawn ---
[INFO] 
[INFO] --- maven-install-plugin:2.5.1:install (default-install) @ uima-ducc-spawn ---
[INFO] Installing <https://builds.apache.org/job/UIMA-DUCC/ws/trunk/uima-ducc-spawn/pom.xml>
to /home/jenkins/jenkins-slave/maven-repositories/0/org/apache/uima/uima-ducc-spawn/2.1.0-SNAPSHOT/uima-ducc-spawn-2.1.0-SNAPSHOT.pom
[INFO] 
[INFO] --- maven-pmd-plugin:3.6:pmd (default-cli) @ uima-ducc-spawn ---
[PMD] No report found for mojo pmd
[INFO] 
[INFO] --- maven-pmd-plugin:3.6:cpd (default-cli) @ uima-ducc-spawn ---
[DRY] No report found for mojo cpd
[INFO] 
[INFO] --- findbugs-maven-plugin:3.0.3:findbugs (default-cli) @ uima-ducc-spawn ---
[FINDBUGS] No report found for mojo findbugs
[INFO] 
[INFO] --- maven-enforcer-plugin:1.3.1:enforce (enforce-versions) @ uima-ducc-spawn ---
[INFO] 
[INFO] --- build-helper-maven-plugin:1.8:parse-version (parse-project-version) @ uima-ducc-spawn
---
[INFO] 
[INFO] --- uima-build-helper-maven-plugin:7:parse-date-time (set buildYear and buildMonth)
@ uima-ducc-spawn ---
[INFO] 
[INFO] --- maven-remote-resources-plugin:1.5:process (default) @ uima-ducc-spawn ---
[INFO] 
[INFO] --- cobertura-maven-plugin:2.7:instrument (default-cli) @ uima-ducc-spawn ---
[INFO] Skipping cobertura mojo for project with packaging type 'pom'
[INFO] 
[INFO] --- cobertura-maven-plugin:2.7:cobertura (default-cli) @ uima-ducc-spawn ---
[INFO] 
[INFO] --- maven-enforcer-plugin:1.3.1:enforce (enforce-versions) @ uima-ducc-spawn ---
[INFO] 
[INFO] --- build-helper-maven-plugin:1.8:parse-version (parse-project-version) @ uima-ducc-spawn
---
[INFO] 
[INFO] --- uima-build-helper-maven-plugin:7:parse-date-time (set buildYear and buildMonth)
@ uima-ducc-spawn ---
[WARNING] Failed to getClass for org.apache.maven.plugin.javadoc.JavadocReport
[INFO] 
[INFO] --- maven-javadoc-plugin:2.9.1:javadoc (default-cli) @ uima-ducc-spawn ---
[INFO]                                                                         
[INFO] ------------------------------------------------------------------------
[INFO] Building Apache UIMA-DUCC: uima-ducc 2.1.0-SNAPSHOT
[INFO] ------------------------------------------------------------------------
[INFO] 
[INFO] --- maven-clean-plugin:2.5:clean (default-clean) @ uima-ducc ---
[TASKS] Scanning folder '<https://builds.apache.org/job/UIMA-DUCC/ws/trunk'> for files
matching the pattern '**/*.java' - excludes: uima-ducc-parent/**/*, uima-ducc-cli/**/*, uima-ducc-pm/**/*,
uima-ducc-rm/**/*, uima-ducc-sm/**/*, uima-ducc-orchestrator/**/*, uima-ducc-common/**/*,
uima-ducc-transport/**/*, uima-ducc-agent/**/*, uima-ducc-duccdocs/**/*, uima-ducc-web/**/*,
uima-ducc-examples/**/*, uima-ducc-database/**/*, uima-ducc-spawn/**/*, uima-ducc-user/**/*,
uima-ducc-container/**/*
[TASKS] Found 0 files to scan for tasks
Found 0 open tasks.
[TASKS] Computing warning deltas based on reference build #770
[INFO] 
[INFO] --- maven-enforcer-plugin:1.3.1:enforce (enforce-versions) @ uima-ducc ---
[INFO] 
[INFO] --- build-helper-maven-plugin:1.8:parse-version (parse-project-version) @ uima-ducc
---
[INFO] 
[INFO] --- uima-build-helper-maven-plugin:7:parse-date-time (set buildYear and buildMonth)
@ uima-ducc ---
[INFO] 
[INFO] --- maven-remote-resources-plugin:1.5:process (default) @ uima-ducc ---
[INFO] 
[INFO] --- maven-enforcer-plugin:1.3.1:enforce (enforce-versions) @ uima-ducc ---
[INFO] 
[INFO] --- build-helper-maven-plugin:1.8:parse-version (parse-project-version) @ uima-ducc
---
[INFO] 
[INFO] --- uima-build-helper-maven-plugin:7:parse-date-time (set buildYear and buildMonth)
@ uima-ducc ---
[WARNING] Failed to getClass for org.apache.maven.plugin.javadoc.JavadocReport
[INFO] 
[INFO] --- maven-javadoc-plugin:2.9.1:javadoc (javadocs-distr) @ uima-ducc ---
[INFO] 
1 warning
[WARNING] Javadoc Warnings
[WARNING] warning: [options] bootstrap class path not set in conjunction with -source 1.5
[JENKINS] Archiving  javadoc
[INFO] 
[INFO] --- uima-build-helper-maven-plugin:7:copy-from-apache-dist (get-uima-as) @ uima-ducc
---
[INFO] ------------------------------------------------------------------------
[INFO] Reactor Summary:
[INFO] 
[INFO] uima-ducc-parent .................................. SUCCESS [1:07.754s]
[INFO] Apache UIMA DUCC: uima-ducc-user .................. SUCCESS [2:10.662s]
[INFO] Apache UIMA DUCC: uima-ducc-common ................ SUCCESS [1:44.292s]
[INFO] Apache UIMA DUCC: uima-ducc-container ............. SUCCESS [1:39.893s]
[INFO] Apache UIMA DUCC: uima-ducc-transport ............. SUCCESS [1:33.955s]
[INFO] Apache UIMA DUCC: uima-ducc-cli ................... SUCCESS [1:03.406s]
[INFO] Apache UIMA DUCC: uima-ducc-pm .................... SUCCESS [35.232s]
[INFO] Apache UIMA DUCC: uima-ducc-rm .................... SUCCESS [56.240s]
[INFO] Apache UIMA DUCC: uima-ducc-sm .................... SUCCESS [47.872s]
[INFO] Apache UIMA DUCC: uima-ducc-database .............. SUCCESS [44.068s]
[INFO] Apache UIMA DUCC: uima-ducc-orchestrator .......... SUCCESS [1:06.129s]
[INFO] Apache UIMA DUCC: uima-ducc-agent ................. SUCCESS [1:00.540s]
[INFO] uima-ducc-duccdocs ................................ SUCCESS [12.622s]
[INFO] Apache UIMA DUCC: uima-ducc-web ................... SUCCESS [1:38.900s]
[INFO] Apache UIMA DUCC: uima-ducc-examples .............. SUCCESS [45.582s]
[INFO] uima-ducc-spawn ................................... SUCCESS [10.291s]
[INFO] Apache UIMA-DUCC: uima-ducc ....................... FAILURE [10.403s]
[INFO] ------------------------------------------------------------------------
[INFO] BUILD FAILURE
[INFO] ------------------------------------------------------------------------
[INFO] Total time: 18:53.216s
[INFO] Finished at: Fri Apr 08 21:13:34 UTC 2016
[INFO] Final Memory: 117M/401M
[INFO] ------------------------------------------------------------------------
Waiting for Jenkins to finish collecting data
[ERROR] Failed to execute goal org.apache.uima:uima-build-helper-maven-plugin:7:copy-from-apache-dist
(get-uima-as) on project uima-ducc: While reading remote location http://archive.apache.org/dist/uima/uima-as-2.6.0/uima-as-2.6.0-bin.tar.gz:
Server returned HTTP response code: 503 for URL: http://archive.apache.org/dist/uima/uima-as-2.6.0/uima-as-2.6.0-bin.tar.gz
-> [Help 1]
[ERROR] 
[ERROR] To see the full stack trace of the errors, re-run Maven with the -e switch.
[ERROR] Re-run Maven using the -X switch to enable full debug logging.
[ERROR] 
[ERROR] For more information about the errors and possible solutions, please read the following
articles:
[ERROR] [Help 1] http://cwiki.apache.org/confluence/display/MAVEN/MojoExecutionException
[ERROR] 
[ERROR] After correcting the problems, you can resume the build with the command
[ERROR]   mvn <goals> -rf :uima-ducc
[JENKINS] Archiving <https://builds.apache.org/job/UIMA-DUCC/ws/trunk/uima-ducc-web/pom.xml>
to org.apache.uima/uima-ducc-web/2.1.0-SNAPSHOT/uima-ducc-web-2.1.0-SNAPSHOT.pom
[JENKINS] Archiving <https://builds.apache.org/job/UIMA-DUCC/ws/trunk/uima-ducc-web/target/uima-ducc-web-2.1.0-SNAPSHOT.jar>
to org.apache.uima/uima-ducc-web/2.1.0-SNAPSHOT/uima-ducc-web-2.1.0-SNAPSHOT.jar
[JENKINS] Archiving <https://builds.apache.org/job/UIMA-DUCC/ws/trunk/uima-ducc-rm/pom.xml>
to org.apache.uima/uima-ducc-rm/2.1.0-SNAPSHOT/uima-ducc-rm-2.1.0-SNAPSHOT.pom
[JENKINS] Archiving <https://builds.apache.org/job/UIMA-DUCC/ws/trunk/uima-ducc-rm/target/uima-ducc-rm-2.1.0-SNAPSHOT.jar>
to org.apache.uima/uima-ducc-rm/2.1.0-SNAPSHOT/uima-ducc-rm-2.1.0-SNAPSHOT.jar
[JENKINS] Archiving <https://builds.apache.org/job/UIMA-DUCC/ws/trunk/uima-ducc-sm/pom.xml>
to org.apache.uima/uima-ducc-sm/2.1.0-SNAPSHOT/uima-ducc-sm-2.1.0-SNAPSHOT.pom
[JENKINS] Archiving <https://builds.apache.org/job/UIMA-DUCC/ws/trunk/uima-ducc-sm/target/uima-ducc-sm-2.1.0-SNAPSHOT.jar>
to org.apache.uima/uima-ducc-sm/2.1.0-SNAPSHOT/uima-ducc-sm-2.1.0-SNAPSHOT.jar
[JENKINS] Archiving <https://builds.apache.org/job/UIMA-DUCC/ws/trunk/uima-ducc-parent/pom.xml>
to org.apache.uima/uima-ducc-parent/2.1.0-SNAPSHOT/uima-ducc-parent-2.1.0-SNAPSHOT.pom
[JENKINS] Archiving <https://builds.apache.org/job/UIMA-DUCC/ws/trunk/uima-ducc-spawn/pom.xml>
to org.apache.uima/uima-ducc-spawn/2.1.0-SNAPSHOT/uima-ducc-spawn-2.1.0-SNAPSHOT.pom
[JENKINS] Archiving <https://builds.apache.org/job/UIMA-DUCC/ws/trunk/uima-ducc-orchestrator/pom.xml>
to org.apache.uima/uima-ducc-orchestrator/2.1.0-SNAPSHOT/uima-ducc-orchestrator-2.1.0-SNAPSHOT.pom
[JENKINS] Archiving <https://builds.apache.org/job/UIMA-DUCC/ws/trunk/uima-ducc-orchestrator/target/uima-ducc-orchestrator-2.1.0-SNAPSHOT.jar>
to org.apache.uima/uima-ducc-orchestrator/2.1.0-SNAPSHOT/uima-ducc-orchestrator-2.1.0-SNAPSHOT.jar
[JENKINS] Archiving <https://builds.apache.org/job/UIMA-DUCC/ws/trunk/uima-ducc-container/pom.xml>
to org.apache.uima/uima-ducc-container/2.1.0-SNAPSHOT/uima-ducc-container-2.1.0-SNAPSHOT.pom
[JENKINS] Archiving <https://builds.apache.org/job/UIMA-DUCC/ws/trunk/uima-ducc-container/target/uima-ducc-container-2.1.0-SNAPSHOT.jar>
to org.apache.uima/uima-ducc-container/2.1.0-SNAPSHOT/uima-ducc-container-2.1.0-SNAPSHOT.jar
[JENKINS] Archiving <https://builds.apache.org/job/UIMA-DUCC/ws/trunk/uima-ducc-examples/pom.xml>
to org.apache.uima/uima-ducc-examples/2.1.0-SNAPSHOT/uima-ducc-examples-2.1.0-SNAPSHOT.pom
[JENKINS] Archiving <https://builds.apache.org/job/UIMA-DUCC/ws/trunk/uima-ducc-examples/target/uima-ducc-examples-2.1.0-SNAPSHOT.jar>
to org.apache.uima/uima-ducc-examples/2.1.0-SNAPSHOT/uima-ducc-examples-2.1.0-SNAPSHOT.jar
[JENKINS] Archiving <https://builds.apache.org/job/UIMA-DUCC/ws/trunk/uima-ducc-common/pom.xml>
to org.apache.uima/uima-ducc-common/2.1.0-SNAPSHOT/uima-ducc-common-2.1.0-SNAPSHOT.pom
[JENKINS] Archiving <https://builds.apache.org/job/UIMA-DUCC/ws/trunk/uima-ducc-common/target/uima-ducc-common-2.1.0-SNAPSHOT.jar>
to org.apache.uima/uima-ducc-common/2.1.0-SNAPSHOT/uima-ducc-common-2.1.0-SNAPSHOT.jar
[JENKINS] Archiving <https://builds.apache.org/job/UIMA-DUCC/ws/trunk/uima-ducc-duccdocs/pom.xml>
to org.apache.uima/uima-ducc-duccdocs/2.1.0-SNAPSHOT/uima-ducc-duccdocs-2.1.0-SNAPSHOT.pom
[JENKINS] Archiving <https://builds.apache.org/job/UIMA-DUCC/ws/trunk/uima-ducc-user/pom.xml>
to org.apache.uima/uima-ducc-user/2.1.0-SNAPSHOT/uima-ducc-user-2.1.0-SNAPSHOT.pom
[JENKINS] Archiving <https://builds.apache.org/job/UIMA-DUCC/ws/trunk/uima-ducc-user/target/uima-ducc-user-2.1.0-SNAPSHOT.jar>
to org.apache.uima/uima-ducc-user/2.1.0-SNAPSHOT/uima-ducc-user-2.1.0-SNAPSHOT.jar
[JENKINS] Archiving <https://builds.apache.org/job/UIMA-DUCC/ws/trunk/uima-ducc-agent/pom.xml>
to org.apache.uima/uima-ducc-agent/2.1.0-SNAPSHOT/uima-ducc-agent-2.1.0-SNAPSHOT.pom
[JENKINS] Archiving <https://builds.apache.org/job/UIMA-DUCC/ws/trunk/uima-ducc-agent/target/uima-ducc-agent-2.1.0-SNAPSHOT.jar>
to org.apache.uima/uima-ducc-agent/2.1.0-SNAPSHOT/uima-ducc-agent-2.1.0-SNAPSHOT.jar
[JENKINS] Archiving <https://builds.apache.org/job/UIMA-DUCC/ws/trunk/uima-ducc-cli/pom.xml>
to org.apache.uima/uima-ducc-cli/2.1.0-SNAPSHOT/uima-ducc-cli-2.1.0-SNAPSHOT.pom
[JENKINS] Archiving <https://builds.apache.org/job/UIMA-DUCC/ws/trunk/uima-ducc-cli/target/uima-ducc-cli-2.1.0-SNAPSHOT.jar>
to org.apache.uima/uima-ducc-cli/2.1.0-SNAPSHOT/uima-ducc-cli-2.1.0-SNAPSHOT.jar
[JENKINS] Archiving <https://builds.apache.org/job/UIMA-DUCC/ws/trunk/uima-ducc-database/pom.xml>
to org.apache.uima/uima-ducc-database/2.1.0-SNAPSHOT/uima-ducc-database-2.1.0-SNAPSHOT.pom
[JENKINS] Archiving <https://builds.apache.org/job/UIMA-DUCC/ws/trunk/uima-ducc-database/target/uima-ducc-database-2.1.0-SNAPSHOT.jar>
to org.apache.uima/uima-ducc-database/2.1.0-SNAPSHOT/uima-ducc-database-2.1.0-SNAPSHOT.jar
[JENKINS] Archiving <https://builds.apache.org/job/UIMA-DUCC/ws/trunk/pom.xml> to org.apache.uima/uima-ducc/2.1.0-SNAPSHOT/uima-ducc-2.1.0-SNAPSHOT.pom
[JENKINS] Archiving <https://builds.apache.org/job/UIMA-DUCC/ws/trunk/uima-ducc-pm/pom.xml>
to org.apache.uima/uima-ducc-pm/2.1.0-SNAPSHOT/uima-ducc-pm-2.1.0-SNAPSHOT.pom
[JENKINS] Archiving <https://builds.apache.org/job/UIMA-DUCC/ws/trunk/uima-ducc-pm/target/uima-ducc-pm-2.1.0-SNAPSHOT.jar>
to org.apache.uima/uima-ducc-pm/2.1.0-SNAPSHOT/uima-ducc-pm-2.1.0-SNAPSHOT.jar
[JENKINS] Archiving <https://builds.apache.org/job/UIMA-DUCC/ws/trunk/uima-ducc-transport/pom.xml>
to org.apache.uima/uima-ducc-transport/2.1.0-SNAPSHOT/uima-ducc-transport-2.1.0-SNAPSHOT.pom
[JENKINS] Archiving <https://builds.apache.org/job/UIMA-DUCC/ws/trunk/uima-ducc-transport/target/uima-ducc-transport-2.1.0-SNAPSHOT.jar>
to org.apache.uima/uima-ducc-transport/2.1.0-SNAPSHOT/uima-ducc-transport-2.1.0-SNAPSHOT.jar
Sending e-mails to: dev@uima.apache.org
channel stopped
[WARNINGS] Skipping publisher since build result is FAILURE

Mime
View raw message