uima-dev mailing list archives

Site index · List index
Message view « Date » · « Thread »
Top « Date » · « Thread »
From Apache Jenkins Server <jenk...@builds.apache.org>
Subject Build failed in Jenkins: UIMA-Ruta #811
Date Wed, 24 Aug 2016 16:58:31 GMT
See <https://builds.apache.org/job/UIMA-Ruta/811/>

------------------------------------------
[...truncated 8407 lines...]
A         ruta-core/src/main/java/org/apache/uima/ruta/rule/quantifier/PlusReluctant.java
A         ruta-core/src/main/java/org/apache/uima/ruta/rule/quantifier/QuestionGreedy.java
A         ruta-core/src/main/java/org/apache/uima/ruta/rule/quantifier/MinMaxGreedy.java
A         ruta-core/src/main/java/org/apache/uima/ruta/rule/quantifier/QuestionReluctant.java
A         ruta-core/src/main/java/org/apache/uima/ruta/rule/quantifier/RuleElementQuantifier.java
A         ruta-core/src/main/java/org/apache/uima/ruta/rule/quantifier/StarGreedy.java
A         ruta-core/src/main/java/org/apache/uima/ruta/rule/quantifier/MinMaxReluctant.java
A         ruta-core/src/main/java/org/apache/uima/ruta/rule/quantifier/StarReluctant.java
A         ruta-core/src/main/java/org/apache/uima/ruta/rule/quantifier/AbstractRuleElementQuantifier.java
A         ruta-core/src/main/java/org/apache/uima/ruta/rule/ComposedRuleElementMatch.java
A         ruta-core/src/main/java/org/apache/uima/ruta/rule/AbstractRule.java
A         ruta-core/src/main/java/org/apache/uima/ruta/rule/WildCardRuleElement.java
A         ruta-core/src/main/java/org/apache/uima/ruta/rule/RutaLiteralMatcher.java
A         ruta-core/src/main/java/org/apache/uima/ruta/rule/RuleElementIsolator.java
A         ruta-core/src/main/java/org/apache/uima/ruta/rule/RuleElementMatch.java
A         ruta-core/src/main/java/org/apache/uima/ruta/rule/RegExpRuleMatch.java
A         ruta-core/src/main/java/org/apache/uima/ruta/rule/ConjunctRulesRuleElement.java
AU        ruta-core/src/main/java/org/apache/uima/ruta/rule/MatchContext.java
A         ruta-core/src/main/java/org/apache/uima/ruta/rule/AnnotationComparator.java
A         ruta-core/src/main/java/org/apache/uima/ruta/rule/RuleElementCaretaker.java
A         ruta-core/src/main/java/org/apache/uima/ruta/rule/RutaRule.java
A         ruta-core/src/main/java/org/apache/uima/ruta/rule/AbstractRuleElement.java
A         ruta-core/src/main/java/org/apache/uima/ruta/rule/AbstractRuleMatch.java
A         ruta-core/src/main/java/org/apache/uima/ruta/rule/RuleElementComparator.java
AU        ruta-core/src/main/java/org/apache/uima/ruta/rule/RutaAnnotationMatcher.java
A         ruta-core/src/main/java/org/apache/uima/ruta/rule/ComposedRuleElement.java
A         ruta-core/src/main/java/org/apache/uima/ruta/rule/RuleMatchComparator.java
A         ruta-core/src/main/java/org/apache/uima/ruta/rule/RutaRuleElement.java
A         ruta-core/src/main/java/org/apache/uima/ruta/rule/RuleApply.java
A         ruta-core/src/main/java/org/apache/uima/ruta/UIMAConstants.java
A         ruta-core/src/main/java/org/apache/uima/ruta/RutaScriptFactory.java
A         ruta-core/src/main/antlr3
A         ruta-core/src/main/antlr3/org
A         ruta-core/src/main/antlr3/org/apache
A         ruta-core/src/main/antlr3/org/apache/uima
A         ruta-core/src/main/antlr3/org/apache/uima/ruta
A         ruta-core/src/main/antlr3/org/apache/uima/ruta/parser
A         ruta-core/src/main/antlr3/org/apache/uima/ruta/parser/RutaParser.tokens
A         ruta-core/src/main/antlr3/org/apache/uima/ruta/parser/RutaLexer.tokens
A         ruta-core/src/main/antlr3/org/apache/uima/ruta/parser/RutaParser.g
A         ruta-core/src/main/antlr3/org/apache/uima/ruta/parser/RutaLexer.g
A         ruta-core/pom.xml
A         ruta-core/marker-file-identifying-api-compatibility-check
A         ruta-maven-archetype
A         ruta-maven-archetype/src
A         ruta-maven-archetype/src/main
A         ruta-maven-archetype/src/main/resources
A         ruta-maven-archetype/src/main/resources/archetype-resources
A         ruta-maven-archetype/src/main/resources/archetype-resources/src
A         ruta-maven-archetype/src/main/resources/archetype-resources/src/test
A         ruta-maven-archetype/src/main/resources/archetype-resources/src/test/java
AU        ruta-maven-archetype/src/main/resources/archetype-resources/src/test/java/RutaTest.java
A         ruta-maven-archetype/src/main/resources/archetype-resources/src/main
A         ruta-maven-archetype/src/main/resources/archetype-resources/src/main/ruta
A         ruta-maven-archetype/src/main/resources/archetype-resources/src/main/ruta/__projectNameCamelCase__Main.ruta
A         ruta-maven-archetype/src/main/resources/archetype-resources/src/main/resources
A         ruta-maven-archetype/src/main/resources/archetype-resources/src/main/resources/META-INF
A         ruta-maven-archetype/src/main/resources/archetype-resources/src/main/resources/META-INF/org.apache.uima.fit
AU        ruta-maven-archetype/src/main/resources/archetype-resources/src/main/resources/META-INF/org.apache.uima.fit/types.txt
A         ruta-maven-archetype/src/main/resources/archetype-resources/src/main/resources/wordlists
AU        ruta-maven-archetype/src/main/resources/archetype-resources/src/main/resources/wordlists/Ruta.txt
AU        ruta-maven-archetype/src/main/resources/archetype-resources/pom.xml
A         ruta-maven-archetype/src/main/resources/META-INF
A         ruta-maven-archetype/src/main/resources/META-INF/maven
AU        ruta-maven-archetype/src/main/resources/META-INF/maven/archetype-mERROR: Failed
to check out https://svn.apache.org/repos/asf/uima/ruta/trunk
org.tmatesoft.svn.core.SVNException: svn: E200030: FULL
	at org.tmatesoft.svn.core.internal.wc.SVNErrorManager.error(SVNErrorManager.java:64)
	at org.tmatesoft.svn.core.internal.wc.SVNErrorManager.error(SVNErrorManager.java:51)
	at org.tmatesoft.svn.core.internal.io.dav.http.HTTPConnection.request(HTTPConnection.java:793)
	at org.tmatesoft.svn.core.internal.io.dav.http.HTTPConnection.request(HTTPConnection.java:398)
	at org.tmatesoft.svn.core.internal.io.dav.http.HTTPConnection.request(HTTPConnection.java:386)
	at org.tmatesoft.svn.core.internal.io.dav.DAVConnection.performHttpRequest(DAVConnection.java:863)
	at org.tmatesoft.svn.core.internal.io.dav.DAVConnection.doReport(DAVConnection.java:360)
	at org.tmatesoft.svn.core.internal.io.dav.DAVRepository.runReport(DAVRepository.java:1340)
	at org.tmatesoft.svn.core.internal.io.dav.DAVRepository.update(DAVRepository.java:868)
	at org.tmatesoft.svn.core.internal.wc2.ng.SvnNgAbstractUpdate.updateInternal(SvnNgAbstractUpdate.java:247)
	at org.tmatesoft.svn.core.internal.wc2.ng.SvnNgAbstractUpdate.update(SvnNgAbstractUpdate.java:111)
	at org.tmatesoft.svn.core.internal.wc2.ng.SvnNgAbstractUpdate.checkout(SvnNgAbstractUpdate.java:855)
	at org.tmatesoft.svn.core.internal.wc2.ng.SvnNgCheckout.run(SvnNgCheckout.java:26)
	at org.tmatesoft.svn.core.internal.wc2.ng.SvnNgCheckout.run(SvnNgCheckout.java:11)
	at org.tmatesoft.svn.core.internal.wc2.ng.SvnNgOperationRunner.run(SvnNgOperationRunner.java:20)
	at org.tmatesoft.svn.core.internal.wc2.SvnOperationRunner.run(SvnOperationRunner.java:21)
	at org.tmatesoft.svn.core.wc2.SvnOperationFactory.run(SvnOperationFactory.java:1235)
	at org.tmatesoft.svn.core.wc2.SvnOperation.run(SvnOperation.java:294)
	at hudson.scm.subversion.CheckoutUpdater$1.perform(CheckoutUpdater.java:119)
	at hudson.scm.subversion.WorkspaceUpdater$UpdateTask.delegateTo(WorkspaceUpdater.java:162)
	at hudson.scm.SubversionSCM$CheckOutTask.perform(SubversionSCM.java:996)
	at hudson.scm.SubversionSCM$CheckOutTask.invoke(SubversionSCM.java:972)
	at hudson.scm.SubversionSCM$CheckOutTask.invoke(SubversionSCM.java:948)
	at hudson.FilePath$FileCallableWrapper.call(FilePath.java:2772)
	at hudson.remoting.UserRequest.perform(UserRequest.java:153)
	at hudson.remoting.UserRequest.perform(UserRequest.java:50)
	at hudson.remoting.Request$2.run(Request.java:332)
	at hudson.remoting.InterceptingExecutorService$1.call(InterceptingExecutorService.java:68)
	at java.util.concurrent.FutureTask.run(FutureTask.java:262)
	at java.util.concurrent.ThreadPoolExecutor.runWorker(ThreadPoolExecutor.java:1145)
	at java.util.concurrent.ThreadPoolExecutor$Worker.run(ThreadPoolExecutor.java:615)
	at java.lang.Thread.run(Thread.java:745)
Caused by: org.tmatesoft.sqljet.core.SqlJetException: FULL: error code is FULL
	at org.tmatesoft.sqljet.core.internal.pager.SqlJetPager.openJournal(SqlJetPager.java:3051)
	at org.tmatesoft.sqljet.core.internal.pager.SqlJetPager.begin(SqlJetPager.java:2782)
	at org.tmatesoft.sqljet.core.internal.btree.SqlJetBtree.beginTrans(SqlJetBtree.java:931)
	at org.tmatesoft.sqljet.core.table.engine.SqlJetEngine.doBeginTransaction(SqlJetEngine.java:561)
	at org.tmatesoft.sqljet.core.table.engine.SqlJetEngine.access$100(SqlJetEngine.java:55)
	at org.tmatesoft.sqljet.core.table.engine.SqlJetEngine$12.runSynchronized(SqlJetEngine.java:535)
	at org.tmatesoft.sqljet.core.table.engine.SqlJetEngine.runSynchronized(SqlJetEngine.java:217)
	at org.tmatesoft.sqljet.core.table.engine.SqlJetEngine.runEngineTransaction(SqlJetEngine.java:529)
	at org.tmatesoft.sqljet.core.table.SqlJetDb.runTransaction(SqlJetDb.java:238)
	at org.tmatesoft.sqljet.core.table.SqlJetDb.runWriteTransaction(SqlJetDb.java:211)
	at org.tmatesoft.svn.core.internal.wc17.db.statement.SVNWCDbCreateSchema.exec(SVNWCDbCreateSchema.java:225)
	at org.tmatesoft.svn.core.internal.db.SVNSqlJetStatement.done(SVNSqlJetStatement.java:420)
	at org.tmatesoft.svn.core.internal.wc17.db.SVNWCDb$BumpRevisionPostUpdate.bumpMovedAway(SVNWCDb.java:5215)
	at org.tmatesoft.svn.core.internal.wc17.db.SVNWCDb$BumpRevisionPostUpdate.transaction(SVNWCDb.java:5208)
	at org.tmatesoft.svn.core.internal.db.SVNSqlJetDb.runTransaction(SVNSqlJetDb.java:258)
	at org.tmatesoft.svn.core.internal.db.SVNSqlJetDb.runTransaction(SVNSqlJetDb.java:252)
	at org.tmatesoft.svn.core.internal.wc17.db.SVNWCDb.opBumpRevisionPostUpdate(SVNWCDb.java:5160)
	at org.tmatesoft.svn.core.internal.wc17.SVNUpdateEditor17.closeEdit(SVNUpdateEditor17.java:1728)
	at org.tmatesoft.svn.core.internal.wc.SVNCancellableEditor.closeEdit(SVNCancellableEditor.java:148)
	at org.tmatesoft.svn.core.internal.io.dav.handlers.DAVEditorHandler.endElement(DAVEditorHandler.java:492)
	at org.tmatesoft.svn.core.internal.io.dav.handlers.BasicDAVHandler.endElement(BasicDAVHandler.java:103)
	at com.sun.org.apache.xerces.internal.parsers.AbstractSAXParser.endElement(AbstractSAXParser.java:609)
	at com.sun.org.apache.xerces.internal.impl.XMLDocumentFragmentScannerImpl.scanEndElement(XMLDocumentFragmentScannerImpl.java:1781)
	at com.sun.org.apache.xerces.internal.impl.XMLDocumentFragmentScannerImpl$FragmentContentDriver.next(XMLDocumentFragmentScannerImpl.java:2957)
	at com.sun.org.apache.xerces.internal.impl.XMLDocumentScannerImpl.next(XMLDocumentScannerImpl.java:606)
	at com.sun.org.apache.xerces.internal.impl.XMLNSDocumentScannerImpl.next(XMLNSDocumentScannerImpl.java:117)
	at com.sun.org.apache.xerces.internal.impl.XMLDocumentFragmentScannerImpl.scanDocument(XMLDocumentFragmentScannerImpl.java:510)
	at com.sun.org.apache.xerces.internal.parsers.XML11Configuration.parse(XML11Configuration.java:848)
	at com.sun.org.apache.xerces.internal.parsers.XML11Configuration.parse(XML11Configuration.java:777)
	at com.sun.org.apache.xerces.internal.parsers.XMLParser.parse(XMLParser.java:141)
	at com.sun.org.apache.xerces.internal.parsers.AbstractSAXParser.parse(AbstractSAXParser.java:1213)
	at com.sun.org.apache.xerces.internal.jaxp.SAXParserImpl$JAXPSAXParser.parse(SAXParserImpl.java:649)
	at org.tmatesoft.svn.core.internal.io.dav.http.HTTPConnection.readData(HTTPConnection.java:932)
	at org.tmatesoft.svn.core.internal.io.dav.http.HTTPConnection.readData(HTTPConnection.java:897)
	at org.tmatesoft.svn.core.internal.io.dav.http.HTTPRequest.dispatch(HTTPRequest.java:220)
	at org.tmatesoft.svn.core.internal.io.dav.http.HTTPConnection.request(HTTPConnection.java:497)
	... 29 more
etadata.xml
AU        ruta-maven-archetype/pom.xml
A         ruta-parent
A         ruta-parent/pom.xml
 U        .
java.io.IOException: remote file operation failed: <https://builds.apache.org/job/UIMA-Ruta/ws/>
at hudson.remoting.Channel@2cc3b3b:ubuntu-us1: java.io.IOException: Failed to check out https://svn.apache.org/repos/asf/uima/ruta/trunk
	at hudson.FilePath.act(FilePath.java:1014)
	at hudson.FilePath.act(FilePath.java:996)
	at hudson.scm.SubversionSCM.checkout(SubversionSCM.java:897)
	at hudson.scm.SubversionSCM.checkout(SubversionSCM.java:833)
	at hudson.scm.SCM.checkout(SCM.java:485)
	at hudson.model.AbstractProject.checkout(AbstractProject.java:1269)
	at hudson.model.AbstractBuild$AbstractBuildExecution.defaultCheckout(AbstractBuild.java:604)
	at jenkins.scm.SCMCheckoutStrategy.checkout(SCMCheckoutStrategy.java:86)
	at hudson.model.AbstractBuild$AbstractBuildExecution.run(AbstractBuild.java:529)
	at hudson.model.Run.execute(Run.java:1741)
	at hudson.maven.MavenModuleSetBuild.run(MavenModuleSetBuild.java:531)
	at hudson.model.ResourceController.execute(ResourceController.java:98)
	at hudson.model.Executor.run(Executor.java:410)
Caused by: java.io.IOException: Failed to check out https://svn.apache.org/repos/asf/uima/ruta/trunk
	at hudson.scm.subversion.CheckoutUpdater$1.perform(CheckoutUpdater.java:130)
	at hudson.scm.subversion.WorkspaceUpdater$UpdateTask.delegateTo(WorkspaceUpdater.java:162)
	at hudson.scm.SubversionSCM$CheckOutTask.perform(SubversionSCM.java:996)
	at hudson.scm.SubversionSCM$CheckOutTask.invoke(SubversionSCM.java:972)
	at hudson.scm.SubversionSCM$CheckOutTask.invoke(SubversionSCM.java:948)
	at hudson.FilePath$FileCallableWrapper.call(FilePath.java:2772)
	at hudson.remoting.UserRequest.perform(UserRequest.java:153)
	at hudson.remoting.UserRequest.perform(UserRequest.java:50)
	at hudson.remoting.Request$2.run(Request.java:332)
	at hudson.remoting.InterceptingExecutorService$1.call(InterceptingExecutorService.java:68)
	at java.util.concurrent.FutureTask.run(FutureTask.java:262)
	at java.util.concurrent.ThreadPoolExecutor.runWorker(ThreadPoolExecutor.java:1145)
	at java.util.concurrent.ThreadPoolExecutor$Worker.run(ThreadPoolExecutor.java:615)
	at java.lang.Thread.run(Thread.java:745)
	at ......remote call to ubuntu-us1(Native Method)
	at hudson.remoting.Channel.attachCallSiteStackTrace(Channel.java:1416)
	at hudson.remoting.UserResponse.retrieve(UserRequest.java:253)
	at hudson.remoting.Channel.call(Channel.java:781)
	at hudson.FilePath.act(FilePath.java:1007)
	... 12 more
Caused by: org.tmatesoft.svn.core.SVNException: svn: E200030: FULL
	at org.tmatesoft.svn.core.internal.wc.SVNErrorManager.error(SVNErrorManager.java:64)
	at org.tmatesoft.svn.core.internal.wc.SVNErrorManager.error(SVNErrorManager.java:51)
	at org.tmatesoft.svn.core.internal.io.dav.http.HTTPConnection.request(HTTPConnection.java:793)
	at org.tmatesoft.svn.core.internal.io.dav.http.HTTPConnection.request(HTTPConnection.java:398)
	at org.tmatesoft.svn.core.internal.io.dav.http.HTTPConnection.request(HTTPConnection.java:386)
	at org.tmatesoft.svn.core.internal.io.dav.DAVConnection.performHttpRequest(DAVConnection.java:863)
	at org.tmatesoft.svn.core.internal.io.dav.DAVConnection.doReport(DAVConnection.java:360)
	at org.tmatesoft.svn.core.internal.io.dav.DAVRepository.runReport(DAVRepository.java:1340)
	at org.tmatesoft.svn.core.internal.io.dav.DAVRepository.update(DAVRepository.java:868)
	at org.tmatesoft.svn.core.internal.wc2.ng.SvnNgAbstractUpdate.updateInternal(SvnNgAbstractUpdate.java:247)
	at org.tmatesoft.svn.core.internal.wc2.ng.SvnNgAbstractUpdate.update(SvnNgAbstractUpdate.java:111)
	at org.tmatesoft.svn.core.internal.wc2.ng.SvnNgAbstractUpdate.checkout(SvnNgAbstractUpdate.java:855)
	at org.tmatesoft.svn.core.internal.wc2.ng.SvnNgCheckout.run(SvnNgCheckout.java:26)
	at org.tmatesoft.svn.core.internal.wc2.ng.SvnNgCheckout.run(SvnNgCheckout.java:11)
	at org.tmatesoft.svn.core.internal.wc2.ng.SvnNgOperationRunner.run(SvnNgOperationRunner.java:20)
	at org.tmatesoft.svn.core.internal.wc2.SvnOperationRunner.run(SvnOperationRunner.java:21)
	at org.tmatesoft.svn.core.wc2.SvnOperationFactory.run(SvnOperationFactory.java:1235)
	at org.tmatesoft.svn.core.wc2.SvnOperation.run(SvnOperation.java:294)
	at hudson.scm.subversion.CheckoutUpdater$1.perform(CheckoutUpdater.java:119)
	at hudson.scm.subversion.WorkspaceUpdater$UpdateTask.delegateTo(WorkspaceUpdater.java:162)
	at hudson.scm.SubversionSCM$CheckOutTask.perform(SubversionSCM.java:996)
	at hudson.scm.SubversionSCM$CheckOutTask.invoke(SubversionSCM.java:972)
	at hudson.scm.SubversionSCM$CheckOutTask.invoke(SubversionSCM.java:948)
	at hudson.FilePath$FileCallableWrapper.call(FilePath.java:2772)
	at hudson.remoting.UserRequest.perform(UserRequest.java:153)
	at hudson.remoting.UserRequest.perform(UserRequest.java:50)
	at hudson.remoting.Request$2.run(Request.java:332)
	at hudson.remoting.InterceptingExecutorService$1.call(InterceptingExecutorService.java:68)
	at java.util.concurrent.FutureTask.run(FutureTask.java:262)
	at java.util.concurrent.ThreadPoolExecutor.runWorker(ThreadPoolExecutor.java:1145)
	at java.util.concurrent.ThreadPoolExecutor$Worker.run(ThreadPoolExecutor.java:615)
	at java.lang.Thread.run(Thread.java:745)
Caused by: org.tmatesoft.sqljet.core.SqlJetException: FULL: error code is FULL
	at org.tmatesoft.sqljet.core.internal.pager.SqlJetPager.openJournal(SqlJetPager.java:3051)
	at org.tmatesoft.sqljet.core.internal.pager.SqlJetPager.begin(SqlJetPager.java:2782)
	at org.tmatesoft.sqljet.core.internal.btree.SqlJetBtree.beginTrans(SqlJetBtree.java:931)
	at org.tmatesoft.sqljet.core.table.engine.SqlJetEngine.doBeginTransaction(SqlJetEngine.java:561)
	at org.tmatesoft.sqljet.core.table.engine.SqlJetEngine.access$100(SqlJetEngine.java:55)
	at org.tmatesoft.sqljet.core.table.engine.SqlJetEngine$12.runSynchronized(SqlJetEngine.java:535)
	at org.tmatesoft.sqljet.core.table.engine.SqlJetEngine.runSynchronized(SqlJetEngine.java:217)
	at org.tmatesoft.sqljet.core.table.engine.SqlJetEngine.runEngineTransaction(SqlJetEngine.java:529)
	at org.tmatesoft.sqljet.core.table.SqlJetDb.runTransaction(SqlJetDb.java:238)
	at org.tmatesoft.sqljet.core.table.SqlJetDb.runWriteTransaction(SqlJetDb.java:211)
	at org.tmatesoft.svn.core.internal.wc17.db.statement.SVNWCDbCreateSchema.exec(SVNWCDbCreateSchema.java:225)
	at org.tmatesoft.svn.core.internal.db.SVNSqlJetStatement.done(SVNSqlJetStatement.java:420)
	at org.tmatesoft.svn.core.internal.wc17.db.SVNWCDb$BumpRevisionPostUpdate.bumpMovedAway(SVNWCDb.java:5215)
	at org.tmatesoft.svn.core.internal.wc17.db.SVNWCDb$BumpRevisionPostUpdate.transaction(SVNWCDb.java:5208)
	at org.tmatesoft.svn.core.internal.db.SVNSqlJetDb.runTransaction(SVNSqlJetDb.java:258)
	at org.tmatesoft.svn.core.internal.db.SVNSqlJetDb.runTransaction(SVNSqlJetDb.java:252)
	at org.tmatesoft.svn.core.internal.wc17.db.SVNWCDb.opBumpRevisionPostUpdate(SVNWCDb.java:5160)
	at org.tmatesoft.svn.core.internal.wc17.SVNUpdateEditor17.closeEdit(SVNUpdateEditor17.java:1728)
	at org.tmatesoft.svn.core.internal.wc.SVNCancellableEditor.closeEdit(SVNCancellableEditor.java:148)
	at org.tmatesoft.svn.core.internal.io.dav.handlers.DAVEditorHandler.endElement(DAVEditorHandler.java:492)
	at org.tmatesoft.svn.core.internal.io.dav.handlers.BasicDAVHandler.endElement(BasicDAVHandler.java:103)
	at com.sun.org.apache.xerces.internal.parsers.AbstractSAXParser.endElement(AbstractSAXParser.java:609)
	at com.sun.org.apache.xerces.internal.impl.XMLDocumentFragmentScannerImpl.scanEndElement(XMLDocumentFragmentScannerImpl.java:1781)
	at com.sun.org.apache.xerces.internal.impl.XMLDocumentFragmentScannerImpl$FragmentContentDriver.next(XMLDocumentFragmentScannerImpl.java:2957)
	at com.sun.org.apache.xerces.internal.impl.XMLDocumentScannerImpl.next(XMLDocumentScannerImpl.java:606)
	at com.sun.org.apache.xerces.internal.impl.XMLNSDocumentScannerImpl.next(XMLNSDocumentScannerImpl.java:117)
	at com.sun.org.apache.xerces.internal.impl.XMLDocumentFragmentScannerImpl.scanDocument(XMLDocumentFragmentScannerImpl.java:510)
	at com.sun.org.apache.xerces.internal.parsers.XML11Configuration.parse(XML11Configuration.java:848)
	at com.sun.org.apache.xerces.internal.parsers.XML11Configuration.parse(XML11Configuration.java:777)
	at com.sun.org.apache.xerces.internal.parsers.XMLParser.parse(XMLParser.java:141)
	at com.sun.org.apache.xerces.internal.parsers.AbstractSAXParser.parse(AbstractSAXParser.java:1213)
	at com.sun.org.apache.xerces.internal.jaxp.SAXParserImpl$JAXPSAXParser.parse(SAXParserImpl.java:649)
	at org.tmatesoft.svn.core.internal.io.dav.http.HTTPConnection.readData(HTTPConnection.java:932)
	at org.tmatesoft.svn.core.internal.io.dav.http.HTTPConnection.readData(HTTPConnection.java:897)
	at org.tmatesoft.svn.core.internal.io.dav.http.HTTPRequest.dispatch(HTTPRequest.java:220)
	at org.tmatesoft.svn.core.internal.io.dav.http.HTTPConnection.request(HTTPConnection.java:497)
	... 29 more
[WARNINGS] Skipping publisher since build result is FAILURE
Skipping Cobertura coverage report as build was not UNSTABLE or better ...

Mime
View raw message