uima-dev mailing list archives

Site index · List index
Message view « Date » · « Thread »
Top « Date » · « Thread »
From Apache Jenkins Server <jenk...@builds.apache.org>
Subject Build failed in Jenkins: UIMA-AS #425
Date Fri, 09 Sep 2016 19:08:57 GMT
See <https://builds.apache.org/job/UIMA-AS/425/changes>

Changes:

[cwiklik] UIMA-5105 updated to run with new JUnit using a custom Runner.

[cwiklik] UIMA-5105 Modified to use custom JUnit Runner. Allows to capture failed run and
fail fast.

[cwiklik] UIMA-5105 added dependency on new junit 4.8.1 and updated surefire plugin to run
junit tests

[cwiklik] UIMA-5105 reduced verbosity of tests.

[cwiklik] UIMA-5105 added debug msgs

------------------------------------------
[...truncated 336 lines...]
[INFO] 
[INFO] --- build-helper-maven-plugin:1.8:parse-version (parse-project-version) @ uimaj-as-jms
---
[INFO] 
[INFO] --- uima-build-helper-maven-plugin:7:parse-date-time (set buildYear and buildMonth)
@ uimaj-as-jms ---
[INFO] 
[INFO] --- maven-remote-resources-plugin:1.5:process (default) @ uimaj-as-jms ---
[INFO] 
[INFO] --- maven-resources-plugin:2.6:resources (default-resources) @ uimaj-as-jms ---
[INFO] Using 'UTF-8' encoding to copy filtered resources.
[INFO] Copying 1 resource
[INFO] Copying 3 resources
[INFO] 
[INFO] --- maven-compiler-plugin:3.1:compile (default-compile) @ uimaj-as-jms ---
[INFO] Changes detected - recompiling the module!
[INFO] Compiling 13 source files to <https://builds.apache.org/job/UIMA-AS/ws/trunk/uimaj-as-jms/target/classes>
[WARNING] <https://builds.apache.org/job/UIMA-AS/ws/trunk/uimaj-as-jms/src/main/java/org/apache/uima/adapter/jms/client/BaseUIMAAsynchronousEngineCommon_impl.java>:
<https://builds.apache.org/job/UIMA-AS/ws/trunk/uimaj-as-jms/src/main/java/org/apache/uima/adapter/jms/client/BaseUIMAAsynchronousEngineCommon_impl.java>
uses unchecked or unsafe operations.
[WARNING] <https://builds.apache.org/job/UIMA-AS/ws/trunk/uimaj-as-jms/src/main/java/org/apache/uima/adapter/jms/client/BaseUIMAAsynchronousEngineCommon_impl.java>:
Recompile with -Xlint:unchecked for details.
[INFO] 
[INFO] --- maven-resources-plugin:2.6:testResources (default-testResources) @ uimaj-as-jms
---
[INFO] Using 'UTF-8' encoding to copy filtered resources.
[INFO] Copying 0 resource
[INFO] Copying 3 resources
[INFO] 
[INFO] --- maven-compiler-plugin:3.1:testCompile (default-testCompile) @ uimaj-as-jms ---
[INFO] Nothing to compile - all classes are up to date
[INFO] 
[INFO] --- maven-surefire-plugin:2.16:test (default-test) @ uimaj-as-jms ---
[JENKINS] Recording test results[INFO] 
[INFO] --- maven-antrun-plugin:1.7:run (dup-meta-jar-cleanup) @ uimaj-as-jms ---

[INFO] Executing tasks

main:
[INFO] Executed tasks
[INFO] 
[INFO] --- maven-jar-plugin:2.3.2:jar (default-jar) @ uimaj-as-jms ---
[INFO] Building jar: <https://builds.apache.org/job/UIMA-AS/ws/trunk/uimaj-as-jms/target/uimaj-as-jms.jar>
[INFO] 
[INFO] --- maven-site-plugin:3.3:attach-descriptor (attach-descriptor) @ uimaj-as-jms ---
[INFO] 
[INFO] --- maven-install-plugin:2.5.1:install (default-install) @ uimaj-as-jms ---
[INFO] Installing <https://builds.apache.org/job/UIMA-AS/ws/trunk/uimaj-as-jms/target/uimaj-as-jms.jar>
to /home/jenkins/.m2/repository/org/apache/uima/uimaj-as-jms/2.9.0-SNAPSHOT/uimaj-as-jms-2.9.0-SNAPSHOT.jar
[INFO] Installing <https://builds.apache.org/job/UIMA-AS/ws/trunk/uimaj-as-jms/pom.xml>
to /home/jenkins/.m2/repository/org/apache/uima/uimaj-as-jms/2.9.0-SNAPSHOT/uimaj-as-jms-2.9.0-SNAPSHOT.pom
[INFO] 
[INFO] --- maven-pmd-plugin:3.6:pmd (default-cli) @ uimaj-as-jms ---
[PMD] Finding all files that match the pattern pmd.xml
[PMD] Parsing 1 file in <https://builds.apache.org/job/UIMA-AS/ws/trunk/uimaj-as-jms/target>
[PMD] Successfully parsed file <https://builds.apache.org/job/UIMA-AS/ws/trunk/uimaj-as-jms/target/pmd.xml>
of module Apache UIMA-AS: uimaj-as-jms with 41 unique warnings and 0 duplicates.
[PMD] Computing warning deltas based on reference build #423
[INFO] 
[INFO] --- maven-pmd-plugin:3.6:cpd (default-cli) @ uimaj-as-jms ---
[DRY] Finding all files that match the pattern cpd.xml
[DRY] Parsing 1 file in <https://builds.apache.org/job/UIMA-AS/ws/trunk/uimaj-as-jms/target>
[DRY] Successfully parsed file <https://builds.apache.org/job/UIMA-AS/ws/trunk/uimaj-as-jms/target/cpd.xml>
of module Apache UIMA-AS: uimaj-as-jms with 0 unique warnings and 0 duplicates.
[DRY] Computing warning deltas based on reference build #423
[INFO] 
[INFO] --- findbugs-maven-plugin:3.0.4:findbugs (default-cli) @ uimaj-as-jms ---
[INFO] Fork Value is true
     [java] Warnings generated: 13
[INFO] Done FindBugs Analysis....
[FINDBUGS] Finding all files that match the pattern findbugsXml.xml
[FINDBUGS] Parsing 1 file in <https://builds.apache.org/job/UIMA-AS/ws/trunk/uimaj-as-jms/target>
[FINDBUGS] Successfully parsed file <https://builds.apache.org/job/UIMA-AS/ws/trunk/uimaj-as-jms/target/findbugsXml.xml>
of module Apache UIMA-AS: uimaj-as-jms with 13 unique warnings and 0 duplicates.
[FINDBUGS] Computing warning deltas based on reference build #423
[INFO] 
[INFO] >>> cobertura-maven-plugin:2.7:cobertura (default-cli) > [cobertura]test
@ uimaj-as-jms >>>
[INFO] 
[INFO] --- maven-enforcer-plugin:1.3.1:enforce (enforce-versions) @ uimaj-as-jms ---
[INFO] 
[INFO] --- build-helper-maven-plugin:1.8:parse-version (parse-project-version) @ uimaj-as-jms
---
[INFO] 
[INFO] --- uima-build-helper-maven-plugin:7:parse-date-time (set buildYear and buildMonth)
@ uimaj-as-jms ---
[INFO] 
[INFO] --- maven-remote-resources-plugin:1.5:process (default) @ uimaj-as-jms ---
[INFO] 
[INFO] --- maven-resources-plugin:2.6:resources (default-resources) @ uimaj-as-jms ---
[INFO] Using 'UTF-8' encoding to copy filtered resources.
[INFO] Copying 1 resource
[INFO] Copying 3 resources
[INFO] Copying 3 resources
[INFO] 
[INFO] --- maven-compiler-plugin:3.1:compile (default-compile) @ uimaj-as-jms ---
[INFO] Nothing to compile - all classes are up to date
[INFO] 
[INFO] --- cobertura-maven-plugin:2.7:instrument (default-cli) @ uimaj-as-jms ---
[INFO] Cobertura 2.1.1 - GNU GPL License (NO WARRANTY) - See COPYRIGHT file
[INFO] Cobertura: Saved information on 24 classes.
[INFO] Cobertura: Saved information on 24 classes.

[INFO] Instrumentation was successful.
[INFO] NOT adding cobertura ser file to attached artifacts list.
[INFO] 
[INFO] --- maven-resources-plugin:2.6:testResources (default-testResources) @ uimaj-as-jms
---
[INFO] Using 'UTF-8' encoding to copy filtered resources.
[INFO] Copying 0 resource
[INFO] Copying 3 resources
[INFO] Copying 3 resources
[INFO] 
[INFO] --- maven-compiler-plugin:3.1:testCompile (default-testCompile) @ uimaj-as-jms ---
[INFO] Nothing to compile - all classes are up to date
[INFO] 
[INFO] --- maven-surefire-plugin:2.16:test (default-test) @ uimaj-as-jms ---
[JENKINS] Recording test results
[INFO] 
[INFO] <<< cobertura-maven-plugin:2.7:cobertura (default-cli) < [cobertura]test
@ uimaj-as-jms <<<
[INFO] 
[INFO] --- cobertura-maven-plugin:2.7:cobertura (default-cli) @ uimaj-as-jms ---
[INFO] Cobertura 2.1.1 - GNU GPL License (NO WARRANTY) - See COPYRIGHT file
[INFO] Cobertura: Loaded information on 24 classes.
Report time: 908ms

[INFO] Cobertura Report generation was successful.
[INFO] 
[INFO] >>> maven-javadoc-plugin:2.9.1:javadoc (default-cli) > generate-sources
@ uimaj-as-jms >>>
[INFO] 
[INFO] --- maven-enforcer-plugin:1.3.1:enforce (enforce-versions) @ uimaj-as-jms ---
[INFO] 
[INFO] --- build-helper-maven-plugin:1.8:parse-version (parse-project-version) @ uimaj-as-jms
---
[INFO] 
[INFO] --- uima-build-helper-maven-plugin:7:parse-date-time (set buildYear and buildMonth)
@ uimaj-as-jms ---
[WARNING] Failed to getClass for org.apache.maven.plugin.javadoc.JavadocReport
[INFO] 
[INFO] <<< maven-javadoc-plugin:2.9.1:javadoc (default-cli) < generate-sources
@ uimaj-as-jms <<<
[INFO] 
[INFO] --- maven-javadoc-plugin:2.9.1:javadoc (default-cli) @ uimaj-as-jms ---
[INFO] 
6 warnings
[WARNING] Javadoc Warnings
[WARNING] warning: [options] bootstrap class path not set in conjunction with -source 1.5
[WARNING] <https://builds.apache.org/job/UIMA-AS/ws/trunk/uimaj-as-jms/src/main/java/org/apache/uima/adapter/jms/client/BaseMessageSender.java>:478:
warning - @override is an unknown tag.
[WARNING] <https://builds.apache.org/job/UIMA-AS/ws/trunk/uimaj-as-jms/src/main/java/org/apache/uima/adapter/jms/client/BaseUIMAAsynchronousEngineCommon_impl.java>:1921:
warning - @return tag has no arguments.
[WARNING] <https://builds.apache.org/job/UIMA-AS/ws/trunk/uimaj-as-jms/src/main/java/org/apache/uima/adapter/jms/client/BaseUIMAAsynchronousEngineCommon_impl.java>:2412:
warning - @override is an unknown tag.
[WARNING] <https://builds.apache.org/job/UIMA-AS/ws/trunk/uimaj-as-jms/src/main/java/org/apache/uima/adapter/jms/client/BaseUIMAAsynchronousEngineCommon_impl.java>:2924:
warning - @override is an unknown tag.
[WARNING] <https://builds.apache.org/job/UIMA-AS/ws/trunk/uimaj-as-jms/src/main/java/org/apache/uima/adapter/jms/client/BaseUIMAAsynchronousEngineCommon_impl.java>:3197:
warning - @return tag has no arguments.
[JENKINS] Archiving  javadoc
[INFO]                                                                         
[INFO] ------------------------------------------------------------------------
[INFO] Building Apache UIMA-AS: uimaj-as-activemq 2.9.0-SNAPSHOT
[INFO] ------------------------------------------------------------------------
[INFO] 
[INFO] --- maven-clean-plugin:2.5:clean (default-clean) @ uimaj-as-activemq ---
[INFO] Deleting <https://builds.apache.org/job/UIMA-AS/ws/trunk/uimaj-as-activemq/target>
[TASKS] Scanning folder '<https://builds.apache.org/job/UIMA-AS/ws/trunk/uimaj-as-activemq'>
for files matching the pattern '**/*.java' - excludes: 
[TASKS] Found 39 files to scan for tasks
Found 12 open tasks.
[TASKS] Computing warning deltas based on reference build #422
[INFO] 
[INFO] --- maven-enforcer-plugin:1.3.1:enforce (enforce-versions) @ uimaj-as-activemq ---
[INFO] 
[INFO] --- build-helper-maven-plugin:1.8:parse-version (parse-project-version) @ uimaj-as-activemq
---
[INFO] 
[INFO] --- uima-build-helper-maven-plugin:7:parse-date-time (set buildYear and buildMonth)
@ uimaj-as-activemq ---
[INFO] 
[INFO] --- maven-remote-resources-plugin:1.5:process (default) @ uimaj-as-activemq ---
[INFO] 
[INFO] --- maven-resources-plugin:2.6:resources (default-resources) @ uimaj-as-activemq ---
[INFO] Using 'UTF-8' encoding to copy filtered resources.
[INFO] Copying 0 resource
[INFO] Copying 3 resources
[INFO] 
[INFO] --- maven-compiler-plugin:3.1:compile (default-compile) @ uimaj-as-activemq ---
[INFO] Changes detected - recompiling the module!
[INFO] Compiling 23 source files to <https://builds.apache.org/job/UIMA-AS/ws/trunk/uimaj-as-activemq/target/classes>
[INFO] -------------------------------------------------------------
[WARNING] COMPILATION WARNING : 
[INFO] -------------------------------------------------------------
[WARNING] <https://builds.apache.org/job/UIMA-AS/ws/trunk/uimaj-as-activemq/src/main/java/org/apache/uima/adapter/jms/activemq/UimaDefaultMessageListenerContainer.java>:
Some input files use unchecked or unsafe operations.
[WARNING] <https://builds.apache.org/job/UIMA-AS/ws/trunk/uimaj-as-activemq/src/main/java/org/apache/uima/adapter/jms/activemq/UimaDefaultMessageListenerContainer.java>:
Recompile with -Xlint:unchecked for details.
[INFO] 2 warnings 
[INFO] -------------------------------------------------------------
[INFO] -------------------------------------------------------------
[ERROR] COMPILATION ERROR : 
[INFO] -------------------------------------------------------------
[ERROR] <https://builds.apache.org/job/UIMA-AS/ws/trunk/uimaj-as-activemq/src/main/java/org/apache/uima/adapter/jms/activemq/UimaDefaultMessageListenerContainer.java>:[50,27]
cannot find symbol
  symbol:   class UimaASCredentials
  location: package org.apache.uima.aae
[ERROR] <https://builds.apache.org/job/UIMA-AS/ws/trunk/uimaj-as-activemq/src/main/java/org/apache/uima/adapter/jms/activemq/UimaDefaultMessageListenerContainer.java>:[856,9]
cannot find symbol
  symbol:   class UimaASCredentials
  location: class org.apache.uima.adapter.jms.activemq.UimaDefaultMessageListenerContainer
[ERROR] <https://builds.apache.org/job/UIMA-AS/ws/trunk/uimaj-as-activemq/src/main/java/org/apache/uima/adapter/jms/activemq/UimaDefaultMessageListenerContainer.java>:[856,45]
cannot find symbol
  symbol:   class UimaASCredentials
  location: class org.apache.uima.adapter.jms.activemq.UimaDefaultMessageListenerContainer
[INFO] 3 errors 
[INFO] -------------------------------------------------------------
[INFO] ------------------------------------------------------------------------
[INFO] Reactor Summary:
[INFO] 
[INFO] Apache UIMA-AS: uima-as-parent ..................... SUCCESS [ 20.070 s]
[INFO] Apache UIMA-AS: uimaj-as-core ...................... SUCCESS [03:20 min]
[INFO] Apache UIMA-AS: uimaj-as-jms ....................... SUCCESS [ 36.101 s]
[INFO] Apache UIMA-AS: uimaj-as-activemq .................. FAILURE [  7.371 s]
[INFO] Apache UIMA-AS Eclipse Plugin: uimaj-ep-runtime-deployeditor SKIPPED
[INFO] Apache UIMA-AS Eclipse Plugin: uimaj-ep-deployeditor SKIPPED
[INFO] Apache UIMA AS: uimaj-as-osgi-runtime .............. SKIPPED
[INFO] Apache UIMA-AS: uimaj-as-camel ..................... SKIPPED
[INFO] Apache UIMA Eclipse: uimaj-eclipse-feature-deployeditor SKIPPED
[INFO] Apache UIMA-AS Aggregate: aggregate-uima-as-eclipse-plugins SKIPPED
[INFO] Apache UIMA-AS: uima-as-docbooks ................... SKIPPED
[INFO] Apache UIMA-AS Aggregate: aggregate-uima-as ........ SKIPPED
[INFO] Apache UIMA-AS: uima-as ............................ SKIPPED
[INFO] ------------------------------------------------------------------------
[INFO] BUILD FAILURE
[INFO] ------------------------------------------------------------------------
[INFO] Total time: 04:35 min
[INFO] Finished at: 2016-09-09T19:08:33+00:00
[INFO] Final Memory: 87M/795M
[INFO] ------------------------------------------------------------------------
Waiting for Jenkins to finish collecting data
[ERROR] Failed to execute goal org.apache.maven.plugins:maven-compiler-plugin:3.1:compile
(default-compile) on project uimaj-as-activemq: Compilation failure: Compilation failure:
[ERROR] <https://builds.apache.org/job/UIMA-AS/ws/trunk/uimaj-as-activemq/src/main/java/org/apache/uima/adapter/jms/activemq/UimaDefaultMessageListenerContainer.java>:[50,27]
cannot find symbol
[ERROR] symbol:   class UimaASCredentials
[ERROR] location: package org.apache.uima.aae
[ERROR] <https://builds.apache.org/job/UIMA-AS/ws/trunk/uimaj-as-activemq/src/main/java/org/apache/uima/adapter/jms/activemq/UimaDefaultMessageListenerContainer.java>:[856,9]
cannot find symbol
[ERROR] symbol:   class UimaASCredentials
[ERROR] location: class org.apache.uima.adapter.jms.activemq.UimaDefaultMessageListenerContainer
[ERROR] <https://builds.apache.org/job/UIMA-AS/ws/trunk/uimaj-as-activemq/src/main/java/org/apache/uima/adapter/jms/activemq/UimaDefaultMessageListenerContainer.java>:[856,45]
cannot find symbol
[ERROR] symbol:   class UimaASCredentials
[ERROR] location: class org.apache.uima.adapter.jms.activemq.UimaDefaultMessageListenerContainer
[ERROR] -> [Help 1]
[ERROR] 
[ERROR] To see the full stack trace of the errors, re-run Maven with the -e switch.
[ERROR] Re-run Maven using the -X switch to enable full debug logging.
[ERROR] 
[ERROR] For more information about the errors and possible solutions, please read the following
articles:
[ERROR] [Help 1] http://cwiki.apache.org/confluence/display/MAVEN/MojoFailureException
[ERROR] 
[ERROR] After correcting the problems, you can resume the build with the command
[ERROR]   mvn <goals> -rf :uimaj-as-activemq
[JENKINS] Archiving <https://builds.apache.org/job/UIMA-AS/ws/trunk/uima-as-docbooks/pom.xml>
to org.apache.uima/uima-as-docbooks/2.9.0-SNAPSHOT/uima-as-docbooks-2.9.0-SNAPSHOT.pom
[JENKINS] Archiving <https://builds.apache.org/job/UIMA-AS/ws/trunk/aggregate-uima-as/pom.xml>
to org.apache.uima/aggregate-uima-as/2.9.0-SNAPSHOT/aggregate-uima-as-2.9.0-SNAPSHOT.pom
[JENKINS] Archiving <https://builds.apache.org/job/UIMA-AS/ws/trunk/uimaj-as-core/pom.xml>
to org.apache.uima/uimaj-as-core/2.9.0-SNAPSHOT/uimaj-as-core-2.9.0-SNAPSHOT.pom
[JENKINS] Archiving <https://builds.apache.org/job/UIMA-AS/ws/trunk/uimaj-as-core/target/uimaj-as-core.jar>
to org.apache.uima/uimaj-as-core/2.9.0-SNAPSHOT/uimaj-as-core-2.9.0-SNAPSHOT.jar
No artifacts from UIMA-AS » Apache UIMA-AS: uimaj-as-core #423 to compare, so performing
full copy of artifacts
[JENKINS] Archiving <https://builds.apache.org/job/UIMA-AS/ws/trunk/uimaj-ep-deployeditor/pom.xml>
to org.apache.uima/uimaj-ep-deployeditor/2.9.0-SNAPSHOT/uimaj-ep-deployeditor-2.9.0-SNAPSHOT.pom
[JENKINS] Archiving <https://builds.apache.org/job/UIMA-AS/ws/trunk/uimaj-as-activemq/pom.xml>
to org.apache.uima/uimaj-as-activemq/2.9.0-SNAPSHOT/uimaj-as-activemq-2.9.0-SNAPSHOT.pom
[JENKINS] Archiving <https://builds.apache.org/job/UIMA-AS/ws/trunk/uimaj-as-jms/pom.xml>
to org.apache.uima/uimaj-as-jms/2.9.0-SNAPSHOT/uimaj-as-jms-2.9.0-SNAPSHOT.pom
[JENKINS] Archiving <https://builds.apache.org/job/UIMA-AS/ws/trunk/uimaj-as-jms/target/uimaj-as-jms.jar>
to org.apache.uima/uimaj-as-jms/2.9.0-SNAPSHOT/uimaj-as-jms-2.9.0-SNAPSHOT.jar
No artifacts from UIMA-AS » Apache UIMA-AS: uimaj-as-jms #423 to compare, so performing full
copy of artifacts
[JENKINS] Archiving <https://builds.apache.org/job/UIMA-AS/ws/trunk/aggregate-uima-as-eclipse-plugins/pom.xml>
to org.apache.uima/aggregate-uima-as-eclipse-plugins/2.9.0-SNAPSHOT/aggregate-uima-as-eclipse-plugins-2.9.0-SNAPSHOT.pom
[JENKINS] Archiving <https://builds.apache.org/job/UIMA-AS/ws/trunk/uimaj-ep-runtime-deployeditor/pom.xml>
to org.apache.uima/uimaj-ep-runtime-deployeditor/2.9.0-SNAPSHOT/uimaj-ep-runtime-deployeditor-2.9.0-SNAPSHOT.pom
[JENKINS] Archiving <https://builds.apache.org/job/UIMA-AS/ws/trunk/uimaj-eclipse-feature-deployeditor/pom.xml>
to org.apache.uima/uimaj-eclipse-feature-deployeditor/2.9.0-SNAPSHOT/uimaj-eclipse-feature-deployeditor-2.9.0-SNAPSHOT.pom
[JENKINS] Archiving <https://builds.apache.org/job/UIMA-AS/ws/trunk/uimaj-as-osgi-runtime/pom.xml>
to org.apache.uima/uimaj-as-osgi-runtime/2.9.0-SNAPSHOT/uimaj-as-osgi-runtime-2.9.0-SNAPSHOT.pom
[JENKINS] Archiving <https://builds.apache.org/job/UIMA-AS/ws/trunk/uimaj-as-camel/pom.xml>
to org.apache.uima/uimaj-as-camel/2.9.0-SNAPSHOT/uimaj-as-camel-2.9.0-SNAPSHOT.pom
[JENKINS] Archiving <https://builds.apache.org/job/UIMA-AS/ws/trunk/pom.xml> to org.apache.uima/uima-as/2.9.0-SNAPSHOT/uima-as-2.9.0-SNAPSHOT.pom
[JENKINS] Archiving <https://builds.apache.org/job/UIMA-AS/ws/trunk/uima-as-parent/pom.xml>
to org.apache.uima/uima-as-parent/2.9.0-SNAPSHOT/uima-as-parent-2.9.0-SNAPSHOT.pom
No artifacts from UIMA-AS » Apache UIMA-AS: uima-as-parent #423 to compare, so performing
full copy of artifacts
Sending e-mails to: dev@uima.apache.org
channel stopped
Skipping Cobertura coverage report as build was not UNSTABLE or better ...

Mime
View raw message