uima-dev mailing list archives

Site index · List index
Message view « Date » · « Thread »
Top « Date » · « Thread »
From Apache Jenkins Server <jenk...@builds.apache.org>
Subject Build failed in Jenkins: UIMA-AS » Apache UIMA-AS: uimaj-as-activemq #424
Date Fri, 09 Sep 2016 19:13:26 GMT
See <https://builds.apache.org/job/UIMA-AS/org.apache.uima$uimaj-as-activemq/424/>

------------------------------------------
[...truncated 743011 lines...]
2016-09-09 19:13:14,796 [WARN|org.eclipse.jetty.security.SecurityHandler|ConstraintSecurityHandler]
ServletContext@o.e.j.s.ServletContextHandler@9c4165b{/,null,STARTING} has uncovered http methods
for path: /
2016-09-09 19:13:14,796 [WARN|org.eclipse.jetty.security.SecurityHandler|ConstraintSecurityHandler]
ServletContext@o.e.j.s.ServletContextHandler@9c4165b{/,null,STARTING} has uncovered http methods
for path: /
2016-09-09 19:13:14,796 [WARN|org.eclipse.jetty.security.SecurityHandler|ConstraintSecurityHandler]
ServletContext@o.e.j.s.ServletContextHandler@9c4165b{/,null,STARTING} has uncovered http methods
for path: /
2016-09-09 19:13:14,796 [WARN|org.eclipse.jetty.security.SecurityHandler|ConstraintSecurityHandler]
ServletContext@o.e.j.s.ServletContextHandler@9c4165b{/,null,STARTING} has uncovered http methods
for path: /
2016-09-09 19:13:14,796 [WARN|org.eclipse.jetty.security.SecurityHandler|ConstraintSecurityHandler]
ServletContext@o.e.j.s.ServletContextHandler@9c4165b{/,null,STARTING} has uncovered http methods
for path: /
2016-09-09 19:13:14,796 [WARN|org.eclipse.jetty.security.SecurityHandler|ConstraintSecurityHandler]
ServletContext@o.e.j.s.ServletContextHandler@9c4165b{/,null,STARTING} has uncovered http methods
for path: /
2016-09-09 19:13:14,796 [WARN|org.eclipse.jetty.security.SecurityHandler|ConstraintSecurityHandler]
ServletContext@o.e.j.s.ServletContextHandler@9c4165b{/,null,STARTING} has uncovered http methods
for path: /
2016-09-09 19:13:14,796 [WARN|org.eclipse.jetty.security.SecurityHandler|ConstraintSecurityHandler]
ServletContext@o.e.j.s.ServletContextHandler@9c4165b{/,null,STARTING} has uncovered http methods
for path: /
2016-09-09 19:13:14,796 [WARN|org.eclipse.jetty.security.SecurityHandler|ConstraintSecurityHandler]
ServletContext@o.e.j.s.ServletContextHandler@9c4165b{/,null,STARTING} has uncovered http methods
for path: /
2016-09-09 19:13:14,796 [WARN|org.eclipse.jetty.security.SecurityHandler|ConstraintSecurityHandler]
ServletContext@o.e.j.s.ServletContextHandler@9c4165b{/,null,STARTING} has uncovered http methods
for path: /
2016-09-09 19:13:14,796 [WARN|org.eclipse.jetty.security.SecurityHandler|ConstraintSecurityHandler]
ServletContext@o.e.j.s.ServletContextHandler@9c4165b{/,null,STARTING} has uncovered http methods
for path: /
2016-09-09 19:13:14,796 [WARN|org.eclipse.jetty.security.SecurityHandler|ConstraintSecurityHandler]
ServletContext@o.e.j.s.ServletContextHandler@9c4165b{/,null,STARTING} has uncovered http methods
for path: /
2016-09-09 19:13:14,796 [WARN|org.eclipse.jetty.security.SecurityHandler|ConstraintSecurityHandler]
ServletContext@o.e.j.s.ServletContextHandler@9c4165b{/,null,STARTING} has uncovered http methods
for path: /
2016-09-09 19:13:14,796 [WARN|org.eclipse.jetty.security.SecurityHandler|ConstraintSecurityHandler]
ServletContext@o.e.j.s.ServletContextHandler@9c4165b{/,null,STARTING} has uncovered http methods
for path: /
2016-09-09 19:13:14,796 [WARN|org.eclipse.jetty.security.SecurityHandler|ConstraintSecurityHandler]
ServletContext@o.e.j.s.ServletContextHandler@9c4165b{/,null,STARTING} has uncovered http methods
for path: /
2016-09-09 19:13:14,796 [WARN|org.eclipse.jetty.security.SecurityHandler|ConstraintSecurityHandler]
ServletContext@o.e.j.s.ServletContextHandler@9c4165b{/,null,STARTING} has uncovered http methods
for path: /
2016-09-09 19:13:14,796 [WARN|org.eclipse.jetty.security.SecurityHandler|ConstraintSecurityHandler]
ServletContext@o.e.j.s.ServletContextHandler@9c4165b{/,null,STARTING} has uncovered http methods
for path: /
2016-09-09 19:13:14,796 [WARN|org.eclipse.jetty.security.SecurityHandler|ConstraintSecurityHandler]
ServletContext@o.e.j.s.ServletContextHandler@9c4165b{/,null,STARTING} has uncovered http methods
for path: /
2016-09-09 19:13:14,796 [WARN|org.eclipse.jetty.security.SecurityHandler|ConstraintSecurityHandler]
ServletContext@o.e.j.s.ServletContextHandler@9c4165b{/,null,STARTING} has uncovered http methods
for path: /
2016-09-09 19:13:14,796 [WARN|org.eclipse.jetty.security.SecurityHandler|ConstraintSecurityHandler]
ServletContext@o.e.j.s.ServletContextHandler@9c4165b{/,null,STARTING} has uncovered http methods
for path: /
2016-09-09 19:13:14,796 [WARN|org.eclipse.jetty.security.SecurityHandler|ConstraintSecurityHandler]
ServletContext@o.e.j.s.ServletContextHandler@9c4165b{/,null,STARTING} has uncovered http methods
for path: /
2016-09-09 19:13:14,796 [WARN|org.eclipse.jetty.security.SecurityHandler|ConstraintSecurityHandler]
ServletContext@o.e.j.s.ServletContextHandler@9c4165b{/,null,STARTING} has uncovered http methods
for path: /
2016-09-09 19:13:14,796 [WARN|org.eclipse.jetty.security.SecurityHandler|ConstraintSecurityHandler]
ServletContext@o.e.j.s.ServletContextHandler@9c4165b{/,null,STARTING} has uncovered http methods
for path: /
2016-09-09 19:13:14,796 [WARN|org.eclipse.jetty.security.SecurityHandler|ConstraintSecurityHandler]
ServletContext@o.e.j.s.ServletContextHandler@9c4165b{/,null,STARTING} has uncovered http methods
for path: /
2016-09-09 19:13:14,796 [WARN|org.eclipse.jetty.security.SecurityHandler|ConstraintSecurityHandler]
ServletContext@o.e.j.s.ServletContextHandler@9c4165b{/,null,STARTING} has uncovered http methods
for path: /
2016-09-09 19:13:14,796 [WARN|org.eclipse.jetty.security.SecurityHandler|ConstraintSecurityHandler]
ServletContext@o.e.j.s.ServletContextHandler@9c4165b{/,null,STARTING} has uncovered http methods
for path: /
2016-09-09 19:13:14,796 [WARN|org.eclipse.jetty.security.SecurityHandler|ConstraintSecurityHandler]
ServletContext@o.e.j.s.ServletContextHandler@9c4165b{/,null,STARTING} has uncovered http methods
for path: /
2016-09-09 19:13:14,796 [WARN|org.eclipse.jetty.security.SecurityHandler|ConstraintSecurityHandler]
ServletContext@o.e.j.s.ServletContextHandler@9c4165b{/,null,STARTING} has uncovered http methods
for path: /
2016-09-09 19:13:14,796 [WARN|org.eclipse.jetty.security.SecurityHandler|ConstraintSecurityHandler]
ServletContext@o.e.j.s.ServletContextHandler@9c4165b{/,null,STARTING} has uncovered http methods
for path: /
2016-09-09 19:13:14,796 [WARN|org.eclipse.jetty.security.SecurityHandler|ConstraintSecurityHandler]
ServletContext@o.e.j.s.ServletContextHandler@9c4165b{/,null,STARTING} has uncovered http methods
for path: /
2016-09-09 19:13:14,796 [WARN|org.eclipse.jetty.security.SecurityHandler|ConstraintSecurityHandler]
ServletContext@o.e.j.s.ServletContextHandler@9c4165b{/,null,STARTING} has uncovered http methods
for path: /
2016-09-09 19:13:14,796 [WARN|org.eclipse.jetty.security.SecurityHandler|ConstraintSecurityHandler]
ServletContext@o.e.j.s.ServletContextHandler@9c4165b{/,null,STARTING} has uncovered http methods
for path: /
2016-09-09 19:13:14,796 [WARN|org.eclipse.jetty.security.SecurityHandler|ConstraintSecurityHandler]
ServletContext@o.e.j.s.ServletContextHandler@9c4165b{/,null,STARTING} has uncovered http methods
for path: /
2016-09-09 19:13:14,796 [WARN|org.eclipse.jetty.security.SecurityHandler|ConstraintSecurityHandler]
ServletContext@o.e.j.s.ServletContextHandler@9c4165b{/,null,STARTING} has uncovered http methods
for path: /
2016-09-09 19:13:14,796 [WARN|org.eclipse.jetty.security.SecurityHandler|ConstraintSecurityHandler]
ServletContext@o.e.j.s.ServletContextHandler@9c4165b{/,null,STARTING} has uncovered http methods
for path: /
2016-09-09 19:13:14,796 [WARN|org.eclipse.jetty.security.SecurityHandler|ConstraintSecurityHandler]
ServletContext@o.e.j.s.ServletContextHandler@9c4165b{/,null,STARTING} has uncovered http methods
for path: /
2016-09-09 19:13:14,796 [WARN|org.eclipse.jetty.security.SecurityHandler|ConstraintSecurityHandler]
ServletContext@o.e.j.s.ServletContextHandler@9c4165b{/,null,STARTING} has uncovered http methods
for path: /
2016-09-09 19:13:14,796 [WARN|org.eclipse.jetty.security.SecurityHandler|ConstraintSecurityHandler]
ServletContext@o.e.j.s.ServletContextHandler@9c4165b{/,null,STARTING} has uncovered http methods
for path: /
2016-09-09 19:13:14,796 [WARN|org.eclipse.jetty.security.SecurityHandler|ConstraintSecurityHandler]
ServletContext@o.e.j.s.ServletContextHandler@9c4165b{/,null,STARTING} has uncovered http methods
for path: /
2016-09-09 19:13:14,796 [WARN|org.eclipse.jetty.security.SecurityHandler|ConstraintSecurityHandler]
ServletContext@o.e.j.s.ServletContextHandler@9c4165b{/,null,STARTING} has uncovered http methods
for path: /
2016-09-09 19:13:14,796 [WARN|org.eclipse.jetty.security.SecurityHandler|ConstraintSecurityHandler]
ServletContext@o.e.j.s.ServletContextHandler@9c4165b{/,null,STARTING} has uncovered http methods
for path: /
2016-09-09 19:13:14,796 [WARN|org.eclipse.jetty.security.SecurityHandler|ConstraintSecurityHandler]
ServletContext@o.e.j.s.ServletContextHandler@9c4165b{/,null,STARTING} has uncovered http methods
for path: /
2016-09-09 19:13:14,796 [WARN|org.eclipse.jetty.security.SecurityHandler|ConstraintSecurityHandler]
ServletContext@o.e.j.s.ServletContextHandler@9c4165b{/,null,STARTING} has uncovered http methods
for path: /
2016-09-09 19:13:14,796 [WARN|org.eclipse.jetty.security.SecurityHandler|ConstraintSecurityHandler]
ServletContext@o.e.j.s.ServletContextHandler@9c4165b{/,null,STARTING} has uncovered http methods
for path: /
2016-09-09 19:13:14,796 [WARN|org.eclipse.jetty.security.SecurityHandler|ConstraintSecurityHandler]
ServletContext@o.e.j.s.ServletContextHandler@9c4165b{/,null,STARTING} has uncovered http methods
for path: /
2016-09-09 19:13:14,796 [WARN|org.eclipse.jetty.security.SecurityHandler|ConstraintSecurityHandler]
ServletContext@o.e.j.s.ServletContextHandler@9c4165b{/,null,STARTING} has uncovered http methods
for path: /
2016-09-09 19:13:14,796 [WARN|org.eclipse.jetty.security.SecurityHandler|ConstraintSecurityHandler]
ServletContext@o.e.j.s.ServletContextHandler@9c4165b{/,null,STARTING} has uncovered http methods
for path: /
2016-09-09 19:13:14,796 [WARN|org.eclipse.jetty.security.SecurityHandler|ConstraintSecurityHandler]
ServletContext@o.e.j.s.ServletContextHandler@9c4165b{/,null,STARTING} has uncovered http methods
for path: /
2016-09-09 19:13:14,796 [WARN|org.eclipse.jetty.security.SecurityHandler|ConstraintSecurityHandler]
ServletContext@o.e.j.s.ServletContextHandler@9c4165b{/,null,STARTING} has uncovered http methods
for path: /
2016-09-09 19:13:14,796 [WARN|org.eclipse.jetty.security.SecurityHandler|ConstraintSecurityHandler]
ServletContext@o.e.j.s.ServletContextHandler@9c4165b{/,null,STARTING} has uncovered http methods
for path: /
2016-09-09 19:13:14,796 [WARN|org.eclipse.jetty.security.SecurityHandler|ConstraintSecurityHandler]
ServletContext@o.e.j.s.ServletContextHandler@9c4165b{/,null,STARTING} has uncovered http methods
for path: /
2016-09-09 19:13:14,796 [WARN|org.eclipse.jetty.security.SecurityHandler|ConstraintSecurityHandler]
ServletContext@o.e.j.s.ServletContextHandler@9c4165b{/,null,STARTING} has uncovered http methods
for path: /
2016-09-09 19:13:14,796 [WARN|org.eclipse.jetty.security.SecurityHandler|ConstraintSecurityHandler]
ServletContext@o.e.j.s.ServletContextHandler@9c4165b{/,null,STARTING} has uncovered http methods
for path: /
2016-09-09 19:13:14,796 [WARN|org.eclipse.jetty.security.SecurityHandler|ConstraintSecurityHandler]
ServletContext@o.e.j.s.ServletContextHandler@9c4165b{/,null,STARTING} has uncovered http methods
for path: /
2016-09-09 19:13:14,796 [WARN|org.eclipse.jetty.security.SecurityHandler|ConstraintSecurityHandler]
ServletContext@o.e.j.s.ServletContextHandler@9c4165b{/,null,STARTING} has uncovered http methods
for path: /
2016-09-09 19:13:14,796 [WARN|org.eclipse.jetty.security.SecurityHandler|ConstraintSecurityHandler]
ServletContext@o.e.j.s.ServletContextHandler@9c4165b{/,null,STARTING} has uncovered http methods
for path: /
2016-09-09 19:13:14,796 [WARN|org.eclipse.jetty.security.SecurityHandler|ConstraintSecurityHandler]
ServletContext@o.e.j.s.ServletContextHandler@9c4165b{/,null,STARTING} has uncovered http methods
for path: /
2016-09-09 19:13:14,796 [WARN|org.eclipse.jetty.security.SecurityHandler|ConstraintSecurityHandler]
ServletContext@o.e.j.s.ServletContextHandler@9c4165b{/,null,STARTING} has uncovered http methods
for path: /
2016-09-09 19:13:14,796 [WARN|org.eclipse.jetty.security.SecurityHandler|ConstraintSecurityHandler]
ServletContext@o.e.j.s.ServletContextHandler@9c4165b{/,null,STARTING} has uncovered http methods
for path: /
2016-09-09 19:13:14,796 [WARN|org.eclipse.jetty.security.SecurityHandler|ConstraintSecurityHandler]
ServletContext@o.e.j.s.ServletContextHandler@9c4165b{/,null,STARTING} has uncovered http methods
for path: /
2016-09-09 19:13:14,796 [WARN|org.eclipse.jetty.security.SecurityHandler|ConstraintSecurityHandler]
ServletContext@o.e.j.s.ServletContextHandler@9c4165b{/,null,STARTING} has uncovered http methods
for path: /
 INFO | Connector http://localhost:18889 started
-------------- testMultipleSyncClientsWithMultipleBrokers -------------
>>> Stopping Broker
 INFO | Connector DefaultBrokerURL stopped
Broker Connector:tcp://localhost:61618 is stopped
 INFO | Connector http://localhost:18889 stopped
 INFO | Apache ActiveMQ 5.14.0 (localhost, ID:pietas.apache.org-59989-1473447654835-0:142)
is shutting down
 INFO | Connector DefaultBrokerURL stopped
 INFO | Connector http://localhost:18888 stopped
 INFO | Apache ActiveMQ 5.14.0 (localhost, ID:pietas.apache.org-59989-1473447654835-0:142)
uptime 0.038 seconds
 INFO | Apache ActiveMQ 5.14.0 (localhost, ID:pietas.apache.org-59989-1473447654835-0:142)
is shutdown
>>> Broker Stopped
Tests run: 122, Failures: 2, Errors: 68, Skipped: 0, Time elapsed: 740.455 sec <<<
FAILURE!
Sep 09, 2016 7:13:15 PM org.apache.uima.aae.delegate.Delegate$2 Delegate.TimerTask.run
WARNING: Timeout While Waiting For Reply From Delegate:NoOp GetMeta Request Timed Out. Configured
Reply Window Of 4,000.
Sep 09, 2016 7:13:15 PM org.apache.uima.aae.error.handler.GetMetaErrorHandler handleError
WARNING: Service: Test Aggregate TAE Runtime Exception  
Sep 09, 2016 7:13:15 PM org.apache.uima.aae.error.handler.GetMetaErrorHandler handleError
WARNING: 
org.apache.uima.aae.error.MessageTimeoutException: Delegate Service:NoOp Has Timed Out While
Processing CAS:null
	at org.apache.uima.aae.delegate.Delegate$2.run(Delegate.java:823)
	at java.util.TimerThread.mainLoop(Timer.java:555)
	at java.util.TimerThread.run(Timer.java:505)


Results :

Failed tests: 
  testCollectionReader(org.apache.uima.ee.test.TestUimaASExtended): Unable to find file:descriptors/collection_reader/ExtendedTestFileSystemCollectionReader.xmlin
classloader
  testDisableOnInitializationFailureWithDelegateBrokerMissing(org.apache.uima.ee.test.TestUimaASExtended):
Expected Success. Instead Received Exception:class org.apache.uima.resource.ResourceInitializationException

Tests in error: 
  testTypeSystemMerge(org.apache.uima.ee.test.TestUimaASExtended): Initialization of annotator
class "org.apache.uima.ae.multiplier.SimpleCasGenerator" failed.  (Descriptor: <https://builds.apache.org/job/UIMA-AS/org.apache.uima$uimaj-as-activemq/ws/src/test/resources/descriptors/analysis_engine/../multiplier/SimpleCasGenerator.xml)>
  testDeployAggregateWithDelegateCpCException(org.apache.uima.ee.test.TestUimaASExtended):
Initialization of annotator class "org.apache.uima.ae.multiplier.SimpleCasGenerator" failed.
 (Descriptor: <https://builds.apache.org/job/UIMA-AS/org.apache.uima$uimaj-as-activemq/ws/src/test/resources/descriptors/analysis_engine/../multiplier/SimpleCasGenerator.xml)>
  testClientProcessTimeoutWithAggregateMultiplier(org.apache.uima.ee.test.TestUimaASExtended):
Initialization of annotator class "org.apache.uima.ae.multiplier.SimpleCasGenerator" failed.
 (Descriptor: <https://builds.apache.org/job/UIMA-AS/org.apache.uima$uimaj-as-activemq/ws/src/test/resources/descriptors/analysis_engine/../multiplier/SimpleCasGenerator.xml)>
  testDeployAggregateService(org.apache.uima.ee.test.TestUimaASExtended): Initialization of
annotator class "org.apache.uima.ae.multiplier.SimpleCasGenerator" failed.  (Descriptor: <https://builds.apache.org/job/UIMA-AS/org.apache.uima$uimaj-as-activemq/ws/src/test/resources/descriptors/analysis_engine/../multiplier/SimpleCasGenerator.xml)>
  testDeployAggregateServiceWithScaledInnerNoOp(org.apache.uima.ee.test.TestUimaASExtended):
Initialization of annotator class "org.apache.uima.ae.multiplier.SimpleCasGenerator" failed.
 (Descriptor: <https://builds.apache.org/job/UIMA-AS/org.apache.uima$uimaj-as-activemq/ws/src/test/resources/descriptors/analysis_engine/../multiplier/SimpleCasGenerator.xml)>
  testDeployAggregateServiceWithDelegateTimeoutAndContinueOnError(org.apache.uima.ee.test.TestUimaASExtended):
The class org.apache.uima.ee.test.flow.AdvancedFixedFlowController could not be found. (Descriptor:
<https://builds.apache.org/job/UIMA-AS/org.apache.uima$uimaj-as-activemq/ws/src/test/resources/descriptors/analysis_engine/../flow/AdvancedFixedFlowController.xml)>
  testScaledSyncAggregateProcess(org.apache.uima.ee.test.TestUimaASExtended): Initialization
of annotator class "org.apache.uima.ae.multiplier.SimpleCasGenerator" failed.  (Descriptor:
<https://builds.apache.org/job/UIMA-AS/org.apache.uima$uimaj-as-activemq/ws/src/test/resources/descriptors/multiplier/SimpleCasGenerator.xml)>
  testAggregateWithFailedRemoteDelegate(org.apache.uima.ee.test.TestUimaASExtended): Initialization
of annotator class "org.apache.uima.ae.multiplier.SimpleCasGenerator" failed.  (Descriptor:
<https://builds.apache.org/job/UIMA-AS/org.apache.uima$uimaj-as-activemq/ws/src/test/resources/descriptors/analysis_engine/../multiplier/SimpleCasGeneratorProducing1000Cases.xml)>
  testCMAggregateClientStopRequest(org.apache.uima.ee.test.TestUimaASExtended): Initialization
of annotator class "org.apache.uima.ae.multiplier.SimpleCasGenerator" failed.  (Descriptor:
<https://builds.apache.org/job/UIMA-AS/org.apache.uima$uimaj-as-activemq/ws/src/test/resources/descriptors/analysis_engine/../multiplier/SimpleCasGeneratorWith1MillionDocs.xml)>
  testCMAggregateClientStopRequest2(org.apache.uima.ee.test.TestUimaASExtended): Initialization
of annotator class "org.apache.uima.ae.multiplier.SimpleCasGenerator" failed.  (Descriptor:
<https://builds.apache.org/job/UIMA-AS/org.apache.uima$uimaj-as-activemq/ws/src/test/resources/descriptors/multiplier/SimpleCasGeneratorWith1MillionDocs.xml)>
  testAggregateCMWithFailedRemoteDelegate(org.apache.uima.ee.test.TestUimaASExtended): Initialization
of annotator class "org.apache.uima.ae.multiplier.SimpleCasGenerator" failed.  (Descriptor:
<https://builds.apache.org/job/UIMA-AS/org.apache.uima$uimaj-as-activemq/ws/src/test/resources/descriptors/analysis_engine/../multiplier/SimpleCasGeneratorProducing1000Cases.xml)>
  testAggregateCMWithFailedCollocatedDelegate(org.apache.uima.ee.test.TestUimaASExtended):
Initialization of annotator class "org.apache.uima.ae.multiplier.SimpleCasGenerator" failed.
 (Descriptor: <https://builds.apache.org/job/UIMA-AS/org.apache.uima$uimaj-as-activemq/ws/src/test/resources/descriptors/analysis_engine/../multiplier/SimpleCasGeneratorProducing1000Cases.xml)>
  testComplexAggregateCMWithFailedCollocatedDelegate(org.apache.uima.ee.test.TestUimaASExtended):
Initialization of annotator class "org.apache.uima.ae.multiplier.SimpleCasGenerator" failed.
 (Descriptor: <https://builds.apache.org/job/UIMA-AS/org.apache.uima$uimaj-as-activemq/ws/src/test/resources/descriptors/analysis_engine/../multiplier/SimpleCasGeneratorProducing1000Cases.xml)>
  testAggregateCMWithRemoteCMAndFailedRemoteDelegate(org.apache.uima.ee.test.TestUimaASExtended):
Initialization of annotator class "org.apache.uima.ae.multiplier.SimpleCasGenerator" failed.
 (Descriptor: <https://builds.apache.org/job/UIMA-AS/org.apache.uima$uimaj-as-activemq/ws/src/test/resources/descriptors/multiplier/SimpleCasGeneratorWith1MillionDocs.xml)>
  testDelayedBrokerWithAggregateService(org.apache.uima.ee.test.TestUimaASExtended): Initialization
of annotator class "org.apache.uima.ae.multiplier.SimpleCasGenerator" failed.  (Descriptor:
<https://builds.apache.org/job/UIMA-AS/org.apache.uima$uimaj-as-activemq/ws/src/test/resources/descriptors/analysis_engine/../multiplier/SimpleCasGenerator.xml)>
  testDeployAggregateServiceWithTempReplyQueue(org.apache.uima.ee.test.TestUimaASExtended):
Initialization of annotator class "org.apache.uima.ae.multiplier.SimpleCasGenerator" failed.
 (Descriptor: <https://builds.apache.org/job/UIMA-AS/org.apache.uima$uimaj-as-activemq/ws/src/test/resources/descriptors/analysis_engine/../multiplier/SimpleCasGenerator.xml)>
  testProcessAggregateServiceWith1000Docs(org.apache.uima.ee.test.TestUimaASExtended): Initialization
of annotator class "org.apache.uima.ae.multiplier.SimpleCasGenerator" failed.  (Descriptor:
<https://builds.apache.org/job/UIMA-AS/org.apache.uima$uimaj-as-activemq/ws/src/test/resources/descriptors/analysis_engine/../multiplier/SimpleCasGeneratorProducing1000Cases.xml)>
  testProcessAggregateWithInnerAggregateCM(org.apache.uima.ee.test.TestUimaASExtended): Initialization
of annotator class "org.apache.uima.ae.multiplier.SimpleCasGenerator" failed.  (Descriptor:
<https://builds.apache.org/job/UIMA-AS/org.apache.uima$uimaj-as-activemq/ws/src/test/resources/descriptors/analysis_engine/../multiplier/SimpleCasGenerator.xml)>
  testAggregateWithInnerSynchAggregateCM(org.apache.uima.ee.test.TestUimaASExtended): Initialization
of annotator class "org.apache.uima.ae.multiplier.SimpleCasGenerator" failed.  (Descriptor:
<https://builds.apache.org/job/UIMA-AS/org.apache.uima$uimaj-as-activemq/ws/src/test/resources/descriptors/multiplier/SimpleCasGenerator.xml)>
  testTerminateOnFlowControllerExceptionOnDisable(org.apache.uima.ee.test.TestUimaASExtended):
Initialization of annotator class "org.apache.uima.ae.multiplier.SimpleCasGenerator" failed.
 (Descriptor: <https://builds.apache.org/job/UIMA-AS/org.apache.uima$uimaj-as-activemq/ws/src/test/resources/descriptors/analysis_engine/../multiplier/SimpleCasGeneratorProducing10Cases.xml)>
  testJmsServiceAdapterWithPlaceholder(org.apache.uima.ee.test.TestUimaASExtended): Initialization
of annotator class "org.apache.uima.ae.multiplier.SimpleCasGenerator" failed.  (Descriptor:
<https://builds.apache.org/job/UIMA-AS/org.apache.uima$uimaj-as-activemq/ws/src/test/resources/descriptors/multiplier/SimpleCasGeneratorProducing10Cases.xml)>
  testJmsServiceAdapterWithOverride(org.apache.uima.ee.test.TestUimaASExtended): Initialization
of annotator class "org.apache.uima.ae.multiplier.SimpleCasGenerator" failed.  (Descriptor:
<https://builds.apache.org/job/UIMA-AS/org.apache.uima$uimaj-as-activemq/ws/src/test/resources/descriptors/multiplier/SimpleCasGeneratorProducing10Cases.xml)>
  testJmsServiceAdapterWithException(org.apache.uima.ee.test.TestUimaASExtended): Initialization
of annotator class "org.apache.uima.ae.multiplier.SimpleCasGenerator" failed.  (Descriptor:
<https://builds.apache.org/job/UIMA-AS/org.apache.uima$uimaj-as-activemq/ws/src/test/resources/descriptors/multiplier/SimpleCasGeneratorProducing10Cases.xml)>
  testJmsServiceAdapterWithProcessTimeout(org.apache.uima.ee.test.TestUimaASExtended): Initialization
of annotator class "org.apache.uima.ae.multiplier.SimpleCasGenerator" failed.  (Descriptor:
<https://builds.apache.org/job/UIMA-AS/org.apache.uima$uimaj-as-activemq/ws/src/test/resources/descriptors/multiplier/SimpleCasGeneratorProducing10Cases.xml)>
  testCompressedTypeFiltering(org.apache.uima.ee.test.TestUimaASExtended): The class org.apache.uima.ee.test.flow.AdvancedFixedFlowController
could not be found. (Descriptor: <https://builds.apache.org/job/UIMA-AS/org.apache.uima$uimaj-as-activemq/ws/src/test/resources/descriptors/tutorial/ex4/../../flow/AdvancedFixedFlowController.xml)>
  testForHang(org.apache.uima.ee.test.TestUimaASExtended): Initialization of annotator class
"org.apache.uima.ae.multiplier.SimpleCasGenerator" failed.  (Descriptor: <https://builds.apache.org/job/UIMA-AS/org.apache.uima$uimaj-as-activemq/ws/src/test/resources/descriptors/analysis_engine/../multiplier/SimpleCasGenerator.xml)>
  testGenerateAndDeployPrimitiveDD(org.apache.uima.ee.test.TestUimaASExtended): org/apache/uima/resourceSpecifier/factory/impl/ServiceContextImpl
  testDeployAggregateServiceWithFailingCollocatedCM(org.apache.uima.ee.test.TestUimaASExtended):
Initialization of annotator class "org.apache.uima.ae.multiplier.SimpleCasGenerator" failed.
 (Descriptor: <https://builds.apache.org/job/UIMA-AS/org.apache.uima$uimaj-as-activemq/ws/src/test/resources/descriptors/analysis_engine/../multiplier/SimpleCasGeneratorWithFailureOnNthDocument.xml)>
  testPrimitiveServiceProcessPingFailure(org.apache.uima.ee.test.TestUimaASExtended): org/apache/uima/ee/test/TestUimaASExtended$6
  testDelegateTimeoutAndDisable(org.apache.uima.ee.test.TestUimaASExtended): The class org.apache.uima.ee.test.flow.AdvancedFixedFlowController
could not be found. (Descriptor: <https://builds.apache.org/job/UIMA-AS/org.apache.uima$uimaj-as-activemq/ws/src/test/resources/descriptors/tutorial/ex4/../../flow/AdvancedFixedFlowController.xml)>
  testDisableDelegateOnTimeoutWithCM(org.apache.uima.ee.test.TestUimaASExtended): Initialization
of annotator class "org.apache.uima.ae.multiplier.SimpleCasGenerator" failed.  (Descriptor:
<https://builds.apache.org/job/UIMA-AS/org.apache.uima$uimaj-as-activemq/ws/src/test/resources/descriptors/tutorial/ex4/../../multiplier/SimpleCasGeneratorProducing1000Cases.xml)>
  testSynchCallProcessWithMultipleThreads(org.apache.uima.ee.test.TestUimaASExtended): org/apache/uima/ee/test/utils/BaseTestSupport$SynchRunner
  testAggregateProcessCallWithLastCM(org.apache.uima.ee.test.TestUimaASExtended): Initialization
of annotator class "org.apache.uima.ae.multiplier.SimpleCasGenerator" failed.  (Descriptor:
<https://builds.apache.org/job/UIMA-AS/org.apache.uima$uimaj-as-activemq/ws/src/test/resources/descriptors/analysis_engine/../multiplier/SimpleCasGeneratorProducing10Cases.xml)>
  testTimeoutInSynchCallProcessWithMultipleThreads(org.apache.uima.ee.test.TestUimaASExtended):
org/apache/uima/ee/test/utils/BaseTestSupport$SynchRunner
  testTimeoutFailureInSynchCallProcessWithMultipleThreads(org.apache.uima.ee.test.TestUimaASExtended):
org/apache/uima/ee/test/utils/BaseTestSupport$2
  testProcessWithParallelFlow(org.apache.uima.ee.test.TestUimaASExtended): Initialization
of annotator class "org.apache.uima.ae.multiplier.SimpleCasGenerator" failed.  (Descriptor:
<https://builds.apache.org/job/UIMA-AS/org.apache.uima$uimaj-as-activemq/ws/src/test/resources/descriptors/analysis_engine/../multiplier/SimpleCasGeneratorProducing10Cases.xml)>
  testDisableDelegateInParallelFlow(org.apache.uima.ee.test.TestUimaASExtended): Initialization
of annotator class "org.apache.uima.ae.multiplier.SimpleCasGenerator" failed.  (Descriptor:
<https://builds.apache.org/job/UIMA-AS/org.apache.uima$uimaj-as-activemq/ws/src/test/resources/descriptors/analysis_engine/../multiplier/SimpleCasGeneratorProducing10Cases.xml)>
  testMutlipleDelegateTimeoutsInParallelFlows(org.apache.uima.ee.test.TestUimaASExtended):
Initialization of annotator class "org.apache.uima.ae.multiplier.SimpleCasGenerator" failed.
 (Descriptor: <https://builds.apache.org/job/UIMA-AS/org.apache.uima$uimaj-as-activemq/ws/src/test/resources/descriptors/analysis_engine/../multiplier/SimpleCasGeneratorProducing10Cases.xml)>
  testTimeoutDelegateInParallelFlows(org.apache.uima.ee.test.TestUimaASExtended): Initialization
of annotator class "org.apache.uima.ae.multiplier.SimpleCasGenerator" failed.  (Descriptor:
<https://builds.apache.org/job/UIMA-AS/org.apache.uima$uimaj-as-activemq/ws/src/test/resources/descriptors/analysis_engine/../multiplier/SimpleCasGeneratorProducing10Cases.xml)>
  testRemoteDelegateTimeout(org.apache.uima.ee.test.TestUimaASExtended): Initialization of
annotator class "org.apache.uima.ae.multiplier.SimpleCasGenerator" failed.  (Descriptor: <https://builds.apache.org/job/UIMA-AS/org.apache.uima$uimaj-as-activemq/ws/src/test/resources/descriptors/analysis_engine/../multiplier/SimpleCasGenerator.xml)>
  testDisableOnRemoteDelegatePingTimeout(org.apache.uima.ee.test.TestUimaASExtended): Initialization
of annotator class "org.apache.uima.ae.multiplier.SimpleCasGenerator" failed.  (Descriptor:
<https://builds.apache.org/job/UIMA-AS/org.apache.uima$uimaj-as-activemq/ws/src/test/resources/descriptors/analysis_engine/../multiplier/SimpleCasGenerator.xml)>
  testDeployAggregateWithCollocatedAggregateService(org.apache.uima.ee.test.TestUimaASExtended):
Initialization of annotator class "org.apache.uima.ae.multiplier.SimpleCasGenerator" failed.
 (Descriptor: <https://builds.apache.org/job/UIMA-AS/org.apache.uima$uimaj-as-activemq/ws/src/test/resources/descriptors/multiplier/SimpleCasGenerator.xml)>
  testProcessWithAggregateUsingCollocatedMultiplier(org.apache.uima.ee.test.TestUimaASExtended):
Initialization of annotator class "org.apache.uima.ae.multiplier.SimpleCasGenerator" failed.
 (Descriptor: <https://builds.apache.org/job/UIMA-AS/org.apache.uima$uimaj-as-activemq/ws/src/test/resources/descriptors/analysis_engine/../multiplier/SimpleCasGenerator.xml)>
  testExistanceOfParentCasReferenceIdOnChildFailure(org.apache.uima.ee.test.TestUimaASExtended):
Initialization of annotator class "org.apache.uima.ae.multiplier.SimpleCasGenerator" failed.
 (Descriptor: <https://builds.apache.org/job/UIMA-AS/org.apache.uima$uimaj-as-activemq/ws/src/test/resources/descriptors/analysis_engine/../multiplier/SimpleCasGenerator.xml)>
  testProcessWithAggregateUsingRemoteMultiplier(org.apache.uima.ee.test.TestUimaASExtended):
Initialization of annotator class "org.apache.uima.ae.multiplier.SimpleCasGenerator" failed.
 (Descriptor: <https://builds.apache.org/job/UIMA-AS/org.apache.uima$uimaj-as-activemq/ws/src/test/resources/descriptors/multiplier/SimpleCasGeneratorProducing1000Cases.xml)>
  testParentProcessLast(org.apache.uima.ee.test.TestUimaASExtended): Initialization of annotator
class "org.apache.uima.ae.multiplier.SimpleCasGenerator" failed.  (Descriptor: <https://builds.apache.org/job/UIMA-AS/org.apache.uima$uimaj-as-activemq/ws/src/test/resources/descriptors/multiplier/SimpleCasGeneratorProducing10Cases.xml)>
  testProcessWithAggregateUsingRemoteMultiplierOnSeparateBroker(org.apache.uima.ee.test.TestUimaASExtended):
Initialization of annotator class "org.apache.uima.ae.multiplier.SimpleCasGenerator" failed.
 (Descriptor: <https://builds.apache.org/job/UIMA-AS/org.apache.uima$uimaj-as-activemq/ws/src/test/resources/descriptors/multiplier/SimpleCasGeneratorProducing1000Cases.xml)>
  testProcessWithAggregateUsingCollocatedMerger(org.apache.uima.ee.test.TestUimaASExtended):
Annotator class "org.apache.uima.ae.multiplier.SimpleCasMerger" was not found. (Descriptor:
<https://builds.apache.org/job/UIMA-AS/org.apache.uima$uimaj-as-activemq/ws/src/test/resources/descriptors/analysis_engine/../multiplier/SimpleCasMerger.xml)>
  testProcessWithAggregateUsingRemoteMerger(org.apache.uima.ee.test.TestUimaASExtended): Annotator
class "org.apache.uima.ae.multiplier.SimpleCasMerger" was not found. (Descriptor: <https://builds.apache.org/job/UIMA-AS/org.apache.uima$uimaj-as-activemq/ws/src/test/resources/descriptors/multiplier/SimpleCasMerger.xml)>
  testClientWithAggregateMultiplier(org.apache.uima.ee.test.TestUimaASExtended): Initialization
of annotator class "org.apache.uima.ae.multiplier.SimpleCasGenerator" failed.  (Descriptor:
<https://builds.apache.org/job/UIMA-AS/org.apache.uima$uimaj-as-activemq/ws/src/test/resources/descriptors/multiplier/SimpleCasGeneratorProducing1000Cases.xml)>
  testClientProcessWithRemoteMultiplier(org.apache.uima.ee.test.TestUimaASExtended): Initialization
of annotator class "org.apache.uima.ae.multiplier.SimpleCasGenerator" failed.  (Descriptor:
<https://builds.apache.org/job/UIMA-AS/org.apache.uima$uimaj-as-activemq/ws/src/test/resources/descriptors/multiplier/SimpleCasGeneratorProducing1000Cases.xml)>
  testClientProcessWithComplexAggregateRemoteMultiplier(org.apache.uima.ee.test.TestUimaASExtended):
Initialization of annotator class "org.apache.uima.ae.multiplier.SimpleCasGenerator" failed.
 (Descriptor: <https://builds.apache.org/job/UIMA-AS/org.apache.uima$uimaj-as-activemq/ws/src/test/resources/descriptors/multiplier/SimpleCasGeneratorProducing10Cases.xml)>
  testProcessWithAggregateUsing2RemoteMultipliers(org.apache.uima.ee.test.TestUimaASExtended):
Initialization of annotator class "org.apache.uima.ae.multiplier.SimpleCasGenerator" failed.
 (Descriptor: <https://builds.apache.org/job/UIMA-AS/org.apache.uima$uimaj-as-activemq/ws/src/test/resources/descriptors/multiplier/SimpleCasGeneratorProducing10Cases.xml)>
  testProcessWithAggregateUsing2CollocatedMultipliers(org.apache.uima.ee.test.TestUimaASExtended):
Initialization of annotator class "org.apache.uima.ae.multiplier.SimpleCasGenerator" failed.
 (Descriptor: <https://builds.apache.org/job/UIMA-AS/org.apache.uima$uimaj-as-activemq/ws/src/test/resources/descriptors/analysis_engine/../multiplier/SimpleCasGenerator.xml)>
  testProcessAggregateWithInnerCMAggregate(org.apache.uima.ee.test.TestUimaASExtended): Initialization
of annotator class "org.apache.uima.ae.multiplier.SimpleCasGenerator" failed.  (Descriptor:
<https://builds.apache.org/job/UIMA-AS/org.apache.uima$uimaj-as-activemq/ws/src/test/resources/descriptors/analysis_engine/../multiplier/SimpleCasGenerator.xml)>
  testComplexDeployment(org.apache.uima.ee.test.TestUimaASExtended): Initialization of annotator
class "org.apache.uima.ae.multiplier.SimpleCasGenerator" failed.  (Descriptor: <https://builds.apache.org/job/UIMA-AS/org.apache.uima$uimaj-as-activemq/ws/src/test/resources/descriptors/analysis_engine/../multiplier/SimpleCasGenerator.xml)>
  testTypesystemMergeWithMultiplier(org.apache.uima.ee.test.TestUimaASExtended): Annotator
class "org.apache.uima.ae.noop.SimpleAnnotator" was not found. (Descriptor: <https://builds.apache.org/job/UIMA-AS/org.apache.uima$uimaj-as-activemq/ws/src/test/resources/descriptors/analysis_engine/SimpleAnnotator.xml)>
  testStopAggregateWithRemoteMultiplier(org.apache.uima.ee.test.TestUimaASExtended): Initialization
of annotator class "org.apache.uima.ae.multiplier.SimpleCasGenerator" failed.  (Descriptor:
<https://builds.apache.org/job/UIMA-AS/org.apache.uima$uimaj-as-activemq/ws/src/test/resources/descriptors/multiplier/SimpleCasGeneratorProducing1000Cases.xml)>
  testCancelProcessAggregateWithCollocatedMultiplier(org.apache.uima.ee.test.TestUimaASExtended):
Initialization of annotator class "org.apache.uima.ae.multiplier.SimpleCasGenerator" failed.
 (Descriptor: <https://builds.apache.org/job/UIMA-AS/org.apache.uima$uimaj-as-activemq/ws/src/test/resources/descriptors/analysis_engine/../multiplier/SimpleCasGeneratorWith1MillionDocs.xml)>
  testCancelProcessAggregateWithRemoteMultiplier(org.apache.uima.ee.test.TestUimaASExtended):
Initialization of annotator class "org.apache.uima.ae.multiplier.SimpleCasGenerator" failed.
 (Descriptor: <https://builds.apache.org/job/UIMA-AS/org.apache.uima$uimaj-as-activemq/ws/src/test/resources/descriptors/multiplier/SimpleCasGeneratorWith1MillionDocs.xml)>
  testProcessParallelFlowWithDelegateFailure(org.apache.uima.ee.test.TestUimaASExtended):
Initialization of annotator class "org.apache.uima.ae.multiplier.SimpleCasGenerator" failed.
 (Descriptor: <https://builds.apache.org/job/UIMA-AS/org.apache.uima$uimaj-as-activemq/ws/src/test/resources/descriptors/analysis_engine/../multiplier/SimpleCasGeneratorProducing10Cases.xml)>
  testErrorThresholdWindow(org.apache.uima.ee.test.TestUimaASExtended): Initialization of
annotator class "org.apache.uima.ae.multiplier.SimpleCasGenerator" failed.  (Descriptor: <https://builds.apache.org/job/UIMA-AS/org.apache.uima$uimaj-as-activemq/ws/src/test/resources/descriptors/analysis_engine/../multiplier/SimpleCasGenerator.xml)>
  testProcessParallelFlowWithDelegateDisable(org.apache.uima.ee.test.TestUimaASExtended):
Annotator class "org.apache.uima.ae.noop.SimpleAnnotator" was not found. (Descriptor: <https://builds.apache.org/job/UIMA-AS/org.apache.uima$uimaj-as-activemq/ws/src/test/resources/descriptors/analysis_engine/SimpleAnnotator.xml)>
  testPrimitiveShutdownOnTooManyErrors(org.apache.uima.ee.test.TestUimaASExtended): Initialization
of annotator class "org.apache.uima.ae.multiplier.SimpleCasGenerator" failed.  (Descriptor:
<https://builds.apache.org/job/UIMA-AS/org.apache.uima$uimaj-as-activemq/ws/src/test/resources/descriptors/analysis_engine/../multiplier/SimpleCasGenerator.xml)>
  testAsynchronousTerminate(org.apache.uima.ee.test.TestUimaASExtended): Initialization of
annotator class "org.apache.uima.ae.multiplier.SimpleCasGenerator" failed.  (Descriptor: <https://builds.apache.org/job/UIMA-AS/org.apache.uima$uimaj-as-activemq/ws/src/test/resources/descriptors/analysis_engine/../multiplier/SimpleCasGeneratorProducing10Cases.xml)>
  testContinueOnRetryFailure(org.apache.uima.ee.test.TestUimaASExtended): Annotator class
"org.apache.uima.ae.noop.WriterAnnotator" was not found. (Descriptor: <https://builds.apache.org/job/UIMA-AS/org.apache.uima$uimaj-as-activemq/ws/src/test/resources/descriptors/analysis_engine/WriterAnnotatorA.xml)>
  testDeployAgainAndAgain(org.apache.uima.ee.test.TestUimaASExtended): Initialization of annotator
class "org.apache.uima.ae.multiplier.SimpleCasGenerator" failed.  (Descriptor: <https://builds.apache.org/job/UIMA-AS/org.apache.uima$uimaj-as-activemq/ws/src/test/resources/descriptors/analysis_engine/../multiplier/SimpleCasGeneratorProducing10Cases.xml)>
  testMultipleASClients(org.apache.uima.ee.test.TestUimaASExtended): org/apache/uima/ee/test/TestUimaASExtended$2RunnableClient

Tests run: 122, Failures: 2, Errors: 68, Skipped: 0

 INFO | Apache ActiveMQ 5.14.0 (localhost, ID:pietas.apache.org-59989-1473447654835-0:112)
is shutting down
Sep 09, 2016 7:13:16 PM org.apache.uima.adapter.jms.client.BaseUIMAAsynchronousEngineCommon_impl
stop
INFO: Stopping Asynchronous Client.
Sep 09, 2016 7:13:16 PM org.apache.uima.adapter.jms.client.BaseUIMAAsynchronousEngineCommon_impl
stop
INFO: Stopping Asynchronous Client.
 INFO | Connector DefaultBrokerURL2 stopped
Sep 09, 2016 7:13:16 PM org.apache.uima.adapter.jms.client.BaseUIMAAsynchronousEngineCommon_impl
stop
INFO: Stopping Asynchronous Client.
Sep 09, 2016 7:13:16 PM org.apache.uima.adapter.jms.client.BaseUIMAAsynchronousEngineCommon_impl
stop
INFO: Stopping Asynchronous Client.
 INFO | Apache ActiveMQ 5.14.0 (localhost, ID:pietas.apache.org-59989-1473447654835-0:112)
uptime 47.244 seconds
 INFO | Apache ActiveMQ 5.14.0 (localhost, ID:pietas.apache.org-59989-1473447654835-0:112)
is shutdown
org.apache.activemq.ConnectionFailedException: The JMS connection has failed: java.io.EOFException
	at org.apache.activemq.ActiveMQConnection.checkClosedOrFailed(ActiveMQConnection.java:1448)
	at org.apache.activemq.ActiveMQConnection.deleteTempDestination(ActiveMQConnection.java:2057)
	at org.apache.uima.adapter.jms.client.BaseUIMAAsynchronousEngine_impl.stopConnection(BaseUIMAAsynchronousEngine_impl.java:261)
	at org.apache.uima.adapter.jms.client.BaseUIMAAsynchronousEngine_impl.stop(BaseUIMAAsynchronousEngine_impl.java:292)
	at org.apache.uima.adapter.jms.client.BaseUIMAAsynchronousEngineCommon_impl$UimaASShutdownHook.run(BaseUIMAAsynchronousEngineCommon_impl.java:3251)
	at java.lang.Thread.run(Thread.java:745)
Caused by: java.io.EOFException
	at java.io.DataInputStream.readInt(DataInputStream.java:392)
	at org.apache.activemq.openwire.OpenWireFormat.unmarshal(OpenWireFormat.java:268)
	at org.apache.activemq.transport.tcp.TcpTransport.readCommand(TcpTransport.java:240)
	at org.apache.activemq.transport.tcp.TcpTransport.doRun(TcpTransport.java:232)
	at org.apache.activemq.transport.tcp.TcpTransport.run(TcpTransport.java:215)
	... 1 more
org.apache.activemq.ConnectionFailedException: The JMS connection has failed: java.io.EOFException
	at org.apache.activemq.ActiveMQConnection.checkClosedOrFailed(ActiveMQConnection.java:1448)
	at org.apache.activemq.ActiveMQConnection.deleteTempDestination(ActiveMQConnection.java:2057)
	at org.apache.uima.adapter.jms.client.BaseUIMAAsynchronousEngine_impl.stopConnection(BaseUIMAAsynchronousEngine_impl.java:261)
	at org.apache.uima.adapter.jms.client.BaseUIMAAsynchronousEngine_impl.stop(BaseUIMAAsynchronousEngine_impl.java:292)
	at org.apache.uima.adapter.jms.client.BaseUIMAAsynchronousEngineCommon_impl$UimaASShutdownHook.run(BaseUIMAAsynchronousEngineCommon_impl.java:3251)
	at java.lang.Thread.run(Thread.java:745)
Caused by: java.io.EOFException
	at java.io.DataInputStream.readInt(DataInputStream.java:392)
	at org.apache.activemq.openwire.OpenWireFormat.unmarshal(OpenWireFormat.java:268)
	at org.apache.activemq.transport.tcp.TcpTransport.readCommand(TcpTransport.java:240)
	at org.apache.activemq.transport.tcp.TcpTransport.doRun(TcpTransport.java:232)
	at org.apache.activemq.transport.tcp.TcpTransport.run(TcpTransport.java:215)
	... 1 more
org.apache.activemq.ConnectionFailedException: The JMS connection has failed: java.io.EOFException
	at org.apache.activemq.ActiveMQConnection.checkClosedOrFailed(ActiveMQConnection.java:1448)
	at org.apache.activemq.ActiveMQConnection.deleteTempDestination(ActiveMQConnection.java:2057)
	at org.apache.uima.adapter.jms.client.BaseUIMAAsynchronousEngine_impl.stopConnection(BaseUIMAAsynchronousEngine_impl.java:261)
	at org.apache.uima.adapter.jms.client.BaseUIMAAsynchronousEngine_impl.stop(BaseUIMAAsynchronousEngine_impl.java:292)
	at org.apache.uima.adapter.jms.client.BaseUIMAAsynchronousEngineCommon_impl$UimaASShutdownHook.run(BaseUIMAAsynchronousEngineCommon_impl.java:3251)
	at java.lang.Thread.run(Thread.java:745)
Caused by: java.io.EOFException
	at java.io.DataInputStream.readInt(DataInputStream.java:392)
	at org.apache.activemq.openwire.OpenWireFormat.unmarshal(OpenWireFormat.java:268)
	at org.apache.activemq.transport.tcp.TcpTransport.readCommand(TcpTransport.java:240)
	at org.apache.activemq.transport.tcp.TcpTransport.doRun(TcpTransport.java:232)
	at org.apache.activemq.transport.tcp.TcpTransport.run(TcpTransport.java:215)
	... 1 more
[JENKINS] Recording test results
[INFO] 
[INFO] --- maven-failsafe-plugin:2.7.2:verify (verify) @ uimaj-as-activemq ---
[INFO] No tests to run.
[JENKINS] Recording test results[INFO] 
[INFO] --- maven-install-plugin:2.5.1:install (default-install) @ uimaj-as-activemq ---

[INFO] ------------------------------------------------------------------------
[INFO] BUILD FAILURE
[INFO] ------------------------------------------------------------------------
[INFO] Total time: 13:18 min
[INFO] Finished at: 2016-09-09T19:13:20+00:00
[INFO] Final Memory: 75M/878M
[INFO] ------------------------------------------------------------------------
Waiting for Jenkins to finish collecting data[ERROR] Failed to execute goal org.apache.maven.plugins:maven-install-plugin:2.5.1:install
(default-install) on project uimaj-as-activemq: The packaging for this project did not assign
a file to the build artifact -> [Help 1]
[ERROR] 
[ERROR] To see the full stack trace of the errors, re-run Maven with the -e switch.
[ERROR] Re-run Maven using the -X switch to enable full debug logging.
[ERROR] 
[ERROR] For more information about the errors and possible solutions, please read the following
articles:
[ERROR] [Help 1] http://cwiki.apache.org/confluence/display/MAVEN/MojoExecutionException

s-activemq: The packaging for this project did not assign a file to the build artifact ->
[Help 1]
[ERROR] 
[ERROR] To see the full stack trace of the errors, re-run Maven with the -e switch.
[ERROR] Re-run Maven using the -X switch to enable full debug logging.
[ERROR] 
[ERROR] For more information about the errors and possible solutions, please read the following
articles:
[ERROR] [Help 1] http://cwiki.apache.org/confluence/display/MAVEN/MojoExecutionException

[JENKINS] Archiving <https://builds.apache.org/job/UIMA-AS/org.apache.uima$uimaj-as-activemq/ws/pom.xml>
to org.apache.uima/uimaj-as-activemq/2.9.0-SNAPSHOT/uimaj-as-activemq-2.9.0-SNAPSHOT.pom

Mime
View raw message