uima-dev mailing list archives

Site index · List index
Message view « Date » · « Thread »
Top « Date » · « Thread »
From Apache Jenkins Server <jenk...@builds.apache.org>
Subject Build failed in Jenkins: UIMA-DUCC #988
Date Fri, 16 Sep 2016 22:00:57 GMT
See <https://builds.apache.org/job/UIMA-DUCC/988/changes>

Changes:

[degenaro] UIMA-5110 DUCC Job Driver (JD) employ enums for EventType and StateType

[degenaro] UIMA-5110 DUCC Job Driver (JD) employ enums for EventType and StateType

[cwiklik] UIMA-5047 updated CPU monitoring and reporting

------------------------------------------
[...truncated 7462 lines...]
 INFO |  driverId:999 host: node4 size: 24
 INFO |  driverId:999 host: node4 size: 23
 INFO |  driverId:999 host: node3 size: 14
 INFO |  driverId:999 host: node3 size: 13
 INFO |  driverId:999 host: node4 size: 22
 INFO |  driverId:999 host: node4 size: 21
 INFO |  driverId:999 host: node4 size: 20
 INFO |  driverId:999 host: node4 size: 19
 INFO |  driverId:999 host: node3 size: 12
 INFO |  driverId:999 host: node4 size: 18
 INFO |  driverId:999 host: node4 size: 17
 INFO |  driverId:999 host: node4 size: 16
 INFO |  driverId:999 host: node4 size: 15
 INFO |  map is empty
 INFO |  map is empty
 INFO |  saving to:<https://builds.apache.org/job/UIMA-DUCC/ws/trunk/uima-ducc-orchestrator/target/test-classes/ducc_runtime/resources/state//orchestrator.ckpt>
 INFO |  saved:<https://builds.apache.org/job/UIMA-DUCC/ws/trunk/uima-ducc-orchestrator/target/test-classes/ducc_runtime/resources/state//orchestrator.ckpt>
 INFO |  map is empty
 INFO |  map is empty
 INFO |  driverId:999 host: node3 size: 11
 INFO |  driverId:999 host: node4 size: 14
 INFO |  driverId:999 host: node3 size: 10
 INFO |  driverId:999 host: node4 size: 13
 INFO |  driverId:999 host: node3 size: 9
 INFO |  driverId:999 host: node4 size: 12
 INFO |  driverId:999 host: node4 size: 11
 INFO |  map is empty
 INFO |  map is empty
 INFO |  saving to:<https://builds.apache.org/job/UIMA-DUCC/ws/trunk/uima-ducc-orchestrator/target/test-classes/ducc_runtime/resources/state//orchestrator.ckpt>
 INFO |  saved:<https://builds.apache.org/job/UIMA-DUCC/ws/trunk/uima-ducc-orchestrator/target/test-classes/ducc_runtime/resources/state//orchestrator.ckpt>
 INFO |  driverId:999 host: node4 size: 10
 INFO |  driverId:999 host: node4 size: 9
 INFO |  driverId:999 host: node3 size: 8
 INFO |  driverId:999 host: node4 size: 8
 INFO |  driverId:999 host: node3 size: 7
 INFO |  driverId:999 host: node3 size: 6
 INFO |  map is empty
 INFO |  map is empty
 INFO |  saving to:<https://builds.apache.org/job/UIMA-DUCC/ws/trunk/uima-ducc-orchestrator/target/test-classes/ducc_runtime/resources/state//orchestrator.ckpt>
 INFO |  saved:<https://builds.apache.org/job/UIMA-DUCC/ws/trunk/uima-ducc-orchestrator/target/test-classes/ducc_runtime/resources/state//orchestrator.ckpt>
 INFO |  driverId:999 host: node4 size: 7
 INFO |  driverId:999 host: node3 size: 5
 INFO |  driverId:999 host: node3 size: 4
 INFO |  map is empty
 INFO |  map is empty
 INFO |  saving to:<https://builds.apache.org/job/UIMA-DUCC/ws/trunk/uima-ducc-orchestrator/target/test-classes/ducc_runtime/resources/state//orchestrator.ckpt>
 INFO |  saved:<https://builds.apache.org/job/UIMA-DUCC/ws/trunk/uima-ducc-orchestrator/target/test-classes/ducc_runtime/resources/state//orchestrator.ckpt>
 INFO |  map is empty
 INFO |  map is empty
 INFO |  driverId:999 host: node4 size: 6
 INFO |  driverId:999 host: node4 size: 5
 INFO |  driverId:999 host: node4 size: 4
 INFO |  map is empty
 INFO |  map is empty
 INFO |  saving to:<https://builds.apache.org/job/UIMA-DUCC/ws/trunk/uima-ducc-orchestrator/target/test-classes/ducc_runtime/resources/state//orchestrator.ckpt>
 INFO |  saved:<https://builds.apache.org/job/UIMA-DUCC/ws/trunk/uima-ducc-orchestrator/target/test-classes/ducc_runtime/resources/state//orchestrator.ckpt>
 INFO |  driverId:999 host: node4 size: 3
 INFO |  map is empty
 INFO |  map is empty
 INFO |  saving to:<https://builds.apache.org/job/UIMA-DUCC/ws/trunk/uima-ducc-orchestrator/target/test-classes/ducc_runtime/resources/state//orchestrator.ckpt>
 INFO |  saved:<https://builds.apache.org/job/UIMA-DUCC/ws/trunk/uima-ducc-orchestrator/target/test-classes/ducc_runtime/resources/state//orchestrator.ckpt>
 INFO |  driverId:999 host: node4 size: 2
 INFO |  driverId:999 host: node3 size: 3
 INFO |  driverId:999 host: node3 size: 2
 INFO |  driverId:999 host: node4 size: 1
 INFO |  map is empty
 INFO |  map is empty
 INFO |  saving to:<https://builds.apache.org/job/UIMA-DUCC/ws/trunk/uima-ducc-orchestrator/target/test-classes/ducc_runtime/resources/state//orchestrator.ckpt>
 INFO |  saved:<https://builds.apache.org/job/UIMA-DUCC/ws/trunk/uima-ducc-orchestrator/target/test-classes/ducc_runtime/resources/state//orchestrator.ckpt>
 INFO |  driverId:999 host: node4 size: 0
 INFO |  driverId:999 host: node3 size: 1
 INFO |  map is empty
 INFO |  map is empty
 INFO |  current[Completed] previous[Assigned]
 INFO |  current[Completed] previous[Assigned]
 INFO |  saving to:<https://builds.apache.org/job/UIMA-DUCC/ws/trunk/uima-ducc-orchestrator/target/test-classes/ducc_runtime/resources/state//orchestrator.ckpt>
 INFO |  saved:<https://builds.apache.org/job/UIMA-DUCC/ws/trunk/uima-ducc-orchestrator/target/test-classes/ducc_runtime/resources/state//orchestrator.ckpt>
 INFO |  saving to:<https://builds.apache.org/job/UIMA-DUCC/ws/trunk/uima-ducc-orchestrator/target/test-classes/ducc_runtime/resources/state//orchestrator.ckpt>
 INFO |  saved:<https://builds.apache.org/job/UIMA-DUCC/ws/trunk/uima-ducc-orchestrator/target/test-classes/ducc_runtime/resources/state//orchestrator.ckpt>
 INFO |  driverId:999 host: node3 size: 0
 INFO |  map is empty
 INFO |  map is empty
 INFO |  saving to:<https://builds.apache.org/job/UIMA-DUCC/ws/trunk/uima-ducc-orchestrator/target/test-classes/ducc_runtime/resources/state//orchestrator.ckpt>
 INFO |  saved:<https://builds.apache.org/job/UIMA-DUCC/ws/trunk/uima-ducc-orchestrator/target/test-classes/ducc_runtime/resources/state//orchestrator.ckpt>
 INFO |  map is empty
 INFO |  map is empty
Tests run: 3, Failures: 0, Errors: 0, Skipped: 0, Time elapsed: 4.834 sec - in org.apache.uima.ducc.orchestrator.jd.scheduler.test.TestSuite
 INFO | Cobertura: Loaded information on 58 classes.
 INFO | Cobertura: Saved information on 58 classes.

Results :

Tests run: 3, Failures: 0, Errors: 0, Skipped: 0

[JENKINS] Recording test results
[INFO] 
[INFO] <<< cobertura-maven-plugin:2.7:cobertura (default-cli) < [cobertura]test
@ uima-ducc-orchestrator <<<
[INFO] 
[INFO] --- cobertura-maven-plugin:2.7:cobertura (default-cli) @ uima-ducc-orchestrator ---
[INFO] Cobertura 2.1.1 - GNU GPL License (NO WARRANTY) - See COPYRIGHT file
[INFO] Cobertura: Loaded information on 58 classes.
Report time: 1903ms

[INFO] Cobertura Report generation was successful.
[INFO] 
[INFO] >>> maven-javadoc-plugin:2.9.1:javadoc (default-cli) > generate-sources
@ uima-ducc-orchestrator >>>
[INFO] 
[INFO] --- maven-enforcer-plugin:1.3.1:enforce (enforce-versions) @ uima-ducc-orchestrator
---
[INFO] 
[INFO] --- build-helper-maven-plugin:1.8:parse-version (parse-project-version) @ uima-ducc-orchestrator
---
[INFO] 
[INFO] --- uima-build-helper-maven-plugin:7:parse-date-time (set buildYear and buildMonth)
@ uima-ducc-orchestrator ---
[INFO] 
[INFO] --- buildnumber-maven-plugin:1.4:create (default) @ uima-ducc-orchestrator ---
[INFO] Executing: /bin/sh -c cd '<https://builds.apache.org/job/UIMA-DUCC/ws/trunk/uima-ducc-orchestrator'>
&& 'svn' '--non-interactive' 'info'
[INFO] Working directory: <https://builds.apache.org/job/UIMA-DUCC/ws/trunk/uima-ducc-orchestrator>
[INFO] Storing buildNumber: 1761098 at timestamp: 1474063137566
[INFO] Executing: /bin/sh -c cd '<https://builds.apache.org/job/UIMA-DUCC/ws/trunk/uima-ducc-orchestrator'>
&& 'svn' '--non-interactive' 'info'
[INFO] Working directory: <https://builds.apache.org/job/UIMA-DUCC/ws/trunk/uima-ducc-orchestrator>
[INFO] Storing buildScmBranch: trunk
[WARNING] Failed to getClass for org.apache.maven.plugin.javadoc.JavadocReport
[INFO] 
[INFO] <<< maven-javadoc-plugin:2.9.1:javadoc (default-cli) < generate-sources
@ uima-ducc-orchestrator <<<
[INFO] 
[INFO] --- maven-javadoc-plugin:2.9.1:javadoc (default-cli) @ uima-ducc-orchestrator ---
[INFO] 
5 warnings
[WARNING] Javadoc Warnings
[WARNING] warning: [options] bootstrap class path not set in conjunction with -source 1.5
[WARNING] <https://builds.apache.org/job/UIMA-DUCC/ws/trunk/uima-ducc-orchestrator/src/main/java/org/apache/uima/ducc/orchestrator/config/OrchestratorConfiguration.java>:85:
warning - @return tag has no arguments.
[WARNING] <https://builds.apache.org/job/UIMA-DUCC/ws/trunk/uima-ducc-orchestrator/src/main/java/org/apache/uima/ducc/orchestrator/config/OrchestratorConfiguration.java>:283:
warning - @return tag has no arguments.
[WARNING] <https://builds.apache.org/job/UIMA-DUCC/ws/trunk/uima-ducc-orchestrator/src/main/java/org/apache/uima/ducc/orchestrator/config/OrchestratorConfiguration.java>:121:
warning - @return tag has no arguments.
[WARNING] <https://builds.apache.org/job/UIMA-DUCC/ws/trunk/uima-ducc-orchestrator/src/main/java/org/apache/uima/ducc/orchestrator/config/OrchestratorConfiguration.java>:227:
warning - @return tag has no arguments.
[JENKINS] Archiving  javadoc
[INFO]                                                                         
[INFO] ------------------------------------------------------------------------
[INFO] Building Apache UIMA DUCC: uima-ducc-agent 2.2.0-SNAPSHOT
[INFO] ------------------------------------------------------------------------
[INFO] 
[INFO] --- maven-clean-plugin:2.5:clean (default-clean) @ uima-ducc-agent ---
[TASKS] Scanning folder '<https://builds.apache.org/job/UIMA-DUCC/ws/trunk/uima-ducc-agent'>
for files matching the pattern '**/*.java' - excludes: 
[TASKS] Found 57 files to scan for tasks
Found 1 open tasks.
[TASKS] Computing warning deltas based on reference build #987
[INFO] 
[INFO] --- maven-enforcer-plugin:1.3.1:enforce (enforce-versions) @ uima-ducc-agent ---
[INFO] 
[INFO] --- build-helper-maven-plugin:1.8:parse-version (parse-project-version) @ uima-ducc-agent
---
[INFO] 
[INFO] --- uima-build-helper-maven-plugin:7:parse-date-time (set buildYear and buildMonth)
@ uima-ducc-agent ---
[INFO] 
[INFO] --- buildnumber-maven-plugin:1.4:create (default) @ uima-ducc-agent ---
[INFO] Executing: /bin/sh -c cd '<https://builds.apache.org/job/UIMA-DUCC/ws/trunk/uima-ducc-agent'>
&& 'svn' '--non-interactive' 'info'
[INFO] Working directory: <https://builds.apache.org/job/UIMA-DUCC/ws/trunk/uima-ducc-agent>
[INFO] Storing buildNumber: 1761098 at timestamp: 1474063148410
[INFO] Executing: /bin/sh -c cd '<https://builds.apache.org/job/UIMA-DUCC/ws/trunk/uima-ducc-agent'>
&& 'svn' '--non-interactive' 'info'
[INFO] Working directory: <https://builds.apache.org/job/UIMA-DUCC/ws/trunk/uima-ducc-agent>
[INFO] Storing buildScmBranch: trunk
[INFO] 
[INFO] --- maven-remote-resources-plugin:1.5:process (default) @ uima-ducc-agent ---
[INFO] 
[INFO] --- maven-resources-plugin:2.6:resources (default-resources) @ uima-ducc-agent ---
[INFO] Using 'UTF-8' encoding to copy filtered resources.
[INFO] Copying 0 resource
[INFO] Copying 3 resources
[INFO] 
[INFO] --- maven-compiler-plugin:3.1:compile (default-compile) @ uima-ducc-agent ---
[INFO] Changes detected - recompiling the module!
[INFO] Compiling 57 source files to <https://builds.apache.org/job/UIMA-DUCC/ws/trunk/uima-ducc-agent/target/classes>
[INFO] -------------------------------------------------------------
[ERROR] COMPILATION ERROR : 
[INFO] -------------------------------------------------------------
[ERROR] <https://builds.apache.org/job/UIMA-DUCC/ws/trunk/uima-ducc-agent/src/main/java/org/apache/uima/ducc/agent/metrics/collectors/ProcessCpuUsageCollector.java>:[48,39]
incompatible types
  required: long
  found:    java.lang.String
[INFO] 1 error
[INFO] -------------------------------------------------------------
[INFO] ------------------------------------------------------------------------
[INFO] Reactor Summary:
[INFO] 
[INFO] Apache UIMA DUCC: uima-ducc-parent ................. SUCCESS [ 53.616 s]
[INFO] Apache UIMA DUCC: uima-ducc-user ................... SUCCESS [01:35 min]
[INFO] Apache UIMA DUCC: uima-ducc-common ................. SUCCESS [01:45 min]
[INFO] Apache UIMA DUCC: uima-ducc-container .............. SUCCESS [01:32 min]
[INFO] Apache UIMA DUCC: uima-ducc-transport .............. SUCCESS [01:33 min]
[INFO] Apache UIMA DUCC: uima-ducc-cli .................... SUCCESS [01:15 min]
[INFO] Apache UIMA DUCC: uima-ducc-pm ..................... SUCCESS [ 45.070 s]
[INFO] Apache UIMA DUCC: uima-ducc-rm ..................... SUCCESS [01:08 min]
[INFO] Apache UIMA DUCC: uima-ducc-sm ..................... SUCCESS [ 54.858 s]
[INFO] Apache UIMA DUCC: uima-ducc-database ............... SUCCESS [ 49.175 s]
[INFO] Apache UIMA DUCC: uima-ducc-orchestrator ........... SUCCESS [01:17 min]
[INFO] Apache UIMA DUCC: uima-ducc-agent .................. FAILURE [  5.586 s]
[INFO] Apache UIMA DUCC: uima-ducc-duccdocs ............... SKIPPED
[INFO] Apache UIMA DUCC: uima-ducc-web .................... SKIPPED
[INFO] Apache UIMA DUCC: uima-ducc-examples ............... SKIPPED
[INFO] Apache UIMA DUCC: uima-ducc-spawn .................. SKIPPED
[INFO] Apache UIMA-DUCC: uima-ducc ........................ SKIPPED
[INFO] ------------------------------------------------------------------------
[INFO] BUILD FAILURE
[INFO] ------------------------------------------------------------------------
[INFO] Total time: 14:32 min
[INFO] Finished at: 2016-09-16T21:59:15+00:00
[INFO] Final Memory: 115M/852M
[INFO] ------------------------------------------------------------------------
Waiting for Jenkins to finish collecting data
[ERROR] Failed to execute goal org.apache.maven.plugins:maven-compiler-plugin:3.1:compile
(default-compile) on project uima-ducc-agent: Compilation failure
[ERROR] <https://builds.apache.org/job/UIMA-DUCC/ws/trunk/uima-ducc-agent/src/main/java/org/apache/uima/ducc/agent/metrics/collectors/ProcessCpuUsageCollector.java>:[48,39]
incompatible types
[ERROR] required: long
[ERROR] found:    java.lang.String
[ERROR] -> [Help 1]
[ERROR] 
[ERROR] To see the full stack trace of the errors, re-run Maven with the -e switch.
[ERROR] Re-run Maven using the -X switch to enable full debug logging.
[ERROR] 
[ERROR] For more information about the errors and possible solutions, please read the following
articles:
[ERROR] [Help 1] http://cwiki.apache.org/confluence/display/MAVEN/MojoFailureException
[ERROR] 
[ERROR] After correcting the problems, you can resume the build with the command
[ERROR]   mvn <goals> -rf :uima-ducc-agent
[JENKINS] Archiving <https://builds.apache.org/job/UIMA-DUCC/ws/trunk/uima-ducc-sm/pom.xml>
to org.apache.uima/uima-ducc-sm/2.2.0-SNAPSHOT/uima-ducc-sm-2.2.0-SNAPSHOT.pom
[JENKINS] Archiving <https://builds.apache.org/job/UIMA-DUCC/ws/trunk/uima-ducc-sm/target/uima-ducc-sm-2.2.0-SNAPSHOT.jar>
to org.apache.uima/uima-ducc-sm/2.2.0-SNAPSHOT/uima-ducc-sm-2.2.0-SNAPSHOT.jar
[JENKINS] Archiving <https://builds.apache.org/job/UIMA-DUCC/ws/trunk/uima-ducc-parent/pom.xml>
to org.apache.uima/uima-ducc-parent/2.2.0-SNAPSHOT/uima-ducc-parent-2.2.0-SNAPSHOT.pom
[JENKINS] Archiving <https://builds.apache.org/job/UIMA-DUCC/ws/trunk/uima-ducc-duccdocs/pom.xml>
to org.apache.uima/uima-ducc-duccdocs/2.2.0-SNAPSHOT/uima-ducc-duccdocs-2.2.0-SNAPSHOT.pom
[JENKINS] Archiving <https://builds.apache.org/job/UIMA-DUCC/ws/trunk/uima-ducc-pm/pom.xml>
to org.apache.uima/uima-ducc-pm/2.2.0-SNAPSHOT/uima-ducc-pm-2.2.0-SNAPSHOT.pom
[JENKINS] Archiving <https://builds.apache.org/job/UIMA-DUCC/ws/trunk/uima-ducc-pm/target/uima-ducc-pm-2.2.0-SNAPSHOT.jar>
to org.apache.uima/uima-ducc-pm/2.2.0-SNAPSHOT/uima-ducc-pm-2.2.0-SNAPSHOT.jar
[JENKINS] Archiving <https://builds.apache.org/job/UIMA-DUCC/ws/trunk/uima-ducc-database/pom.xml>
to org.apache.uima/uima-ducc-database/2.2.0-SNAPSHOT/uima-ducc-database-2.2.0-SNAPSHOT.pom
[JENKINS] Archiving <https://builds.apache.org/job/UIMA-DUCC/ws/trunk/uima-ducc-database/target/uima-ducc-database-2.2.0-SNAPSHOT.jar>
to org.apache.uima/uima-ducc-database/2.2.0-SNAPSHOT/uima-ducc-database-2.2.0-SNAPSHOT.jar
[JENKINS] Archiving <https://builds.apache.org/job/UIMA-DUCC/ws/trunk/uima-ducc-rm/pom.xml>
to org.apache.uima/uima-ducc-rm/2.2.0-SNAPSHOT/uima-ducc-rm-2.2.0-SNAPSHOT.pom
[JENKINS] Archiving <https://builds.apache.org/job/UIMA-DUCC/ws/trunk/uima-ducc-rm/target/uima-ducc-rm-2.2.0-SNAPSHOT.jar>
to org.apache.uima/uima-ducc-rm/2.2.0-SNAPSHOT/uima-ducc-rm-2.2.0-SNAPSHOT.jar
[JENKINS] Archiving <https://builds.apache.org/job/UIMA-DUCC/ws/trunk/uima-ducc-examples/pom.xml>
to org.apache.uima/uima-ducc-examples/2.2.0-SNAPSHOT/uima-ducc-examples-2.2.0-SNAPSHOT.pom
[JENKINS] Archiving <https://builds.apache.org/job/UIMA-DUCC/ws/trunk/uima-ducc-web/pom.xml>
to org.apache.uima/uima-ducc-web/2.2.0-SNAPSHOT/uima-ducc-web-2.2.0-SNAPSHOT.pom
[JENKINS] Archiving <https://builds.apache.org/job/UIMA-DUCC/ws/trunk/uima-ducc-container/pom.xml>
to org.apache.uima/uima-ducc-container/2.2.0-SNAPSHOT/uima-ducc-container-2.2.0-SNAPSHOT.pom
[JENKINS] Archiving <https://builds.apache.org/job/UIMA-DUCC/ws/trunk/uima-ducc-container/target/uima-ducc-container-2.2.0-SNAPSHOT.jar>
to org.apache.uima/uima-ducc-container/2.2.0-SNAPSHOT/uima-ducc-container-2.2.0-SNAPSHOT.jar
[JENKINS] Archiving <https://builds.apache.org/job/UIMA-DUCC/ws/trunk/uima-ducc-spawn/pom.xml>
to org.apache.uima/uima-ducc-spawn/2.2.0-SNAPSHOT/uima-ducc-spawn-2.2.0-SNAPSHOT.pom
[JENKINS] Archiving <https://builds.apache.org/job/UIMA-DUCC/ws/trunk/uima-ducc-common/pom.xml>
to org.apache.uima/uima-ducc-common/2.2.0-SNAPSHOT/uima-ducc-common-2.2.0-SNAPSHOT.pom
[JENKINS] Archiving <https://builds.apache.org/job/UIMA-DUCC/ws/trunk/uima-ducc-common/target/uima-ducc-common-2.2.0-SNAPSHOT.jar>
to org.apache.uima/uima-ducc-common/2.2.0-SNAPSHOT/uima-ducc-common-2.2.0-SNAPSHOT.jar
[JENKINS] Archiving <https://builds.apache.org/job/UIMA-DUCC/ws/trunk/pom.xml> to org.apache.uima/uima-ducc/2.2.0-SNAPSHOT/uima-ducc-2.2.0-SNAPSHOT.pom
[JENKINS] Archiving <https://builds.apache.org/job/UIMA-DUCC/ws/trunk/uima-ducc-agent/pom.xml>
to org.apache.uima/uima-ducc-agent/2.2.0-SNAPSHOT/uima-ducc-agent-2.2.0-SNAPSHOT.pom
[JENKINS] Archiving <https://builds.apache.org/job/UIMA-DUCC/ws/trunk/uima-ducc-user/pom.xml>
to org.apache.uima/uima-ducc-user/2.2.0-SNAPSHOT/uima-ducc-user-2.2.0-SNAPSHOT.pom
[JENKINS] Archiving <https://builds.apache.org/job/UIMA-DUCC/ws/trunk/uima-ducc-user/target/uima-ducc-user-2.2.0-SNAPSHOT.jar>
to org.apache.uima/uima-ducc-user/2.2.0-SNAPSHOT/uima-ducc-user-2.2.0-SNAPSHOT.jar
[JENKINS] Archiving <https://builds.apache.org/job/UIMA-DUCC/ws/trunk/uima-ducc-orchestrator/pom.xml>
to org.apache.uima/uima-ducc-orchestrator/2.2.0-SNAPSHOT/uima-ducc-orchestrator-2.2.0-SNAPSHOT.pom
[JENKINS] Archiving <https://builds.apache.org/job/UIMA-DUCC/ws/trunk/uima-ducc-orchestrator/target/uima-ducc-orchestrator-2.2.0-SNAPSHOT.jar>
to org.apache.uima/uima-ducc-orchestrator/2.2.0-SNAPSHOT/uima-ducc-orchestrator-2.2.0-SNAPSHOT.jar
[JENKINS] Archiving <https://builds.apache.org/job/UIMA-DUCC/ws/trunk/uima-ducc-transport/pom.xml>
to org.apache.uima/uima-ducc-transport/2.2.0-SNAPSHOT/uima-ducc-transport-2.2.0-SNAPSHOT.pom
[JENKINS] Archiving <https://builds.apache.org/job/UIMA-DUCC/ws/trunk/uima-ducc-transport/target/uima-ducc-transport-2.2.0-SNAPSHOT.jar>
to org.apache.uima/uima-ducc-transport/2.2.0-SNAPSHOT/uima-ducc-transport-2.2.0-SNAPSHOT.jar
[JENKINS] Archiving <https://builds.apache.org/job/UIMA-DUCC/ws/trunk/uima-ducc-cli/pom.xml>
to org.apache.uima/uima-ducc-cli/2.2.0-SNAPSHOT/uima-ducc-cli-2.2.0-SNAPSHOT.pom
[JENKINS] Archiving <https://builds.apache.org/job/UIMA-DUCC/ws/trunk/uima-ducc-cli/target/uima-ducc-cli-2.2.0-SNAPSHOT.jar>
to org.apache.uima/uima-ducc-cli/2.2.0-SNAPSHOT/uima-ducc-cli-2.2.0-SNAPSHOT.jar
Sending e-mails to: dev@uima.apache.org
channel stopped
[WARNINGS] Skipping publisher since build result is FAILURE

Mime
View raw message