uima-dev mailing list archives

Site index · List index
Message view « Date » · « Thread »
Top « Date » · « Thread »
From Apache Jenkins Server <jenk...@builds.apache.org>
Subject Build failed in Jenkins: UIMA-SDK #880
Date Fri, 02 Sep 2016 18:14:42 GMT
See <https://builds.apache.org/job/UIMA-SDK/880/changes>

Changes:

[rec] [UIMA-4579] Remove CAS semver exclude after 2.9.0 release

------------------------------------------
[...truncated 4738 lines...]
Sep 02, 2016 6:07:05 PM PackageInstaller installPackage
INFO: Package installer message: [InstallationController]: extracting <https://builds.apache.org/job/UIMA-SDK/ws/trunk/uimaj-core/target/test-classes/pearTests/typeSystem.pear>

Sep 02, 2016 6:07:06 PM PackageInstaller installPackage
INFO: Package installer message: [InstallationController]: 33414 bytes extracted
[InstallationProcessor]: start processing InsD file - /tmp/pear_verification_test_1746855739282561110tmp/TypeSystemTest/metadata/install.xml

Sep 02, 2016 6:07:06 PM PackageInstaller installPackage
INFO: Package installer message: [InstallationController]: the metadata/setenv.txt file contains
required environment variables for this component
[InstallationController]: component TypeSystemTest installation completed.

Tests run: 3, Failures: 0, Errors: 0, Skipped: 0, Time elapsed: 0.433 sec - in org.apache.uima.pear.util.TestPearInstallationVerification
Running org.apache.uima.pear.util.PearInstallerTest
Sep 02, 2016 6:07:06 PM PackageInstaller installPackage
INFO: Package installer message: [InstallationController]: extracting <https://builds.apache.org/job/UIMA-SDK/ws/trunk/uimaj-core/target/test-classes/pearTests/DateTime.pear>

Sep 02, 2016 6:07:06 PM PackageInstaller installPackage
INFO: Package installer message: [InstallationController]: 72137 bytes extracted

Sep 02, 2016 6:07:06 PM PackageInstaller installPackage
INFO: Package installer message: [InstallationProcessor]: start processing InsD file - /tmp/pear_installer_test_7874083379063403764tmp/uima.example.DateTimeAnnotator/metadata/install.xml

Sep 02, 2016 6:07:06 PM PackageInstaller installPackage
INFO: Package installer message: [InstallationController]: the metadata/setenv.txt file contains
required environment variables for this component
[InstallationController]: component uima.example.DateTimeAnnotator installation completed.

Sep 02, 2016 6:07:06 PM PackageInstaller installPackage
INFO: Installation verification of component uima.example.DateTimeAnnotator successfully completed.
Tests run: 1, Failures: 0, Errors: 0, Skipped: 0, Time elapsed: 0.203 sec - in org.apache.uima.pear.util.PearInstallerTest
Running org.apache.uima.pear.util.ComponentCategoryTest
Tests run: 5, Failures: 0, Errors: 0, Skipped: 0, Time elapsed: 0.106 sec - in org.apache.uima.pear.util.ComponentCategoryTest
Running org.apache.uima.resource.impl.ConfigurableDataResourceSpecifier_implTest
Tests run: 1, Failures: 0, Errors: 0, Skipped: 0, Time elapsed: 0.01 sec - in org.apache.uima.resource.impl.ConfigurableDataResourceSpecifier_implTest
Running org.apache.uima.resource.impl.ResourceManager_implTest
Sep 02, 2016 6:07:06 PM org.apache.uima.resource.impl.ResourceManager_impl initializeExternalResources
WARNING: The external resource named MyFileLanguageResource has been declared multiple times
with different definitions. The definition of the resource in component /Annotator1/ will
be used.  The definition in component /Annotator2/ will be ignored.
Tests run: 4, Failures: 0, Errors: 0, Skipped: 0, Time elapsed: 0.048 sec - in org.apache.uima.resource.impl.ResourceManager_implTest
Running org.apache.uima.resource.impl.PearSpecifier_implTest
Tests run: 2, Failures: 0, Errors: 0, Skipped: 0, Time elapsed: 0.007 sec - in org.apache.uima.resource.impl.PearSpecifier_implTest
Running org.apache.uima.resource.impl.URISpecifier_implTest
Tests run: 1, Failures: 0, Errors: 0, Skipped: 0, Time elapsed: 0.004 sec - in org.apache.uima.resource.impl.URISpecifier_implTest
Running org.apache.uima.resource.impl.DataResource_implTest
Tests run: 2, Failures: 0, Errors: 0, Skipped: 0, Time elapsed: 0.001 sec - in org.apache.uima.resource.impl.DataResource_implTest
Running org.apache.uima.resource.impl.RelativePathResolver_implTest
Tests run: 2, Failures: 0, Errors: 0, Skipped: 0, Time elapsed: 0 sec - in org.apache.uima.resource.impl.RelativePathResolver_implTest
Running org.apache.uima.resource.impl.FileLanguageResource_implTest
Tests run: 1, Failures: 0, Errors: 0, Skipped: 0, Time elapsed: 0.001 sec - in org.apache.uima.resource.impl.FileLanguageResource_implTest
Running org.apache.uima.resource.impl.ResourceCreationSpecifier_implTest
Tests run: 1, Failures: 0, Errors: 0, Skipped: 0, Time elapsed: 0.007 sec - in org.apache.uima.resource.impl.ResourceCreationSpecifier_implTest
Running org.apache.uima.resource.impl.CasManager_implTest
Tests run: 1, Failures: 0, Errors: 0, Skipped: 0, Time elapsed: 0.003 sec - in org.apache.uima.resource.impl.CasManager_implTest
Running org.apache.uima.resource.impl.ConfigurableDataResource_implTest
Tests run: 1, Failures: 0, Errors: 0, Skipped: 0, Time elapsed: 0 sec - in org.apache.uima.resource.impl.ConfigurableDataResource_implTest
Running org.apache.uima.resource.service.impl.ResourceServiceAdapter_implTest
Tests run: 1, Failures: 0, Errors: 0, Skipped: 0, Time elapsed: 0.002 sec - in org.apache.uima.resource.service.impl.ResourceServiceAdapter_implTest
Running org.apache.uima.resource.service.impl.ResourceService_implTest
Tests run: 1, Failures: 0, Errors: 0, Skipped: 0, Time elapsed: 0.001 sec - in org.apache.uima.resource.service.impl.ResourceService_implTest
Running org.apache.uima.resource.metadata.impl.TypeSystemDescription_implTest
Tests run: 3, Failures: 0, Errors: 0, Skipped: 0, Time elapsed: 0.062 sec - in org.apache.uima.resource.metadata.impl.TypeSystemDescription_implTest
Running org.apache.uima.resource.metadata.impl.ResourceManagerConfiguration_implTest
Tests run: 3, Failures: 0, Errors: 0, Skipped: 0, Time elapsed: 0.036 sec - in org.apache.uima.resource.metadata.impl.ResourceManagerConfiguration_implTest
Running org.apache.uima.resource.metadata.impl.Import_implTest
Tests run: 3, Failures: 0, Errors: 0, Skipped: 0, Time elapsed: 0.019 sec - in org.apache.uima.resource.metadata.impl.Import_implTest
Running org.apache.uima.resource.metadata.impl.MetaDataObject_implTest
true
Tests run: 5, Failures: 0, Errors: 0, Skipped: 0, Time elapsed: 0.02 sec - in org.apache.uima.resource.metadata.impl.MetaDataObject_implTest
Running org.apache.uima.resource.metadata.impl.ConfigurationParameterDeclarations_implTest
Tests run: 1, Failures: 0, Errors: 0, Skipped: 0, Time elapsed: 0 sec - in org.apache.uima.resource.metadata.impl.ConfigurationParameterDeclarations_implTest
Running org.apache.uima.resource.metadata.impl.TypePriorities_implTest
Tests run: 3, Failures: 0, Errors: 0, Skipped: 0, Time elapsed: 0.024 sec - in org.apache.uima.resource.metadata.impl.TypePriorities_implTest
Running org.apache.uima.resource.metadata.impl.FsIndexCollection_implTest
Tests run: 2, Failures: 0, Errors: 0, Skipped: 0, Time elapsed: 0.017 sec - in org.apache.uima.resource.metadata.impl.FsIndexCollection_implTest
Running org.apache.uima.resource.ConfigurableResource_implTest
Tests run: 2, Failures: 0, Errors: 0, Skipped: 0, Time elapsed: 0 sec - in org.apache.uima.resource.ConfigurableResource_implTest
Running org.apache.uima.collection.impl.CollectionReaderDescription_implTest
Tests run: 2, Failures: 0, Errors: 0, Skipped: 0, Time elapsed: 0 sec - in org.apache.uima.collection.impl.CollectionReaderDescription_implTest
Running org.apache.uima.collection.impl.CasInitializerDescription_implTest
Tests run: 2, Failures: 0, Errors: 0, Skipped: 0, Time elapsed: 0.01 sec - in org.apache.uima.collection.impl.CasInitializerDescription_implTest
Running org.apache.uima.collection.impl.CasConsumerDescription_implTest
Tests run: 2, Failures: 0, Errors: 0, Skipped: 0, Time elapsed: 0.014 sec - in org.apache.uima.collection.impl.CasConsumerDescription_implTest
Running org.apache.uima.cas_data.impl.XCasToCasDataSaxHandlerTest
Tests run: 2, Failures: 0, Errors: 0, Skipped: 0, Time elapsed: 0.355 sec - in org.apache.uima.cas_data.impl.XCasToCasDataSaxHandlerTest
Running org.apache.uima.cas_data.impl.CasDataToXCasTest
Tests run: 1, Failures: 0, Errors: 0, Skipped: 0, Time elapsed: 0.001 sec - in org.apache.uima.cas_data.impl.CasDataToXCasTest

Results :

Tests run: 517, Failures: 0, Errors: 0, Skipped: 0

[JENKINS] Recording test results
[INFO] 
[INFO] --- maven-antrun-plugin:1.7:run (dup-meta-jar-cleanup) @ uimaj-core ---
[INFO] Executing tasks

main:
[INFO] Executed tasks
[INFO] 
[INFO] --- jacoco-maven-plugin:0.7.6.201602180812:report (default-report) @ uimaj-core ---
[INFO] Analyzed bundle 'Apache UIMA Base: uimaj-core' with 656 classes
[PMD] No report found for mojo report
[INFO] 
[INFO] --- maven-jar-plugin:2.3.2:jar (default-jar) @ uimaj-core ---
[INFO] Building jar: <https://builds.apache.org/job/UIMA-SDK/ws/trunk/uimaj-core/target/uima-core.jar>
[INFO] 
[INFO] --- maven-site-plugin:3.3:attach-descriptor (attach-descriptor) @ uimaj-core ---
[INFO] 
[INFO] --- findbugs-maven-plugin:3.0.3:findbugs (default) @ uimaj-core ---
[INFO] Fork Value is true
     [java] Warnings generated: 226
[INFO] Done FindBugs Analysis....
[FINDBUGS] Finding all files that match the pattern findbugsXml.xml
[FINDBUGS] Parsing 1 file in <https://builds.apache.org/job/UIMA-SDK/ws/trunk/uimaj-core/target>
[FINDBUGS] Successfully parsed file <https://builds.apache.org/job/UIMA-SDK/ws/trunk/uimaj-core/target/findbugsXml.xml>
of module Apache UIMA Base: uimaj-core with 224 unique warnings and 2 duplicates.
[FINDBUGS] Computing warning deltas based on reference build #879
[INFO] 
[INFO] --- maven-pmd-plugin:3.6:cpd (default) @ uimaj-core ---
[DRY] Finding all files that match the pattern cpd.xml
[DRY] Parsing 1 file in <https://builds.apache.org/job/UIMA-SDK/ws/trunk/uimaj-core/target>
[DRY] Successfully parsed file <https://builds.apache.org/job/UIMA-SDK/ws/trunk/uimaj-core/target/cpd.xml>
of module Apache UIMA Base: uimaj-core with 124 unique warnings and 0 duplicates.
[DRY] Computing warning deltas based on reference build #879
[INFO] 
[INFO] --- maven-pmd-plugin:3.6:pmd (default) @ uimaj-core ---
[PMD] Finding all files that match the pattern pmd.xml
[PMD] Parsing 1 file in <https://builds.apache.org/job/UIMA-SDK/ws/trunk/uimaj-core/target>
[PMD] Successfully parsed file <https://builds.apache.org/job/UIMA-SDK/ws/trunk/uimaj-core/target/pmd.xml>
of module Apache UIMA Base: uimaj-core with 2484 unique warnings and 0 duplicates.
[PMD] Computing warning deltas based on reference build #879
[INFO] 
[INFO] --- maven-enforcer-plugin:1.3.1:enforce (enforce-compatibility) @ uimaj-core ---
[INFO] Version specified as <2.8.1>
[INFO] Using </home/jenkins/jenkins-slave/maven-repositories/1/org/apache/uima/uimaj-core/2.8.1/uimaj-core-2.8.1.jar>
as previous JAR
[INFO] Using <<https://builds.apache.org/job/UIMA-SDK/ws/trunk/uimaj-core/target/uima-core.jar>>
as current JAR
Class org.apache.uima.ResourceSpecifierFactory
 Added Method createSettings, desc ()Lorg/apache/uima/util/Settings;, access abstract public
Class org.apache.uima.UimaContext
 Added Method getExternalOverrides, desc ()Lorg/apache/uima/util/Settings;, access abstract
public
 Added Method getSharedSettingArray, desc (Ljava/lang/String;)[Ljava/lang/String;, access
abstract public
 Added Method getSharedSettingValue, desc (Ljava/lang/String;)Ljava/lang/String;, access abstract
public
 Added Method getSharedSettingNames, desc ()[Ljava/lang/String;, access abstract public
Class org.apache.uima.UimaContextHolder
 Added Class , access public super synchronized
Class org.apache.uima.cas.CAS
 Changed Field FEATURE_FULL_NAME_SOFA, desc Ljava/lang/String;, access 
Class org.apache.uima.resource.ResourceConfigurationException
 Added Field EXTERNAL_OVERRIDE_TYPE_MISMATCH, desc Ljava/lang/String;, access final public
static
 Added Field EXTERNAL_OVERRIDE_NUMERIC_ERROR, desc Ljava/lang/String;, access final public
static
Class org.apache.uima.resource.ResourceManager
 Deprecated Method getImportCache, sig ()Ljava/util/Map<Ljava/lang/String;Lorg/apache/uima/util/XMLizable;>;,
desc ()Ljava/util/Map;, access abstract public
Class org.apache.uima.util.Settings
 Added Method getSettingArray, desc (Ljava/lang/String;)[Ljava/lang/String;, access abstract
public
 Added Method getSetting, desc (Ljava/lang/String;)Ljava/lang/String;, access abstract public
[WARNING] Rule 0: org.semver.enforcer.RequireBackwardCompatibility failed with message:
Current codebase is not backward compatible (BACKWARD_COMPATIBLE_USER) with version <2.8.1>.
Compatibility type has been detected as <NON_BACKWARD_COMPATIBLE>
[INFO]                                                                         
[INFO] ------------------------------------------------------------------------
[INFO] Skipping Apache UIMA Java SDK: uimaj
[INFO] This project has been banned from the build due to previous failures.
[INFO] ------------------------------------------------------------------------
[INFO] ------------------------------------------------------------------------
[INFO] Reactor Summary:
[INFO] 
[INFO] Apache UIMA Java SDK: uimaj-parent ................. SUCCESS [ 57.248 s]
[INFO] Apache UIMA Base: uimaj-test-util: JUnit utilities . SUCCESS [03:12 min]
[INFO] Apache UIMA Base: uimaj-core ....................... FAILURE [06:56 min]
[INFO] Apache UIMA Base: jVinci: Vinci Transport Library .. SKIPPED
[INFO] Apache UIMA Base: uimaj-adapter-vinci: Vinci Adapter SKIPPED
[INFO] Apache UIMA Base: uimaj-cpe: Collection Processing Engine SKIPPED
[INFO] Apache UIMA Base: uimaj-document-annotation ........ SKIPPED
[INFO] Apache UIMA Base: uimaj-tools: Tools ............... SKIPPED
[INFO] Apache UIMA Base: uimaj-examples: SDK Examples ..... SKIPPED
[INFO] Apache UIMA Base: uimaj-adapter-soap: SOAP Adapter . SKIPPED
[INFO] Apache UIMA Base: uimaj-component-test-util: for JUnit SKIPPED
[INFO] Apache UIMA Eclipse: uimaj-ep-debug ................ SKIPPED
[INFO] Apache UIMA Eclipse: uimaj-ep-jcasgen .............. SKIPPED
[INFO] Apache UIMA Eclipse: uimaj-ep-configurator: Descriptor Editor SKIPPED
[INFO] Apache UIMA Eclipse: uimaj-ep-pear-packager ........ SKIPPED
[INFO] Apache UIMA Eclipse: uimaj-ep-launcher ............. SKIPPED
[INFO] Apache UIMA Eclipse: uimaj-ep-cas-editor ........... SKIPPED
[INFO] Apache UIMA Eclipse: uimaj-ep-cas-editor-ide ....... SKIPPED
[INFO] Apache UIMA Eclipse: uimaj-ep-runtime .............. SKIPPED
[INFO] Apache UIMA Eclipse: uimaj-eclipse-feature-tools ... SKIPPED
[INFO] Apache UIMA Eclipse: uimaj-eclipse-feature-runtime . SKIPPED
[INFO] Apache UIMA Aggregate: aggregate-uimaj-eclipse-plugins SKIPPED
[INFO] Apache UIMA SDK Documentation - overview and setup . SKIPPED
[INFO] Apache UIMA SDK Documentation - references ......... SKIPPED
[INFO] Apache UIMA SDK Documentation - tools .............. SKIPPED
[INFO] Apache UIMA SDK Documentation - tutorials and user's guides SKIPPED
[INFO] Apache UIMA Aggregate: aggregate-uimaj-docbooks .... SKIPPED
[INFO] Apache UIMA Maven: PearPackagingMavenPlugin ........ SKIPPED
[INFO] Apache UIMA Maven: jcasgen-maven-plugin ............ SKIPPED
[INFO] Apache UIMA Base: uimaj-bootstrap .................. SKIPPED
[INFO] Apache UIMA Aggregate: aggregate-uimaj ............. SKIPPED
[INFO] Apache UIMA Base: uimaj-json: JSON ................. SKIPPED
[INFO] Apache UIMA Java SDK: uimaj ........................ SKIPPED
[INFO] ------------------------------------------------------------------------
[INFO] BUILD FAILURE
[INFO] ------------------------------------------------------------------------
[INFO] Total time: 13:03 min
[INFO] Finished at: 2016-09-02T18:12:19+00:00
[INFO] Final Memory: 103M/742M
[INFO] ------------------------------------------------------------------------
Waiting for Jenkins to finish collecting data
[ERROR] Failed to execute goal org.apache.maven.plugins:maven-enforcer-plugin:1.3.1:enforce
(enforce-compatibility) on project uimaj-core: Some Enforcer rules have failed. Look above
for specific messages explaining why the rule failed. -> [Help 1]
[ERROR] 
[ERROR] To see the full stack trace of the errors, re-run Maven with the -e switch.
[ERROR] Re-run Maven using the -X switch to enable full debug logging.
[ERROR] 
[ERROR] For more information about the errors and possible solutions, please read the following
articles:
[ERROR] [Help 1] http://cwiki.apache.org/confluence/display/MAVEN/MojoExecutionException
[ERROR] 
[ERROR] After correcting the problems, you can resume the build with the command
[ERROR]   mvn <goals> -rf :uimaj-core
[JENKINS] Archiving <https://builds.apache.org/job/UIMA-SDK/ws/trunk/uimaj-eclipse-feature-runtime/pom.xml>
to org.apache.uima/uimaj-eclipse-feature-runtime/2.9.1-SNAPSHOT/uimaj-eclipse-feature-runtime-2.9.1-SNAPSHOT.pom
[JENKINS] Archiving <https://builds.apache.org/job/UIMA-SDK/ws/trunk/uimaj-ep-launcher/pom.xml>
to org.apache.uima/uimaj-ep-launcher/2.9.1-SNAPSHOT/uimaj-ep-launcher-2.9.1-SNAPSHOT.pom
[JENKINS] Archiving <https://builds.apache.org/job/UIMA-SDK/ws/trunk/uimaj-eclipse-feature-tools/pom.xml>
to org.apache.uima/uimaj-eclipse-feature-tools/2.9.1-SNAPSHOT/uimaj-eclipse-feature-tools-2.9.1-SNAPSHOT.pom
[JENKINS] Archiving <https://builds.apache.org/job/UIMA-SDK/ws/trunk/uimaj-bootstrap/pom.xml>
to org.apache.uima/uimaj-bootstrap/2.9.1-SNAPSHOT/uimaj-bootstrap-2.9.1-SNAPSHOT.pom
[JENKINS] Archiving <https://builds.apache.org/job/UIMA-SDK/ws/trunk/aggregate-uimaj-eclipse-plugins/pom.xml>
to org.apache.uima/aggregate-uimaj-eclipse-plugins/2.9.1-SNAPSHOT/aggregate-uimaj-eclipse-plugins-2.9.1-SNAPSHOT.pom
[JENKINS] Archiving <https://builds.apache.org/job/UIMA-SDK/ws/trunk/uimaj-core/pom.xml>
to org.apache.uima/uimaj-core/2.9.1-SNAPSHOT/uimaj-core-2.9.1-SNAPSHOT.pom
[JENKINS] Archiving <https://builds.apache.org/job/UIMA-SDK/ws/trunk/uimaj-core/target/uima-core.jar>
to org.apache.uima/uimaj-core/2.9.1-SNAPSHOT/uimaj-core-2.9.1-SNAPSHOT.jar
[JENKINS] Archiving <https://builds.apache.org/job/UIMA-SDK/ws/trunk/uimaj-component-test-util/pom.xml>
to org.apache.uima/uimaj-component-test-util/2.9.1-SNAPSHOT/uimaj-component-test-util-2.9.1-SNAPSHOT.pom
[JENKINS] Archiving <https://builds.apache.org/job/UIMA-SDK/ws/trunk/aggregate-uimaj-docbooks/pom.xml>
to org.apache.uima/aggregate-uimaj-docbooks/2.9.1-SNAPSHOT/aggregate-uimaj-docbooks-2.9.1-SNAPSHOT.pom
[JENKINS] Archiving <https://builds.apache.org/job/UIMA-SDK/ws/trunk/uima-docbook-tools/pom.xml>
to org.apache.uima/uima-docbook-tools/2.9.1-SNAPSHOT/uima-docbook-tools-2.9.1-SNAPSHOT.pom
[JENKINS] Archiving <https://builds.apache.org/job/UIMA-SDK/ws/trunk/uimaj-document-annotation/pom.xml>
to org.apache.uima/uimaj-document-annotation/2.9.1-SNAPSHOT/uimaj-document-annotation-2.9.1-SNAPSHOT.pom
[JENKINS] Archiving <https://builds.apache.org/job/UIMA-SDK/ws/trunk/jVinci/pom.xml>
to org.apache.uima/jVinci/2.9.1-SNAPSHOT/jVinci-2.9.1-SNAPSHOT.pom
[JENKINS] Archiving <https://builds.apache.org/job/UIMA-SDK/ws/trunk/uimaj-ep-configurator/pom.xml>
to org.apache.uima/uimaj-ep-configurator/2.9.1-SNAPSHOT/uimaj-ep-configurator-2.9.1-SNAPSHOT.pom
[JENKINS] Archiving <https://builds.apache.org/job/UIMA-SDK/ws/trunk/uimaj-examples/pom.xml>
to org.apache.uima/uimaj-examples/2.9.1-SNAPSHOT/uimaj-examples-2.9.1-SNAPSHOT.pom
[JENKINS] Archiving <https://builds.apache.org/job/UIMA-SDK/ws/trunk/uimaj-adapter-vinci/pom.xml>
to org.apache.uima/uimaj-adapter-vinci/2.9.1-SNAPSHOT/uimaj-adapter-vinci-2.9.1-SNAPSHOT.pom
[JENKINS] Archiving <https://builds.apache.org/job/UIMA-SDK/ws/trunk/PearPackagingMavenPlugin/pom.xml>
to org.apache.uima/PearPackagingMavenPlugin/2.9.1-SNAPSHOT/PearPackagingMavenPlugin-2.9.1-SNAPSHOT.pom
[JENKINS] Archiving <https://builds.apache.org/job/UIMA-SDK/ws/trunk/uimaj-ep-cas-editor-ide/pom.xml>
to org.apache.uima/uimaj-ep-cas-editor-ide/2.9.1-SNAPSHOT/uimaj-ep-cas-editor-ide-2.9.1-SNAPSHOT.pom
[JENKINS] Archiving <https://builds.apache.org/job/UIMA-SDK/ws/trunk/uimaj-test-util/pom.xml>
to org.apache.uima/uimaj-test-util/2.9.1-SNAPSHOT/uimaj-test-util-2.9.1-SNAPSHOT.pom
[JENKINS] Archiving <https://builds.apache.org/job/UIMA-SDK/ws/trunk/uimaj-test-util/target/uimaj-test-util-2.9.1-SNAPSHOT.jar>
to org.apache.uima/uimaj-test-util/2.9.1-SNAPSHOT/uimaj-test-util-2.9.1-SNAPSHOT.jar
[JENKINS] Archiving <https://builds.apache.org/job/UIMA-SDK/ws/trunk/uimaj-ep-runtime/pom.xml>
to org.apache.uima/uimaj-ep-runtime/2.9.1-SNAPSHOT/uimaj-ep-runtime-2.9.1-SNAPSHOT.pom
[JENKINS] Archiving <https://builds.apache.org/job/UIMA-SDK/ws/trunk/uimaj-ep-debug/pom.xml>
to org.apache.uima/uimaj-ep-debug/2.9.1-SNAPSHOT/uimaj-ep-debug-2.9.1-SNAPSHOT.pom
[JENKINS] Archiving <https://builds.apache.org/job/UIMA-SDK/ws/trunk/uimaj-ep-cas-editor/pom.xml>
to org.apache.uima/uimaj-ep-cas-editor/2.9.1-SNAPSHOT/uimaj-ep-cas-editor-2.9.1-SNAPSHOT.pom
[JENKINS] Archiving <https://builds.apache.org/job/UIMA-SDK/ws/trunk/aggregate-uimaj/pom.xml>
to org.apache.uima/aggregate-uimaj/2.9.1-SNAPSHOT/aggregate-uimaj-2.9.1-SNAPSHOT.pom
[JENKINS] Archiving <https://builds.apache.org/job/UIMA-SDK/ws/trunk/uimaj-parent/pom.xml>
to org.apache.uima/uimaj-parent/2.9.1-SNAPSHOT/uimaj-parent-2.9.1-SNAPSHOT.pom
[JENKINS] Archiving <https://builds.apache.org/job/UIMA-SDK/ws/trunk/jcasgen-maven-plugin/pom.xml>
to org.apache.uima/jcasgen-maven-plugin/2.9.1-SNAPSHOT/jcasgen-maven-plugin-2.9.1-SNAPSHOT.pom
[JENKINS] Archiving <https://builds.apache.org/job/UIMA-SDK/ws/trunk/pom.xml> to org.apache.uima/uimaj/2.9.1-SNAPSHOT/uimaj-2.9.1-SNAPSHOT.pom
[JENKINS] Archiving <https://builds.apache.org/job/UIMA-SDK/ws/trunk/uimaj-ep-jcasgen/pom.xml>
to org.apache.uima/uimaj-ep-jcasgen/2.9.1-SNAPSHOT/uimaj-ep-jcasgen-2.9.1-SNAPSHOT.pom
[JENKINS] Archiving <https://builds.apache.org/job/UIMA-SDK/ws/trunk/uimaj-json/pom.xml>
to org.apache.uima/uimaj-json/2.9.1-SNAPSHOT/uimaj-json-2.9.1-SNAPSHOT.pom
[JENKINS] Archiving <https://builds.apache.org/job/UIMA-SDK/ws/trunk/uimaj-tools/pom.xml>
to org.apache.uima/uimaj-tools/2.9.1-SNAPSHOT/uimaj-tools-2.9.1-SNAPSHOT.pom
[JENKINS] Archiving <https://builds.apache.org/job/UIMA-SDK/ws/trunk/uima-docbook-tutorials-and-users-guides/pom.xml>
to org.apache.uima/uima-docbook-tutorials-and-users-guides/2.9.1-SNAPSHOT/uima-docbook-tutorials-and-users-guides-2.9.1-SNAPSHOT.pom
[JENKINS] Archiving <https://builds.apache.org/job/UIMA-SDK/ws/trunk/uimaj-adapter-soap/pom.xml>
to org.apache.uima/uimaj-adapter-soap/2.9.1-SNAPSHOT/uimaj-adapter-soap-2.9.1-SNAPSHOT.pom
[JENKINS] Archiving <https://builds.apache.org/job/UIMA-SDK/ws/trunk/uimaj-ep-pear-packager/pom.xml>
to org.apache.uima/uimaj-ep-pear-packager/2.9.1-SNAPSHOT/uimaj-ep-pear-packager-2.9.1-SNAPSHOT.pom
[JENKINS] Archiving <https://builds.apache.org/job/UIMA-SDK/ws/trunk/uima-docbook-overview-and-setup/pom.xml>
to org.apache.uima/uima-docbook-overview-and-setup/2.9.1-SNAPSHOT/uima-docbook-overview-and-setup-2.9.1-SNAPSHOT.pom
[JENKINS] Archiving <https://builds.apache.org/job/UIMA-SDK/ws/trunk/uima-docbook-references/pom.xml>
to org.apache.uima/uima-docbook-references/2.9.1-SNAPSHOT/uima-docbook-references-2.9.1-SNAPSHOT.pom
[JENKINS] Archiving <https://builds.apache.org/job/UIMA-SDK/ws/trunk/uimaj-cpe/pom.xml>
to org.apache.uima/uimaj-cpe/2.9.1-SNAPSHOT/uimaj-cpe-2.9.1-SNAPSHOT.pom
Sending e-mails to: dev@uima.apache.org
channel stopped
[WARNINGS] Skipping publisher since build result is FAILURE

Mime
View raw message