uima-dev mailing list archives

Site index · List index
Message view « Date » · « Thread »
Top « Date » · « Thread »
From Apache Jenkins Server <jenk...@builds.apache.org>
Subject Build failed in Jenkins: UIMA-uimaFIT_java8 #73
Date Thu, 20 Oct 2016 16:06:51 GMT
See <https://builds.apache.org/job/UIMA-uimaFIT_java8/73/>

------------------------------------------
[...truncated 685 lines...]
[INFO] Apache UIMA uimaFIT - Spring integration
[INFO] Apache UIMA uimaFIT - Maven Plugin
[INFO] Apache UIMA uimaFIT - Legacy uimaFIT support
[INFO] Apache UIMA uimaFIT - Documentation
[INFO] Apache UIMA uimaFIT - Collection Processing Engine support
[INFO] Apache UIMA uimaFIT
[INFO] Downloading: https://repo.maven.apache.org/maven2/org/codehaus/mojo/cobertura-maven-plugin/2.6/cobertura-maven-plugin-2.6.pom
[INFO] Downloaded: https://repo.maven.apache.org/maven2/org/codehaus/mojo/cobertura-maven-plugin/2.6/cobertura-maven-plugin-2.6.pom
(9 KB at 21.2 KB/sec)
[INFO] Downloading: https://repo.maven.apache.org/maven2/org/codehaus/mojo/cobertura-maven-plugin/2.6/cobertura-maven-plugin-2.6.jar
[INFO] Downloaded: https://repo.maven.apache.org/maven2/org/codehaus/mojo/cobertura-maven-plugin/2.6/cobertura-maven-plugin-2.6.jar
(48 KB at 646.6 KB/sec)
[INFO] Downloading: https://repo.maven.apache.org/maven2/org/codehaus/gmaven/gmaven-plugin/1.5/gmaven-plugin-1.5.pom
[INFO] Downloaded: https://repo.maven.apache.org/maven2/org/codehaus/gmaven/gmaven-plugin/1.5/gmaven-plugin-1.5.pom
(11 KB at 343.4 KB/sec)
[INFO] Downloading: https://repo.maven.apache.org/maven2/org/codehaus/gmaven/gmaven/1.5/gmaven-1.5.pom
[INFO] Downloaded: https://repo.maven.apache.org/maven2/org/codehaus/gmaven/gmaven/1.5/gmaven-1.5.pom
(41 KB at 1221.5 KB/sec)
[INFO] Downloading: https://repo.maven.apache.org/maven2/org/codehaus/gmaven/gmaven-plugin/1.5/gmaven-plugin-1.5.jar
[INFO] Downloaded: https://repo.maven.apache.org/maven2/org/codehaus/gmaven/gmaven-plugin/1.5/gmaven-plugin-1.5.jar
(75 KB at 1970.9 KB/sec)
[INFO]                                                                         
[INFO] ------------------------------------------------------------------------
[INFO] Building Apache UIMA uimaFIT - Parent 2.3.0-SNAPSHOT
[INFO] ------------------------------------------------------------------------
[INFO] 
[INFO] --- maven-clean-plugin:2.5:clean (default-clean) @ uimafit-parent ---
[TASKS] Scanning folder '<https://builds.apache.org/job/UIMA-uimaFIT_java8/ws/trunk/uimafit-parent'>
for files matching the pattern '**/*.java' - excludes: 
[TASKS] Found 0 files to scan for tasks
Found 0 open tasks.
[TASKS] Computing warning deltas based on reference build #72
[INFO] 
[INFO] --- maven-enforcer-plugin:1.3.1:enforce (enforce-versions) @ uimafit-parent ---
[INFO] 
[INFO] --- build-helper-maven-plugin:1.8:parse-version (parse-project-version) @ uimafit-parent
---
[INFO] 
[INFO] --- uima-build-helper-maven-plugin:7:parse-date-time (set buildYear and buildMonth)
@ uimafit-parent ---
[INFO] 
[INFO] --- gmaven-plugin:1.5:execute (read-notice) @ uimafit-parent ---
[INFO] Downloading: https://repo.maven.apache.org/maven2/org/codehaus/gmaven/runtime/gmaven-runtime-api/1.5/gmaven-runtime-api-1.5.pom
[INFO] Downloaded: https://repo.maven.apache.org/maven2/org/codehaus/gmaven/runtime/gmaven-runtime-api/1.5/gmaven-runtime-api-1.5.pom
(2 KB at 74.7 KB/sec)
[INFO] Downloading: https://repo.maven.apache.org/maven2/org/codehaus/gmaven/runtime/gmaven-runtime/1.5/gmaven-runtime-1.5.pom
[INFO] Downloaded: https://repo.maven.apache.org/maven2/org/codehaus/gmaven/runtime/gmaven-runtime/1.5/gmaven-runtime-1.5.pom
(4 KB at 195.0 KB/sec)
[INFO] Downloading: https://repo.maven.apache.org/maven2/org/codehaus/gmaven/feature/gmaven-feature-api/1.5/gmaven-feature-api-1.5.pom
[INFO] Downloaded: https://repo.maven.apache.org/maven2/org/codehaus/gmaven/feature/gmaven-feature-api/1.5/gmaven-feature-api-1.5.pom
(2 KB at 88.5 KB/sec)
[INFO] Downloading: https://repo.maven.apache.org/maven2/org/codehaus/gmaven/feature/gmaven-feature/1.5/gmaven-feature-1.5.pom
[INFO] Downloaded: https://repo.maven.apache.org/maven2/org/codehaus/gmaven/feature/gmaven-feature/1.5/gmaven-feature-1.5.pom
(2 KB at 78.8 KB/sec)
[INFO] Downloading: https://repo.maven.apache.org/maven2/org/codehaus/gmaven/runtime/gmaven-runtime-loader/1.5/gmaven-runtime-loader-1.5.pom
[INFO] Downloaded: https://repo.maven.apache.org/maven2/org/codehaus/gmaven/runtime/gmaven-runtime-loader/1.5/gmaven-runtime-loader-1.5.pom
(3 KB at 128.1 KB/sec)
[INFO] Downloading: https://repo.maven.apache.org/maven2/org/codehaus/gmaven/feature/gmaven-feature-support/1.5/gmaven-feature-support-1.5.pom
[INFO] Downloaded: https://repo.maven.apache.org/maven2/org/codehaus/gmaven/feature/gmaven-feature-support/1.5/gmaven-feature-support-1.5.pom
(2 KB at 92.7 KB/sec)
[INFO] Downloading: https://repo.maven.apache.org/maven2/org/codehaus/gmaven/runtime/gmaven-runtime-support/1.5/gmaven-runtime-support-1.5.pom
[INFO] Downloaded: https://repo.maven.apache.org/maven2/org/codehaus/gmaven/runtime/gmaven-runtime-support/1.5/gmaven-runtime-support-1.5.pom
(3 KB at 119.7 KB/sec)
[INFO] Downloading: https://repo.maven.apache.org/maven2/org/codehaus/gmaven/runtime/gmaven-runtime-api/1.5/gmaven-runtime-api-1.5.jar
[INFO] Downloading: https://repo.maven.apache.org/maven2/org/codehaus/gmaven/feature/gmaven-feature-api/1.5/gmaven-feature-api-1.5.jar
[INFO] Downloading: https://repo.maven.apache.org/maven2/org/codehaus/gmaven/runtime/gmaven-runtime-loader/1.5/gmaven-runtime-loader-1.5.jar
[INFO] Downloading: https://repo.maven.apache.org/maven2/org/codehaus/gmaven/feature/gmaven-feature-support/1.5/gmaven-feature-support-1.5.jar
[INFO] Downloading: https://repo.maven.apache.org/maven2/org/codehaus/gmaven/runtime/gmaven-runtime-support/1.5/gmaven-runtime-support-1.5.jar
[INFO] Downloaded: https://repo.maven.apache.org/maven2/org/codehaus/gmaven/runtime/gmaven-runtime-api/1.5/gmaven-runtime-api-1.5.jar
(22 KB at 662.3 KB/sec)
[INFO] Downloaded: https://repo.maven.apache.org/maven2/org/codehaus/gmaven/feature/gmaven-feature-support/1.5/gmaven-feature-support-1.5.jar
(14 KB at 269.0 KB/sec)
[INFO] Downloaded: https://repo.maven.apache.org/maven2/org/codehaus/gmaven/runtime/gmaven-runtime-loader/1.5/gmaven-runtime-loader-1.5.jar
(25 KB at 471.6 KB/sec)
[INFO] Downloaded: https://repo.maven.apache.org/maven2/org/codehaus/gmaven/feature/gmaven-feature-api/1.5/gmaven-feature-api-1.5.jar
(17 KB at 303.5 KB/sec)
[INFO] Downloaded: https://repo.maven.apache.org/maven2/org/codehaus/gmaven/runtime/gmaven-runtime-support/1.5/gmaven-runtime-support-1.5.jar
(79 KB at 1220.7 KB/sec)
[INFO] Downloading: https://repo.maven.apache.org/maven2/org/codehaus/gmaven/runtime/gmaven-runtime-1.6/1.5/gmaven-runtime-1.6-1.5.pom
[INFO] Downloaded: https://repo.maven.apache.org/maven2/org/codehaus/gmaven/runtime/gmaven-runtime-1.6/1.5/gmaven-runtime-1.6-1.5.pom
(3 KB at 93.6 KB/sec)
[INFO] Downloading: https://repo.maven.apache.org/maven2/org/codehaus/gmaven/runtime/gmaven-runtime-1.6/1.5/gmaven-runtime-1.6-1.5.jar
[INFO] Downloaded: https://repo.maven.apache.org/maven2/org/codehaus/gmaven/runtime/gmaven-runtime-1.6/1.5/gmaven-runtime-1.6-1.5.jar
(42 KB at 1545.7 KB/sec)
[INFO] 
[INFO] --- maven-remote-resources-plugin:1.5:process (default) @ uimafit-parent ---
[INFO] 
[INFO] --- maven-antrun-plugin:1.7:run (dup-meta-jar-cleanup) @ uimafit-parent ---
[INFO] Executing tasks

main:
[INFO] Executed tasks
[INFO] 
[INFO] --- maven-site-plugin:3.3:attach-descriptor (attach-descriptor) @ uimafit-parent ---
[INFO] 
[INFO] >>> cobertura-maven-plugin:2.6:cobertura (default) > [cobertura]test @
uimafit-parent >>>
[INFO] 
[INFO] --- maven-enforcer-plugin:1.3.1:enforce (enforce-versions) @ uimafit-parent ---
[INFO] 
[INFO] --- build-helper-maven-plugin:1.8:parse-version (parse-project-version) @ uimafit-parent
---
[INFO] 
[INFO] --- uima-build-helper-maven-plugin:7:parse-date-time (set buildYear and buildMonth)
@ uimafit-parent ---
[INFO] 
[INFO] --- gmaven-plugin:1.5:execute (read-notice) @ uimafit-parent ---
[INFO] 
[INFO] --- maven-remote-resources-plugin:1.5:process (default) @ uimafit-parent ---
[INFO] 
[INFO] --- cobertura-maven-plugin:2.6:instrument (default) @ uimafit-parent ---
[INFO] Downloading: https://repo.maven.apache.org/maven2/net/sourceforge/cobertura/cobertura/2.0.3/cobertura-2.0.3.pom
[INFO] Downloaded: https://repo.maven.apache.org/maven2/net/sourceforge/cobertura/cobertura/2.0.3/cobertura-2.0.3.pom
(15 KB at 270.8 KB/sec)
[INFO] Downloading: https://repo.maven.apache.org/maven2/xerces/xmlParserAPIs/2.6.1/xmlParserAPIs-2.6.1.pom
[INFO] Downloaded: https://repo.maven.apache.org/maven2/xerces/xmlParserAPIs/2.6.1/xmlParserAPIs-2.6.1.pom
(153 B at 9.3 KB/sec)
[INFO] Downloading: https://repo.maven.apache.org/maven2/org/ccil/cowan/tagsoup/tagsoup/0.9.7/tagsoup-0.9.7.pom
[INFO] Downloaded: https://repo.maven.apache.org/maven2/org/ccil/cowan/tagsoup/tagsoup/0.9.7/tagsoup-0.9.7.pom
(681 B at 11.3 KB/sec)
[INFO] Downloading: https://repo.maven.apache.org/maven2/log4j/log4j/1.2.9/log4j-1.2.9.pom
[INFO] Downloaded: https://repo.maven.apache.org/maven2/log4j/log4j/1.2.9/log4j-1.2.9.pom
(144 B at 8.3 KB/sec)
[INFO] Downloading: https://repo.maven.apache.org/maven2/net/sourceforge/cobertura/cobertura-runtime/2.0.3/cobertura-runtime-2.0.3.pom
[INFO] Downloaded: https://repo.maven.apache.org/maven2/net/sourceforge/cobertura/cobertura-runtime/2.0.3/cobertura-runtime-2.0.3.pom
(4 KB at 148.9 KB/sec)
[INFO] Downloading: https://repo.maven.apache.org/maven2/net/sourceforge/cobertura/cobertura/2.0.3/cobertura-2.0.3.jar
[INFO] Downloading: https://repo.maven.apache.org/maven2/xom/xom/1.0b3/xom-1.0b3.jar
[INFO] Downloading: https://repo.maven.apache.org/maven2/org/ccil/cowan/tagsoup/tagsoup/0.9.7/tagsoup-0.9.7.jar
[INFO] Downloading: https://repo.maven.apache.org/maven2/log4j/log4j/1.2.9/log4j-1.2.9.jar
[INFO] Downloaded: https://repo.maven.apache.org/maven2/org/ccil/cowan/tagsoup/tagsoup/0.9.7/tagsoup-0.9.7.jar
(38 KB at 1092.2 KB/sec)
[INFO] Downloaded: https://repo.maven.apache.org/maven2/xom/xom/1.0b3/xom-1.0b3.jar (102 KB
at 2904.6 KB/sec)
[INFO] Downloaded: https://repo.maven.apache.org/maven2/log4j/log4j/1.2.9/log4j-1.2.9.jar
(345 KB at 5212.6 KB/sec)
[INFO] Downloaded: https://repo.maven.apache.org/maven2/net/sourceforge/cobertura/cobertura/2.0.3/cobertura-2.0.3.jar
(502 KB at 5456.0 KB/sec)
[INFO] Skipping cobertura mojo for project with packaging type 'pom'
[INFO] 
[INFO] <<< cobertura-maven-plugin:2.6:cobertura (default) < [cobertura]test @
uimafit-parent <<<
[INFO] 
[INFO] --- cobertura-maven-plugin:2.6:cobertura (default) @ uimafit-parent ---
[INFO] 
[INFO] --- maven-pmd-plugin:3.1:cpd (default) @ uimafit-parent ---
[DRY] No report found for mojo cpd
[INFO] 
[INFO] --- maven-pmd-plugin:3.1:pmd (default) @ uimafit-parent ---
[PMD] No report found for mojo pmd
[INFO] 
[INFO] --- maven-install-plugin:2.5.1:install (default-install) @ uimafit-parent ---
[INFO] Installing <https://builds.apache.org/job/UIMA-uimaFIT_java8/ws/trunk/uimafit-parent/pom.xml>
to /home/jenkins/jenkins-slave/maven-repositories/0/org/apache/uima/uimafit-parent/2.3.0-SNAPSHOT/uimafit-parent-2.3.0-SNAPSHOT.pom
[INFO] 
[INFO] >>> maven-dependency-plugin:2.8:analyze (default-cli) > test-compile @
uimafit-parent >>>
[INFO] 
[INFO] --- maven-enforcer-plugin:1.3.1:enforce (enforce-versions) @ uimafit-parent ---
[INFO] 
[INFO] --- build-helper-maven-plugin:1.8:parse-version (parse-project-version) @ uimafit-parent
---
[INFO] 
[INFO] --- uima-build-helper-maven-plugin:7:parse-date-time (set buildYear and buildMonth)
@ uimafit-parent ---
[INFO] 
[INFO] --- gmaven-plugin:1.5:execute (read-notice) @ uimafit-parent ---
[INFO] 
[INFO] --- maven-remote-resources-plugin:1.5:process (default) @ uimafit-parent ---
[WARNING] Failed to getClass for org.apache.maven.plugin.dependency.analyze.AnalyzeMojo
[INFO] 
[INFO] <<< maven-dependency-plugin:2.8:analyze (default-cli) < test-compile @
uimafit-parent <<<
[INFO] 
[INFO] --- maven-dependency-plugin:2.8:analyze (default-cli) @ uimafit-parent ---
[INFO] Skipping pom project
[INFO]                                                                         
[INFO] ------------------------------------------------------------------------
[INFO] Building Apache UIMA uimaFIT - Core 2.3.0-SNAPSHOT
[INFO] ------------------------------------------------------------------------
[INFO] Downloading: http://repository.apache.org/snapshots/org/apache/uima/jcasgen-maven-plugin/2.9.1-SNAPSHOT/maven-metadata.xml
[INFO] Downloaded: http://repository.apache.org/snapshots/org/apache/uima/jcasgen-maven-plugin/2.9.1-SNAPSHOT/maven-metadata.xml
(788 B at 2.1 KB/sec)
[INFO] Downloading: http://repository.apache.org/snapshots/org/apache/uima/jcasgen-maven-plugin/2.9.1-SNAPSHOT/jcasgen-maven-plugin-2.9.1-20161020.155844-14.pom
[INFO] Downloaded: http://repository.apache.org/snapshots/org/apache/uima/jcasgen-maven-plugin/2.9.1-SNAPSHOT/jcasgen-maven-plugin-2.9.1-20161020.155844-14.pom
(5 KB at 12.6 KB/sec)
[INFO] Downloading: http://repository.apache.org/snapshots/org/apache/uima/uimaj-parent/2.9.1-SNAPSHOT/maven-metadata.xml
[INFO] Downloaded: http://repository.apache.org/snapshots/org/apache/uima/uimaj-parent/2.9.1-SNAPSHOT/maven-metadata.xml
(606 B at 1.6 KB/sec)
[INFO] Downloading: http://repository.apache.org/snapshots/org/apache/uima/uimaj-parent/2.9.1-SNAPSHOT/uimaj-parent-2.9.1-20161020.160413-14.pom
[INFO] Downloaded: http://repository.apache.org/snapshots/org/apache/uima/uimaj-parent/2.9.1-SNAPSHOT/uimaj-parent-2.9.1-20161020.160413-14.pom
(15 KB at 41.1 KB/sec)
[INFO] Downloading: http://repository.apache.org/snapshots/org/apache/uima/jcasgen-maven-plugin/2.9.1-SNAPSHOT/jcasgen-maven-plugin-2.9.1-20161020.155844-14.jar
[INFO] Downloaded: http://repository.apache.org/snapshots/org/apache/uima/jcasgen-maven-plugin/2.9.1-SNAPSHOT/jcasgen-maven-plugin-2.9.1-20161020.155844-14.jar
(28 KB at 60.0 KB/sec)
[INFO] Downloading: http://repository.apache.org/snapshots/org/apache/uima/uimaj-core/2.9.1-SNAPSHOT/maven-metadata.xml
[INFO] Downloaded: http://repository.apache.org/snapshots/org/apache/uima/uimaj-core/2.9.1-SNAPSHOT/maven-metadata.xml
(778 B at 2.1 KB/sec)
[INFO] Downloading: http://repository.apache.org/snapshots/org/apache/uima/uimaj-core/2.9.1-SNAPSHOT/uimaj-core-2.9.1-20161020.160213-14.pom
[INFO] Downloaded: http://repository.apache.org/snapshots/org/apache/uima/uimaj-core/2.9.1-SNAPSHOT/uimaj-core-2.9.1-20161020.160213-14.pom
(8 KB at 22.0 KB/sec)
[INFO] Downloading: http://repository.apache.org/snapshots/org/apache/uima/uimaj-core/2.9.1-SNAPSHOT/uimaj-core-2.9.1-20161020.160213-14.jar
[INFO] Downloaded: http://repository.apache.org/snapshots/org/apache/uima/uimaj-core/2.9.1-SNAPSHOT/uimaj-core-2.9.1-20161020.160213-14.jar
(1552 KB at 1808.8 KB/sec)
[INFO] Downloading: http://repo1.maven.org/eclipse/log4j/log4j/1.2.15/log4j-1.2.15.jar
[INFO] Downloading: http://repo1.maven.org/maven2/log4j/log4j/1.2.15/log4j-1.2.15.jar
[INFO] Downloaded: http://repo1.maven.org/maven2/log4j/log4j/1.2.15/log4j-1.2.15.jar (383
KB at 7086.1 KB/sec)
[INFO] 
[INFO] --- maven-clean-plugin:2.5:clean (default-clean) @ uimafit-core ---
[TASKS] Scanning folder '<https://builds.apache.org/job/UIMA-uimaFIT_java8/ws/trunk/uimafit-core'>
for files matching the pattern '**/*.java' - excludes: 
[TASKS] Found 152 files to scan for tasks
Found 3 open tasks.
[TASKS] Computing warning deltas based on reference build #72
[INFO] 
[INFO] --- maven-enforcer-plugin:1.4.1:enforce (enforce-versions) @ uimafit-core ---
[INFO] 
[INFO] --- build-helper-maven-plugin:1.8:parse-version (parse-project-version) @ uimafit-core
---
[INFO] 
[INFO] --- uima-build-helper-maven-plugin:7:parse-date-time (set buildYear and buildMonth)
@ uimafit-core ---
[INFO] 
[INFO] --- gmaven-plugin:1.5:execute (read-notice) @ uimafit-core ---
[INFO] 
[INFO] --- maven-remote-resources-plugin:1.5:process (default) @ uimafit-core ---
[INFO] Downloading: http://repository.apache.org/snapshots/org/apache/uima/uimaj-parent/2.9.1-SNAPSHOT/maven-metadata.xml
[INFO] Downloaded: http://repository.apache.org/snapshots/org/apache/uima/uimaj-parent/2.9.1-SNAPSHOT/maven-metadata.xml
(606 B at 1.6 KB/sec)
[INFO] Downloading: http://repository.apache.org/snapshots/org/apache/uima/uimaj-parent/2.9.1-SNAPSHOT/uimaj-parent-2.9.1-20161020.160413-14.pom
[INFO] Downloaded: http://repository.apache.org/snapshots/org/apache/uima/uimaj-parent/2.9.1-SNAPSHOT/uimaj-parent-2.9.1-20161020.160413-14.pom
(0 B at 0.0 KB/sec)
[INFO] 
[INFO] --- maven-resources-plugin:2.6:resources (default-resources) @ uimafit-core ---
[INFO] Using 'UTF-8' encoding to copy filtered resources.
[INFO] Copying 1 resource
[INFO] Copying 3 resources
[INFO] 
[INFO] --- maven-compiler-plugin:3.5.1:compile (default-compile) @ uimafit-core ---
[INFO] Changes detected - recompiling the module!
[INFO] Compiling 87 source files to <https://builds.apache.org/job/UIMA-uimaFIT_java8/ws/trunk/uimafit-core/target/classes>
[INFO] <https://builds.apache.org/job/UIMA-uimaFIT_java8/ws/trunk/uimafit-core/src/main/java/org/apache/uima/fit/factory/JCasFactory.java>:
<https://builds.apache.org/job/UIMA-uimaFIT_java8/ws/trunk/uimafit-core/src/main/java/org/apache/uima/fit/factory/JCasFactory.java>
uses or overrides a deprecated API.
[INFO] <https://builds.apache.org/job/UIMA-uimaFIT_java8/ws/trunk/uimafit-core/src/main/java/org/apache/uima/fit/factory/JCasFactory.java>:
Recompile with -Xlint:deprecation for details.
[INFO] <https://builds.apache.org/job/UIMA-uimaFIT_java8/ws/trunk/uimafit-core/src/main/java/org/apache/uima/fit/factory/ExternalResourceFactory.java>:
Some input files use unchecked or unsafe operations.
[INFO] <https://builds.apache.org/job/UIMA-uimaFIT_java8/ws/trunk/uimafit-core/src/main/java/org/apache/uima/fit/factory/ExternalResourceFactory.java>:
Recompile with -Xlint:unchecked for details.
[INFO] Some messages have been simplified; recompile with -Xdiags:verbose to get full output
[INFO] -------------------------------------------------------------
[ERROR] COMPILATION ERROR : 
[INFO] -------------------------------------------------------------
[ERROR] <https://builds.apache.org/job/UIMA-uimaFIT_java8/ws/trunk/uimafit-core/src/main/java/org/apache/uima/fit/util/SimpleNamedResourceManager.java>:[116,73]
incompatible types: java.lang.Object cannot be converted to org.apache.uima.resource.Resource
[INFO] 1 error
[INFO] -------------------------------------------------------------
[INFO]                                                                         
[INFO] ------------------------------------------------------------------------
[INFO] Skipping Apache UIMA uimaFIT
[INFO] This project has been banned from the build due to previous failures.
[INFO] ------------------------------------------------------------------------
[INFO] ------------------------------------------------------------------------
[INFO] Reactor Summary:
[INFO] 
[INFO] Apache UIMA uimaFIT - Parent ....................... SUCCESS [ 38.599 s]
[INFO] Apache UIMA uimaFIT - Core ......................... FAILURE [ 14.652 s]
[INFO] Apache UIMA uimaFIT - Examples ..................... SKIPPED
[INFO] Apache UIMA uimaFIT - Spring integration ........... SKIPPED
[INFO] Apache UIMA uimaFIT - Maven Plugin ................. SKIPPED
[INFO] Apache UIMA uimaFIT - Legacy uimaFIT support ....... SKIPPED
[INFO] Apache UIMA uimaFIT - Documentation ................ SKIPPED
[INFO] Apache UIMA uimaFIT - Collection Processing Engine support SKIPPED
[INFO] Apache UIMA uimaFIT ................................ SKIPPED
[INFO] ------------------------------------------------------------------------
[INFO] BUILD FAILURE
[INFO] ------------------------------------------------------------------------
[INFO] Total time: 01:05 min
[INFO] Finished at: 2016-10-20T16:06:33+00:00
[INFO] Final Memory: 55M/469M
[INFO] ------------------------------------------------------------------------
Waiting for Jenkins to finish collecting data
[ERROR] Failed to execute goal org.apache.maven.plugins:maven-compiler-plugin:3.5.1:compile
(default-compile) on project uimafit-core: Compilation failure
[ERROR] <https://builds.apache.org/job/UIMA-uimaFIT_java8/ws/trunk/uimafit-core/src/main/java/org/apache/uima/fit/util/SimpleNamedResourceManager.java>:[116,73]
incompatible types: java.lang.Object cannot be converted to org.apache.uima.resource.Resource
[ERROR] -> [Help 1]
[ERROR] 
[ERROR] To see the full stack trace of the errors, re-run Maven with the -e switch.
[ERROR] Re-run Maven using the -X switch to enable full debug logging.
[ERROR] 
[ERROR] For more information about the errors and possible solutions, please read the following
articles:
[ERROR] [Help 1] http://cwiki.apache.org/confluence/display/MAVEN/MojoFailureException
[ERROR] 
[ERROR] After correcting the problems, you can resume the build with the command
[ERROR]   mvn <goals> -rf :uimafit-core
[JENKINS] Archiving <https://builds.apache.org/job/UIMA-uimaFIT_java8/ws/trunk/uimafit-core/pom.xml>
to org.apache.uima/uimafit-core/2.3.0-SNAPSHOT/uimafit-core-2.3.0-SNAPSHOT.pom
[JENKINS] Archiving <https://builds.apache.org/job/UIMA-uimaFIT_java8/ws/trunk/uimafit-docbook/pom.xml>
to org.apache.uima/uimafit-docbook/2.3.0-SNAPSHOT/uimafit-docbook-2.3.0-SNAPSHOT.pom
[JENKINS] Archiving <https://builds.apache.org/job/UIMA-uimaFIT_java8/ws/trunk/pom.xml>
to org.apache.uima/uimafit/2.3.0-SNAPSHOT/uimafit-2.3.0-SNAPSHOT.pom
[JENKINS] Archiving <https://builds.apache.org/job/UIMA-uimaFIT_java8/ws/trunk/uimafit-cpe/pom.xml>
to org.apache.uima/uimafit-cpe/2.3.0-SNAPSHOT/uimafit-cpe-2.3.0-SNAPSHOT.pom
[JENKINS] Archiving <https://builds.apache.org/job/UIMA-uimaFIT_java8/ws/trunk/uimafit-maven-plugin/pom.xml>
to org.apache.uima/uimafit-maven-plugin/2.3.0-SNAPSHOT/uimafit-maven-plugin-2.3.0-SNAPSHOT.pom
[JENKINS] Archiving <https://builds.apache.org/job/UIMA-uimaFIT_java8/ws/trunk/uimafit-legacy-support/pom.xml>
to org.apache.uima/uimafit-legacy-support/2.3.0-SNAPSHOT/uimafit-legacy-support-2.3.0-SNAPSHOT.pom
[JENKINS] Archiving <https://builds.apache.org/job/UIMA-uimaFIT_java8/ws/trunk/uimafit-parent/pom.xml>
to org.apache.uima/uimafit-parent/2.3.0-SNAPSHOT/uimafit-parent-2.3.0-SNAPSHOT.pom
[JENKINS] Archiving <https://builds.apache.org/job/UIMA-uimaFIT_java8/ws/trunk/uimafit-examples/pom.xml>
to org.apache.uima/uimafit-examples/2.3.0-SNAPSHOT/uimafit-examples-2.3.0-SNAPSHOT.pom
[JENKINS] Archiving <https://builds.apache.org/job/UIMA-uimaFIT_java8/ws/trunk/uimafit-spring/pom.xml>
to org.apache.uima/uimafit-spring/2.3.0-SNAPSHOT/uimafit-spring-2.3.0-SNAPSHOT.pom
Sending e-mails to: dev@uima.apache.org
channel stopped
[WARNINGS] Skipping publisher since build result is FAILURE
Skipping Cobertura coverage report as build was not UNSTABLE or better ...

Mime
View raw message