uima-dev mailing list archives

Site index · List index
Message view « Date » · « Thread »
Top « Date » · « Thread »
From Apache Jenkins Server <jenk...@builds.apache.org>
Subject Build failed in Jenkins: UIMA-uimaFIT #257
Date Fri, 21 Oct 2016 18:37:00 GMT
See <https://builds.apache.org/job/UIMA-uimaFIT/257/>

------------------------------------------
[...truncated 496 lines...]
AU        uimafit-core/src/main/java/org/apache/uima/fit/component/ViewTextCopierAnnotator.java
AU        uimafit-core/src/main/java/org/apache/uima/fit/component/CasAnnotator_ImplBase.java
AU        uimafit-core/src/main/java/org/apache/uima/fit/component/JCasConsumer_ImplBase.java
A         uimafit-core/src/main/java/org/apache/uima/fit/pipeline
AU        uimafit-core/src/main/java/org/apache/uima/fit/pipeline/JCasIterable.java
AU        uimafit-core/src/main/java/org/apache/uima/fit/pipeline/JCasIterator.java
AU        uimafit-core/src/main/java/org/apache/uima/fit/pipeline/SimplePipeline.java
AU        uimafit-core/src/main/java/org/apache/uima/fit/pipeline/package-info.java
A         uimafit-core/src/main/java/org/apache/uima/fit/factory
AU        uimafit-core/src/main/java/org/apache/uima/fit/factory/JCasBuilder.java
AU        uimafit-core/src/main/java/org/apache/uima/fit/factory/UimaContextFactory.java
AU        uimafit-core/src/main/java/org/apache/uima/fit/factory/FsIndexFactory.java
AU        uimafit-core/src/main/java/org/apache/uima/fit/factory/SofaMappingFactory.java
AU        uimafit-core/src/main/java/org/apache/uima/fit/factory/AggregateBuilder.java
AU        uimafit-core/src/main/java/org/apache/uima/fit/factory/ResourceCreationSpecifierFactory.java
A         uimafit-core/src/main/java/org/apache/uima/fit/factory/initializable
AU        uimafit-core/src/main/java/org/apache/uima/fit/factory/initializable/InitializableFactory.java
AU        uimafit-core/src/main/java/org/apache/uima/fit/factory/initializable/Initializable.java
AU        uimafit-core/src/main/java/org/apache/uima/fit/factory/ConfigurationParameterFactory.java
AU        uimafit-core/src/main/java/org/apache/uima/fit/factory/AnalysisEngineFactory.java
AU        uimafit-core/src/main/java/org/apache/uima/fit/factory/AnnotationFactory.java
AU        uimafit-core/src/main/java/org/apache/uima/fit/factory/FlowControllerFactory.java
AU        uimafit-core/src/main/java/org/apache/uima/fit/factory/CollectionReaderFactory.java
AU        uimafit-core/src/main/java/org/apache/uima/fit/factory/JCasFactory.java
AU        uimafit-core/src/main/java/org/apache/uima/fit/factory/CapabilityFactory.java
AU        uimafit-core/src/main/java/org/apache/uima/fit/factory/ResourceMetaDataFactory.java
AU        uimafit-core/src/main/java/org/apache/uima/fit/factory/TypeSystemDescriptionFactory.java
AU        uimafit-core/src/main/java/org/apache/uima/fit/factory/ExternalResourceFactory.java
AU        uimafit-core/src/main/java/org/apache/uima/fit/factory/TypePrioritiesFactory.java
A         uimafit-core/src/main/java/org/apache/uima/fit/factory/locator
AU        uimafit-core/src/main/java/org/apache/uima/fit/factory/locator/JndiResourceLocator.java
AU        uimafit-core/src/main/java/org/apache/uima/fit/factory/package-info.java
A         uimafit-core/src/test
A         uimafit-core/src/test/resources
A         uimafit-core/src/test/resources/META-INF
A         uimafit-core/src/test/resources/META-INF/org.apache.uima.fit
AU        uimafit-core/src/test/resources/META-INF/org.apache.uima.fit/fsindexes.txt
AU        uimafit-core/src/test/resources/META-INF/org.apache.uima.fit/typepriorities.txt
AU        uimafit-core/src/test/resources/META-INF/org.apache.uima.fit/types.txt
A         uimafit-core/src/test/resources/org
A         uimafit-core/src/test/resources/org/apache
A         uimafit-core/src/test/resources/org/apache/uima
A         uimafit-core/src/test/resources/org/apache/uima/fit
A         uimafit-core/src/test/resources/org/apache/uima/fit/factory
A         uimafit-core/src/test/resources/org/apache/uima/fit/factory/testCrs
AU        uimafit-core/src/test/resources/org/apache/uima/fit/factory/testCrs/SingleFileXReader.xml
A         uimafit-core/src/test/resources/org/apache/uima/fit/index
AU        uimafit-core/src/test/resources/org/apache/uima/fit/index/AutoImportableIndex.xml
A         uimafit-core/src/test/resources/org/apache/uima/fit/typepriorities
AU        uimafit-core/src/test/resources/org/apache/uima/fit/typepriorities/AutoImportableTypePriorities.xml
A         uimafit-core/src/test/resources/org/apache/uima/fit/type
AU        uimafit-core/src/test/resources/org/apache/uima/fit/type/AnalyzedText.xml
AU        uimafit-core/src/test/resources/org/apache/uima/fit/type/Token.xml
AU        uimafit-core/src/test/resources/org/apache/uima/fit/type/Sentence.xml
A         uimafit-core/src/test/resources/data
A         uimafit-core/src/test/resources/data/descriptor
AU        uimafit-core/src/test/resources/data/descriptor/DefaultValueAE1.xml
AU        uimafit-core/src/test/resources/data/descriptor/DefaultValueAE2.xml
AU        uimafit-core/src/test/resources/data/descriptor/README
A         uimafit-core/src/test/resources/data/reference
A         uimafit-core/src/test/resources/data/reference/JCasBuilderTest.dump
A         uimafit-core/src/test/resources/data/reference/test.xmi.dump
AU        uimafit-core/src/test/resources/data/reference/SerializationTestAnnotator.xml
A         uimafit-core/src/test/resources/data/docs
A         uimafit-core/src/test/resources/data/docs/unix-newlines.txt.bin
A         uimafit-core/src/test/resources/data/docs/test.xmi
A         uimafit-core/src/test/resources/data/docs/test.xcas
A         uimafit-core/src/test/resources/data/docs/windows-newlines.txt.bin
A         uimafit-core/src/test/resources/data/docs/bad.xcas
AU        uimafit-core/src/test/resources/log4j.properties
A         uimafit-core/src/test/java
AU        uimafit-core/src/test/java/DefaultPackageAE.java
AU        uimafit-core/src/test/java/DefaultPackageAETest.java
A         uimafit-core/src/test/java/org
A         uimafit-core/src/test/java/org/apache
A         uimafit-core/src/test/java/org/apache/uima
A         uimafit-core/src/test/java/org/apache/uima/fit
A         uimafit-core/src/test/java/org/apache/uima/fit/factory
AU        uimafit-core/src/test/java/org/apache/uima/fit/factory/AnalysisEngineFactoryTest.java
AU        uimafit-core/src/test/java/org/apache/uima/fit/factory/AnnotationFactoryTest.java
AU        uimafit-core/src/test/java/org/apache/uima/fit/factory/FlowControllerFactoryTest.java
AU        uimafit-core/src/test/java/org/apache/uima/fit/factory/AggregateWithReaderTest.java
AU        uimafit-core/src/test/java/org/apache/uima/fit/factory/CollectionReaderFactoryTest.java
A         uimafit-core/src/test/java/org/apache/uima/fit/factory/testCrs
AU        uimafit-core/src/test/java/org/apache/uima/fit/factory/testCrs/SingleFileXReader.java
AU        uimafit-core/src/test/java/org/apache/uima/fit/factory/testCrs/SingleFileXReaderTest.java
AU        uimafit-core/src/test/java/org/apache/uima/fit/factory/JCasFactoryTest.java
A         uimafit-core/src/test/java/org/apache/uima/fit/factory/testRes
AU        uimafit-core/src/test/java/org/apache/uima/fit/factory/testRes/TestExternalResource.java
AU        uimafit-core/src/test/java/org/apache/uima/fit/factory/testRes/TestSharedResourceObject.java
AU        uimafit-core/src/test/java/org/apache/uima/fit/factory/AnalysisEngineFactoryExternalResourceTest.java
AU        uimafit-core/src/test/java/org/apache/uima/fit/factory/ExternalResourceConfiguratorTest.java
AU        uimafit-core/src/test/java/org/apache/uima/fit/factory/FlowControllerFactoryExternalResourceTest.java
AU        uimafit-core/src/test/java/org/apache/uima/fit/factory/ResourceMetaDataFactoryTest.java
AU        uimafit-core/src/test/java/org/apache/uima/fit/factory/CollectionReaderFactoryExternalResourceTest.java
AU        uimafit-core/src/test/java/org/apache/uima/fit/factory/TypeSystemDescriptionFactoryTest.java
AU        uimafit-core/src/test/java/org/apache/uima/fit/factory/ExternalResourceFactoryTest.java
AU        uimafit-core/src/test/java/org/apache/uima/fit/factory/TypePrioritiesFactoryTest.java
AU        uimafit-core/src/test/java/org/apache/uima/fit/factory/LoggingTest.java
AU        uimafit-core/src/test/java/org/apache/uima/fit/factory/JCasBuilderTest.java
A         uimafit-core/src/test/java/org/apache/uima/fit/factory/testAes
AU        uimafit-core/src/test/java/org/apache/uima/fit/factory/testAes/SerializationTestAnnotator.java
AU        uimafit-core/src/test/java/org/apache/uima/fit/factory/testAes/ParameterizedAE2.java
AU        uimafit-core/src/test/java/org/apache/uima/fit/factory/testAes/Annotator1.java
AU        uimafit-core/src/test/java/org/apache/uima/fit/factory/testAes/ReversableTestFlowController.java
AU        uimafit-core/src/test/java/org/apache/uima/fit/factory/testAes/Annotator2.java
AU        uimafit-core/src/test/java/org/apache/uima/fit/factory/testAes/Annotator3.java
AU        uimafit-core/src/test/java/org/apache/uima/fit/factory/testAes/Annotator4.java
AU        uimafit-core/src/test/java/org/apache/uima/fit/factory/testAes/FlowAE1.java
AU        uimafit-core/src/test/java/org/apache/uima/fit/factory/testAes/ViewNames.java
AU        uimafit-core/src/test/java/org/apache/uima/fit/factory/testAes/FlowAE2.java
AU        uimafit-core/src/test/java/org/apache/uima/fit/factory/testAes/FlowAE3.java
AU        uimafit-core/src/test/java/org/apache/uima/fit/factory/testAes/ParameterizedAE.java
AU        uimafit-core/src/test/java/org/apache/uima/fit/factory/UimaContextFactoryTest.java
AU        uimafit-core/src/test/java/org/apache/uima/fit/factory/FsIndexFactoryTest.java
AU        uimafit-core/src/test/java/org/apache/uima/fit/factory/SofaMappingFactoryTest.java
AU        uimafit-core/src/test/java/org/apache/uima/fit/factory/AggregateBuilderTest.java
AU        uimafit-core/src/test/java/org/apache/uima/fit/factory/ResourceCreationSpecifierFactoryTest.java
AU        uimafit-core/src/test/java/org/apache/uima/fit/factory/ConfigurationParameterFactoryTest.java
A         uimafit-core/src/test/java/org/apache/uima/fit/factory/initializable
AU        uimafit-core/src/test/java/org/apache/uima/fit/factory/initializable/InitializableFactoryTest.java
A         uimafit-core/src/test/java/org/apache/uima/fit/data
AU        uimafit-core/src/test/java/org/apache/uima/fit/data/CreateSampleXMIFile.java
AU        uimafit-core/src/test/java/org/apache/uima/fit/data/CreateSampleXCASFile.java
AU        uimafit-core/src/test/java/org/apache/uima/fit/ComponentTestBase.java
A         uimafit-core/src/test/java/org/apache/uima/fit/testing
A         uimafit-core/src/test/java/org/apache/uima/fit/testing/factory
AU        uimafit-core/src/test/java/org/apache/uima/fit/testing/factory/TokenBuilderTest.java
A         uimafit-core/src/test/java/org/apache/uima/fit/util
AU        uimafit-core/src/test/java/org/apache/uima/fit/util/FSUtilTest.java
AU        uimafit-core/src/test/java/org/apache/uima/fit/util/ContainmentIndexTest.java
AU        uimafit-core/src/test/java/org/apache/uima/fit/util/JCasIterableTest.java
AU        uimafit-core/src/test/java/org/apache/uima/fit/util/DisableLoggingTest.java
AU        uimafit-core/src/test/java/org/apache/uima/fit/util/HideOutputTest.java
AU        uimafit-core/src/test/java/org/apache/uima/fit/util/FSCollectionFactoryTest.java
AU        uimafit-core/src/test/java/org/apache/uima/fit/util/LocaleUtilTest.java
AU        uimafit-core/src/test/java/org/apache/uima/fit/util/JCasUtilTest.java
AU        uimafit-core/src/test/java/org/apache/uima/fit/util/SimplePipelineTest.java
AU        uimafit-core/src/test/java/org/apache/uima/fit/util/CasUtilTest.java
AU        uimafit-core/src/test/java/org/apache/uima/fit/util/TypeSystemUtil.java
A         uimafit-core/src/test/java/org/apache/uima/fit/descriptor
AU        uimafit-core/src/test/java/org/apache/uima/fit/descriptor/TypeCapabilityTest.java
A         uimafit-core/src/test/java/org/apache/uima/fit/component
AU        uimafit-core/src/test/java/org/apache/uima/fit/component/ViewTextCopierAnnotatorTest.java
AU        uimafit-core/src/test/java/org/apache/uima/fit/component/CasDumpWriterTest.java
AU        uimafit-core/src/test/java/org/apache/uima/fit/component/JCasCollectionReader_ImplBaseTest.java
AU        uimafit-core/src/test/java/org/apache/uima/fit/component/CasMultiplierTest.java
AU        uimafit-core/src/test/java/org/apache/uima/fit/component/ViewCreatorAnnotatorTest.java
A         uimafit-core/src/test/java/org/apache/uima/fit/component/initialize
AU        uimafit-core/src/test/java/org/apache/uima/fit/component/initialize/ConfigurationParameterInitializerTest.java
A         uimafit-core/src/test/java/org/apache/uima/fit/pipeline
AU        uimafit-core/src/test/java/org/apache/uima/fit/pipeline/SimplePipelineTest.java
AU        uimafit-core/src/test/java/org/apache/uima/fit/pipeline/JCasIterableTest.java
A         uimafit-parent
AU        uimafit-parent/pom.xml
A         src
A         src/main
A         src/main/dist-bin
AU        src/main/dist-bin/NOTICE
AU        src/main/dist-bin/LICENSE
A         src/main/assembly
AU        src/main/assembly/bin.xml
A         .gitattributes
 U        .
At revision 1766098

No changes for https://svn.apache.org/repos/asf/uima/uimafit/trunk since the previous build
Parsing POMs
using settings config with name simple-deploy-settings-no-mirror
Replacing all maven server entries not found in credentials list is true
Established TCP socket on 39516
maven32-agent.jar already up to date
maven32-interceptor.jar already up to date
maven3-interceptor-commons.jar already up to date
[trunk] $ /home/jenkins/tools/java/latest1.7/bin/java -Xmx800m -XX:MaxPermSize=256m -cp /home/jenkins/jenkins-slave/maven32-agent.jar:/home/jenkins/tools/maven/latest3/boot/plexus-classworlds-2.5.2.jar:/home/jenkins/tools/maven/latest3/conf/logging
jenkins.maven3.agent.Maven32Main /home/jenkins/tools/maven/latest3/ /home/jenkins/jenkins-slave/slave.jar
/home/jenkins/jenkins-slave/maven32-interceptor.jar /home/jenkins/jenkins-slave/maven3-interceptor-commons.jar
39516
<===[JENKINS REMOTING CAPACITY]===>   channel started
using settings config with name simple-deploy-settings-no-mirror
Replacing all maven server entries not found in credentials list is true
Executing Maven:  -B -f <https://builds.apache.org/job/UIMA-uimaFIT/ws/trunk/pom.xml>
-Dmaven.repo.local=/home/jenkins/jenkins-slave/maven-repositories/0 -s /tmp/settings3732483903228023838.xml
-U -Djava.awt.headless=true -Ppmd,jacoco,findbugs clean install dependency:analyze javadoc:aggregate
[INFO] Scanning for projects...
[INFO] ------------------------------------------------------------------------
[INFO] Reactor Build Order:
[INFO] 
[INFO] Apache UIMA uimaFIT - Parent
[INFO] Apache UIMA uimaFIT - Core
[INFO] Apache UIMA uimaFIT - Examples
[INFO] Apache UIMA uimaFIT - Spring integration
[INFO] Apache UIMA uimaFIT - Maven Plugin
[INFO] Apache UIMA uimaFIT - Legacy uimaFIT support
[INFO] Apache UIMA uimaFIT - Documentation
[INFO] Apache UIMA uimaFIT - Collection Processing Engine support
[INFO] Apache UIMA uimaFIT
[INFO] Downloading: https://repo.maven.apache.org/maven2/org/codehaus/gmaven/gmaven-plugin/1.5/gmaven-plugin-1.5.pom
[WARNING] Failed to retrieve plugin descriptor for org.codehaus.gmaven:gmaven-plugin:1.5:
Plugin org.codehaus.gmaven:gmaven-plugin:1.5 or one of its dependencies could not be resolved:
Failed to read artifact descriptor for org.codehaus.gmaven:gmaven-plugin:jar:1.5
[INFO] Downloading: https://repo.maven.apache.org/maven2/org/apache/maven/plugins/maven-pmd-plugin/3.1/maven-pmd-plugin-3.1.pom
[WARNING] Failed to retrieve plugin descriptor for org.apache.maven.plugins:maven-pmd-plugin:3.1:
Plugin org.apache.maven.plugins:maven-pmd-plugin:3.1 or one of its dependencies could not
be resolved: Failed to read artifact descriptor for org.apache.maven.plugins:maven-pmd-plugin:jar:3.1
[WARNING] Failed to retrieve plugin descriptor for org.codehaus.gmaven:gmaven-plugin:1.5:
Plugin org.codehaus.gmaven:gmaven-plugin:1.5 or one of its dependencies could not be resolved:
Failed to read artifact descriptor for org.codehaus.gmaven:gmaven-plugin:jar:1.5
[WARNING] Failed to retrieve plugin descriptor for org.apache.maven.plugins:maven-pmd-plugin:3.1:
Plugin org.apache.maven.plugins:maven-pmd-plugin:3.1 or one of its dependencies could not
be resolved: Failed to read artifact descriptor for org.apache.maven.plugins:maven-pmd-plugin:jar:3.1
[INFO]                                                                         
[INFO] ------------------------------------------------------------------------
[INFO] Building Apache UIMA uimaFIT - Parent 2.3.0-SNAPSHOT
[INFO] ------------------------------------------------------------------------
[WARNING] Failed to retrieve plugin descriptor for org.codehaus.gmaven:gmaven-plugin:1.5:
Plugin org.codehaus.gmaven:gmaven-plugin:1.5 or one of its dependencies could not be resolved:
Failed to read artifact descriptor for org.codehaus.gmaven:gmaven-plugin:jar:1.5
[WARNING] Failed to retrieve plugin descriptor for org.apache.maven.plugins:maven-pmd-plugin:3.1:
Plugin org.apache.maven.plugins:maven-pmd-plugin:3.1 or one of its dependencies could not
be resolved: Failed to read artifact descriptor for org.apache.maven.plugins:maven-pmd-plugin:jar:3.1
[INFO]                                                                         
[INFO] ------------------------------------------------------------------------
[INFO] Skipping Apache UIMA uimaFIT
[INFO] This project has been banned from the build due to previous failures.
[INFO] ------------------------------------------------------------------------
[INFO] ------------------------------------------------------------------------
[INFO] Reactor Summary:
[INFO] 
[INFO] Apache UIMA uimaFIT - Parent ....................... FAILURE [  0.951 s]
[INFO] Apache UIMA uimaFIT - Core ......................... SKIPPED
[INFO] Apache UIMA uimaFIT - Examples ..................... SKIPPED
[INFO] Apache UIMA uimaFIT - Spring integration ........... SKIPPED
[INFO] Apache UIMA uimaFIT - Maven Plugin ................. SKIPPED
[INFO] Apache UIMA uimaFIT - Legacy uimaFIT support ....... SKIPPED
[INFO] Apache UIMA uimaFIT - Documentation ................ SKIPPED
[INFO] Apache UIMA uimaFIT - Collection Processing Engine support SKIPPED
[INFO] Apache UIMA uimaFIT ................................ SKIPPED
[INFO] ------------------------------------------------------------------------
[INFO] BUILD FAILURE
[INFO] ------------------------------------------------------------------------
[INFO] Total time: 32.297 s
[INFO] Finished at: 2016-10-21T18:36:58+00:00
[INFO] Final Memory: 18M/303M
[INFO] ------------------------------------------------------------------------
[WARNING] The requested profile "jacoco" could not be activated because it does not exist.
[ERROR] Plugin org.codehaus.gmaven:gmaven-plugin:1.5 or one of its dependencies could not
be resolved: Failed to read artifact descriptor for org.codehaus.gmaven:gmaven-plugin:jar:1.5:
Failure to transfer org.codehaus.gmaven:gmaven-plugin:pom:1.5 from https://repo.maven.apache.org/maven2
was cached in the local repository, resolution will not be reattempted until the update interval
of central has elapsed or updates are forced. Original error: Could not transfer artifact
org.codehaus.gmaven:gmaven-plugin:pom:1.5 from/to central (https://repo.maven.apache.org/maven2):
repo.maven.apache.org: Name or service not known -> [Help 1]
[ERROR] 
[ERROR] To see the full stack trace of the errors, re-run Maven with the -e switch.
[ERROR] Re-run Maven using the -X switch to enable full debug logging.
[ERROR] 
[ERROR] For more information about the errors and possible solutions, please read the following
articles:
[ERROR] [Help 1] http://cwiki.apache.org/confluence/display/MAVEN/PluginResolutionException
[JENKINS] Archiving <https://builds.apache.org/job/UIMA-uimaFIT/ws/trunk/uimafit-core/pom.xml>
to org.apache.uima/uimafit-core/2.3.0-SNAPSHOT/uimafit-core-2.3.0-SNAPSHOT.pom
[JENKINS] Archiving <https://builds.apache.org/job/UIMA-uimaFIT/ws/trunk/uimafit-docbook/pom.xml>
to org.apache.uima/uimafit-docbook/2.3.0-SNAPSHOT/uimafit-docbook-2.3.0-SNAPSHOT.pom
[JENKINS] Archiving <https://builds.apache.org/job/UIMA-uimaFIT/ws/trunk/pom.xml> to
org.apache.uima/uimafit/2.3.0-SNAPSHOT/uimafit-2.3.0-SNAPSHOT.pom
[JENKINS] Archiving <https://builds.apache.org/job/UIMA-uimaFIT/ws/trunk/uimafit-cpe/pom.xml>
to org.apache.uima/uimafit-cpe/2.3.0-SNAPSHOT/uimafit-cpe-2.3.0-SNAPSHOT.pom
[JENKINS] Archiving <https://builds.apache.org/job/UIMA-uimaFIT/ws/trunk/uimafit-maven-plugin/pom.xml>
to org.apache.uima/uimafit-maven-plugin/2.3.0-SNAPSHOT/uimafit-maven-plugin-2.3.0-SNAPSHOT.pom
[JENKINS] Archiving <https://builds.apache.org/job/UIMA-uimaFIT/ws/trunk/uimafit-legacy-support/pom.xml>
to org.apache.uima/uimafit-legacy-support/2.3.0-SNAPSHOT/uimafit-legacy-support-2.3.0-SNAPSHOT.pom
[JENKINS] Archiving <https://builds.apache.org/job/UIMA-uimaFIT/ws/trunk/uimafit-parent/pom.xml>
to org.apache.uima/uimafit-parent/2.3.0-SNAPSHOT/uimafit-parent-2.3.0-SNAPSHOT.pom
[JENKINS] Archiving <https://builds.apache.org/job/UIMA-uimaFIT/ws/trunk/uimafit-examples/pom.xml>
to org.apache.uima/uimafit-examples/2.3.0-SNAPSHOT/uimafit-examples-2.3.0-SNAPSHOT.pom
[JENKINS] Archiving <https://builds.apache.org/job/UIMA-uimaFIT/ws/trunk/uimafit-spring/pom.xml>
to org.apache.uima/uimafit-spring/2.3.0-SNAPSHOT/uimafit-spring-2.3.0-SNAPSHOT.pom
Sending e-mails to: dev@uima.apache.org
channel stopped
[WARNINGS] Skipping publisher since build result is FAILURE
Archiving artifacts

Mime
View raw message