uima-dev mailing list archives

Site index · List index
Message view « Date » · « Thread »
Top « Date » · « Thread »
From Apache Jenkins Server <jenk...@builds.apache.org>
Subject Build failed in Jenkins: UIMA-uimaFIT_java8 #75
Date Fri, 21 Oct 2016 17:37:28 GMT
See <https://builds.apache.org/job/UIMA-uimaFIT_java8/75/>

------------------------------------------
[...truncated 3492 lines...]
org.apache.uima.resource.ResourceInitializationException: null
	at org.apache.uima.resource.impl.ResourceManager_impl$ResourceRegistration.<init>(ResourceManager_impl.java:91)
	at org.apache.uima.fit.spring.SpringContextResourceManager.initializeExternalResources(SpringContextResourceManager.java:60)
	at org.apache.uima.resource.Resource_ImplBase.initialize(Resource_ImplBase.java:193)
	at org.apache.uima.analysis_engine.impl.AnalysisEngineImplBase.initialize(AnalysisEngineImplBase.java:157)
	at org.apache.uima.analysis_engine.impl.PrimitiveAnalysisEngine_impl.initialize(PrimitiveAnalysisEngine_impl.java:131)
	at org.apache.uima.impl.AnalysisEngineFactory_impl.produceResource(AnalysisEngineFactory_impl.java:94)
	at org.apache.uima.fit.spring.factory.AnalysisEngineFactory_impl.produceResource(AnalysisEngineFactory_impl.java:47)
	at org.apache.uima.impl.CompositeResourceFactory_impl.produceResource(CompositeResourceFactory_impl.java:62)
	at org.apache.uima.UIMAFramework.produceResource(UIMAFramework.java:279)
	at org.apache.uima.UIMAFramework.produceResource(UIMAFramework.java:331)
	at org.apache.uima.UIMAFramework.produceAnalysisEngine(UIMAFramework.java:448)
	at org.apache.uima.fit.spring.SpringContextResourceManagerTest.test(SpringContextResourceManagerTest.java:63)


Results :

Tests in error: 
  SpringContextResourceManagerTest.test:63 ยป ResourceInitialization

Tests run: 2, Failures: 0, Errors: 1, Skipped: 0

[ERROR] There are test failures.

Please refer to <https://builds.apache.org/job/UIMA-uimaFIT_java8/ws/trunk/uimafit-spring/target/surefire-reports>
for the individual test results.
[JENKINS] Recording test results
[INFO] 
[INFO] <<< cobertura-maven-plugin:2.6:cobertura (default) < [cobertura]test @
uimafit-spring <<<
[INFO] 
[INFO] --- cobertura-maven-plugin:2.6:cobertura (default) @ uimafit-spring ---
[INFO] Cobertura 2.0.3 - GNU GPL License (NO WARRANTY) - See COPYRIGHT file
Report time: 266ms

[ERROR] Oct 21, 2016 5:35:28 PM net.sourceforge.cobertura.coveragedata.CoverageDataFileHandler
loadCoverageData
INFO: Cobertura: Loaded information on 7 classes.

[INFO] Cobertura Report generation was successful.
[INFO] 
[INFO] --- maven-pmd-plugin:3.1:cpd (default) @ uimafit-spring ---
[DRY] Finding all files that match the pattern cpd.xml
[DRY] Parsing 1 file in <https://builds.apache.org/job/UIMA-uimaFIT_java8/ws/trunk/uimafit-spring/target>
[DRY] Successfully parsed file <https://builds.apache.org/job/UIMA-uimaFIT_java8/ws/trunk/uimafit-spring/target/cpd.xml>
of module Apache UIMA uimaFIT - Spring integration with 0 unique warnings and 0 duplicates.
[DRY] Computing warning deltas based on reference build #74
[INFO] 
[INFO] --- maven-pmd-plugin:3.1:pmd (default) @ uimafit-spring ---
[PMD] Finding all files that match the pattern pmd.xml
[PMD] Parsing 1 file in <https://builds.apache.org/job/UIMA-uimaFIT_java8/ws/trunk/uimafit-spring/target>
[PMD] Successfully parsed file <https://builds.apache.org/job/UIMA-uimaFIT_java8/ws/trunk/uimafit-spring/target/pmd.xml>
of module Apache UIMA uimaFIT - Spring integration with 2 unique warnings and 0 duplicates.
[PMD] Computing warning deltas based on reference build #74
[INFO] 
[INFO] --- maven-enforcer-plugin:1.4.1:enforce (enforce-compatibility) @ uimafit-spring ---
[INFO] Version specified as <2.1.0>
[INFO] Downloading: http://repo1.maven.org/eclipse/org/apache/uima/uimafit-spring/2.1.0/uimafit-spring-2.1.0.jar
[INFO] Downloading: http://repo1.maven.org/maven2/org/apache/uima/uimafit-spring/2.1.0/uimafit-spring-2.1.0.jar
[WARNING] Exception while accessing artifacts; skipping check.
org.apache.maven.artifact.resolver.ArtifactResolutionException: Could not transfer artifact
org.apache.uima:uimafit-spring:jar:2.1.0 from/to eclipsePlugins (http://repo1.maven.org/eclipse):
repo1.maven.org: Name or service not known
  org.apache.uima:uimafit-spring:jar:2.1.0

from the specified remote repositories:
  eclipsePlugins (http://repo1.maven.org/eclipse, releases=true, snapshots=false),
  central (http://repo1.maven.org/maven2, releases=true, snapshots=false),
  apache.snapshots (http://repository.apache.org/snapshots, releases=false, snapshots=true)

	at org.apache.maven.artifact.resolver.DefaultArtifactResolver.resolve(DefaultArtifactResolver.java:225)
	at org.apache.maven.artifact.resolver.DefaultArtifactResolver.resolve(DefaultArtifactResolver.java:154)
	at org.apache.maven.artifact.resolver.DefaultArtifactResolver.resolve(DefaultArtifactResolver.java:555)
	at org.semver.enforcer.AbstractEnforcerRule.execute(AbstractEnforcerRule.java:134)
	at org.apache.maven.plugins.enforcer.EnforceMojo.execute(EnforceMojo.java:193)
	at org.apache.maven.plugin.DefaultBuildPluginManager.executeMojo(DefaultBuildPluginManager.java:134)
	at org.apache.maven.lifecycle.internal.MojoExecutor.execute(MojoExecutor.java:207)
	at org.apache.maven.lifecycle.internal.MojoExecutor.execute(MojoExecutor.java:153)
	at org.apache.maven.lifecycle.internal.MojoExecutor.execute(MojoExecutor.java:145)
	at org.apache.maven.lifecycle.internal.LifecycleModuleBuilder.buildProject(LifecycleModuleBuilder.java:116)
	at org.apache.maven.lifecycle.internal.LifecycleModuleBuilder.buildProject(LifecycleModuleBuilder.java:80)
	at org.apache.maven.lifecycle.internal.builder.singlethreaded.SingleThreadedBuilder.build(SingleThreadedBuilder.java:51)
	at org.apache.maven.lifecycle.internal.LifecycleStarter.execute(LifecycleStarter.java:128)
	at org.apache.maven.DefaultMaven.doExecute(DefaultMaven.java:307)
	at org.apache.maven.DefaultMaven.doExecute(DefaultMaven.java:193)
	at org.apache.maven.DefaultMaven.execute(DefaultMaven.java:106)
	at org.jvnet.hudson.maven3.launcher.Maven32Launcher.main(Maven32Launcher.java:132)
	at sun.reflect.NativeMethodAccessorImpl.invoke0(Native Method)
	at sun.reflect.NativeMethodAccessorImpl.invoke(NativeMethodAccessorImpl.java:62)
	at sun.reflect.DelegatingMethodAccessorImpl.invoke(DelegatingMethodAccessorImpl.java:43)
	at java.lang.reflect.Method.invoke(Method.java:498)
	at org.codehaus.plexus.classworlds.launcher.Launcher.launchStandard(Launcher.java:330)
	at org.codehaus.plexus.classworlds.launcher.Launcher.launch(Launcher.java:238)
	at jenkins.maven3.agent.Maven32Main.launch(Maven32Main.java:186)
	at sun.reflect.NativeMethodAccessorImpl.invoke0(Native Method)
	at sun.reflect.NativeMethodAccessorImpl.invoke(NativeMethodAccessorImpl.java:62)
	at sun.reflect.DelegatingMethodAccessorImpl.invoke(DelegatingMethodAccessorImpl.java:43)
	at java.lang.reflect.Method.invoke(Method.java:498)
	at hudson.maven.Maven3Builder.call(Maven3Builder.java:136)
	at hudson.maven.Maven3Builder.call(Maven3Builder.java:71)
	at hudson.remoting.UserRequest.perform(UserRequest.java:153)
	at hudson.remoting.UserRequest.perform(UserRequest.java:50)
	at hudson.remoting.Request$2.run(Request.java:332)
	at hudson.remoting.InterceptingExecutorService$1.call(InterceptingExecutorService.java:68)
	at java.util.concurrent.FutureTask.run(FutureTask.java:266)
	at java.util.concurrent.ThreadPoolExecutor.runWorker(ThreadPoolExecutor.java:1142)
	at java.util.concurrent.ThreadPoolExecutor$Worker.run(ThreadPoolExecutor.java:617)
	at java.lang.Thread.run(Thread.java:745)
Caused by: org.eclipse.aether.resolution.ArtifactResolutionException: Could not transfer artifact
org.apache.uima:uimafit-spring:jar:2.1.0 from/to eclipsePlugins (http://repo1.maven.org/eclipse):
repo1.maven.org: Name or service not known
	at org.eclipse.aether.internal.impl.DefaultArtifactResolver.resolve(DefaultArtifactResolver.java:444)
	at org.eclipse.aether.internal.impl.DefaultArtifactResolver.resolveArtifacts(DefaultArtifactResolver.java:246)
	at org.eclipse.aether.internal.impl.DefaultArtifactResolver.resolveArtifact(DefaultArtifactResolver.java:223)
	at org.eclipse.aether.internal.impl.DefaultRepositorySystem.resolveArtifact(DefaultRepositorySystem.java:294)
	at org.apache.maven.artifact.resolver.DefaultArtifactResolver.resolve(DefaultArtifactResolver.java:215)
	... 37 more
Caused by: org.eclipse.aether.transfer.ArtifactTransferException: Could not transfer artifact
org.apache.uima:uimafit-spring:jar:2.1.0 from/to eclipsePlugins (http://repo1.maven.org/eclipse):
repo1.maven.org: Name or service not known
	at org.eclipse.aether.connector.basic.ArtifactTransportListener.transferFailed(ArtifactTransportListener.java:43)
	at org.eclipse.aether.connector.basic.BasicRepositoryConnector$TaskRunner.run(BasicRepositoryConnector.java:355)
	at org.eclipse.aether.util.concurrency.RunnableErrorForwarder$1.run(RunnableErrorForwarder.java:67)
	at org.eclipse.aether.connector.basic.BasicRepositoryConnector$DirectExecutor.execute(BasicRepositoryConnector.java:581)
	at org.eclipse.aether.connector.basic.BasicRepositoryConnector.get(BasicRepositoryConnector.java:249)
	at org.eclipse.aether.internal.impl.DefaultArtifactResolver.performDownloads(DefaultArtifactResolver.java:520)
	at org.eclipse.aether.internal.impl.DefaultArtifactResolver.resolve(DefaultArtifactResolver.java:421)
	... 41 more
Caused by: org.apache.maven.wagon.TransferFailedException: repo1.maven.org: Name or service
not known
	at org.apache.maven.wagon.providers.http.AbstractHttpClientWagon.fillInputData(AbstractHttpClientWagon.java:1066)
	at org.apache.maven.wagon.providers.http.AbstractHttpClientWagon.fillInputData(AbstractHttpClientWagon.java:960)
	at org.apache.maven.wagon.StreamWagon.getInputStream(StreamWagon.java:116)
	at org.apache.maven.wagon.StreamWagon.getIfNewer(StreamWagon.java:88)
	at org.apache.maven.wagon.StreamWagon.get(StreamWagon.java:61)
	at org.eclipse.aether.transport.wagon.WagonTransporter$GetTaskRunner.run(WagonTransporter.java:560)
	at org.eclipse.aether.transport.wagon.WagonTransporter.execute(WagonTransporter.java:427)
	at org.eclipse.aether.transport.wagon.WagonTransporter.get(WagonTransporter.java:404)
	at org.eclipse.aether.connector.basic.BasicRepositoryConnector$GetTaskRunner.runTask(BasicRepositoryConnector.java:447)
	at org.eclipse.aether.connector.basic.BasicRepositoryConnector$TaskRunner.run(BasicRepositoryConnector.java:350)
	... 46 more
Caused by: java.net.UnknownHostException: repo1.maven.org: Name or service not known
	at java.net.Inet6AddressImpl.lookupAllHostAddr(Native Method)
	at java.net.InetAddress$2.lookupAllHostAddr(InetAddress.java:928)
	at java.net.InetAddress.getAddressesFromNameService(InetAddress.java:1323)
	at java.net.InetAddress.getAllByName0(InetAddress.java:1276)
	at java.net.InetAddress.getAllByName(InetAddress.java:1192)
	at java.net.InetAddress.getAllByName(InetAddress.java:1126)
	at org.apache.maven.wagon.providers.http.httpclient.impl.conn.SystemDefaultDnsResolver.resolve(SystemDefaultDnsResolver.java:44)
	at org.apache.maven.wagon.providers.http.httpclient.impl.conn.HttpClientConnectionOperator.connect(HttpClientConnectionOperator.java:101)
	at org.apache.maven.wagon.providers.http.httpclient.impl.conn.PoolingHttpClientConnectionManager.connect(PoolingHttpClientConnectionManager.java:318)
	at org.apache.maven.wagon.providers.http.httpclient.impl.execchain.MainClientExec.establishRoute(MainClientExec.java:363)
	at org.apache.maven.wagon.providers.http.httpclient.impl.execchain.MainClientExec.execute(MainClientExec.java:219)
	at org.apache.maven.wagon.providers.http.httpclient.impl.execchain.ProtocolExec.execute(ProtocolExec.java:195)
	at org.apache.maven.wagon.providers.http.httpclient.impl.execchain.RetryExec.execute(RetryExec.java:86)
	at org.apache.maven.wagon.providers.http.httpclient.impl.execchain.RedirectExec.execute(RedirectExec.java:108)
	at org.apache.maven.wagon.providers.http.httpclient.impl.client.InternalHttpClient.doExecute(InternalHttpClient.java:184)
	at org.apache.maven.wagon.providers.http.httpclient.impl.client.CloseableHttpClient.execute(CloseableHttpClient.java:82)
	at org.apache.maven.wagon.providers.http.AbstractHttpClientWagon.execute(AbstractHttpClientWagon.java:832)
	at org.apache.maven.wagon.providers.http.AbstractHttpClientWagon.fillInputData(AbstractHttpClientWagon.java:983)
	... 55 more
[INFO] 
[INFO] --- maven-install-plugin:2.5.1:install (default-install) @ uimafit-spring ---
[INFO] Installing <https://builds.apache.org/job/UIMA-uimaFIT_java8/ws/trunk/uimafit-spring/target/uimafit-spring-2.3.0-SNAPSHOT.jar>
to /home/jenkins/jenkins-slave/maven-repositories/0/org/apache/uima/uimafit-spring/2.3.0-SNAPSHOT/uimafit-spring-2.3.0-SNAPSHOT.jar
[INFO] Installing <https://builds.apache.org/job/UIMA-uimaFIT_java8/ws/trunk/uimafit-spring/pom.xml>
to /home/jenkins/jenkins-slave/maven-repositories/0/org/apache/uima/uimafit-spring/2.3.0-SNAPSHOT/uimafit-spring-2.3.0-SNAPSHOT.pom
[INFO] 
[INFO] >>> maven-dependency-plugin:2.8:analyze (default-cli) > test-compile @
uimafit-spring >>>
[INFO] 
[INFO] --- maven-enforcer-plugin:1.4.1:enforce (enforce-versions) @ uimafit-spring ---
[INFO] 
[INFO] --- build-helper-maven-plugin:1.8:parse-version (parse-project-version) @ uimafit-spring
---
[INFO] 
[INFO] --- uima-build-helper-maven-plugin:7:parse-date-time (set buildYear and buildMonth)
@ uimafit-spring ---
[INFO] 
[INFO] --- gmaven-plugin:1.5:execute (read-notice) @ uimafit-spring ---
[INFO] 
[INFO] --- maven-remote-resources-plugin:1.5:process (default) @ uimafit-spring ---
[INFO] 
[INFO] --- maven-resources-plugin:2.6:resources (default-resources) @ uimafit-spring ---
[INFO] Using 'UTF-8' encoding to copy filtered resources.
[INFO] Copying 0 resource
[INFO] Copying 3 resources
[INFO] Copying 3 resources
[INFO] 
[INFO] --- maven-compiler-plugin:3.5.1:compile (default-compile) @ uimafit-spring ---
[INFO] Nothing to compile - all classes are up to date
[INFO] 
[INFO] --- maven-resources-plugin:2.6:testResources (default-testResources) @ uimafit-spring
---
[INFO] Using 'UTF-8' encoding to copy filtered resources.
[INFO] Copying 0 resource
[INFO] Copying 3 resources
[INFO] Copying 3 resources
[INFO] 
[INFO] --- maven-compiler-plugin:3.5.1:testCompile (default-testCompile) @ uimafit-spring
---
[INFO] Nothing to compile - all classes are up to date
[WARNING] Failed to getClass for org.apache.maven.plugin.dependency.analyze.AnalyzeMojo
[INFO] 
[INFO] <<< maven-dependency-plugin:2.8:analyze (default-cli) < test-compile @
uimafit-spring <<<
[INFO] 
[INFO] --- maven-dependency-plugin:2.8:analyze (default-cli) @ uimafit-spring ---
[INFO] No dependency problems found
[INFO]                                                                         
[INFO] ------------------------------------------------------------------------
[INFO] Building Apache UIMA uimaFIT - Maven Plugin 2.3.0-SNAPSHOT
[INFO] ------------------------------------------------------------------------
[INFO] Downloading: http://repo1.maven.org/eclipse/com/google/guava/guava/11.0.1/guava-11.0.1.pom
[INFO] Downloading: http://repo1.maven.org/maven2/com/google/guava/guava/11.0.1/guava-11.0.1.pom
[INFO]                                                                         
[INFO] ------------------------------------------------------------------------
[INFO] Skipping Apache UIMA uimaFIT
[INFO] This project has been banned from the build due to previous failures.
[INFO] ------------------------------------------------------------------------
[INFO] ------------------------------------------------------------------------
[INFO] Reactor Summary:
[INFO] 
[INFO] Apache UIMA uimaFIT - Parent ....................... SUCCESS [ 34.680 s]
[INFO] Apache UIMA uimaFIT - Core ......................... SUCCESS [01:29 min]
[INFO] Apache UIMA uimaFIT - Examples ..................... SUCCESS [ 26.232 s]
[INFO] Apache UIMA uimaFIT - Spring integration ........... SUCCESS [ 40.813 s]
[INFO] Apache UIMA uimaFIT - Maven Plugin ................. FAILURE [  0.760 s]
[INFO] Apache UIMA uimaFIT - Legacy uimaFIT support ....... SKIPPED
[INFO] Apache UIMA uimaFIT - Documentation ................ SKIPPED
[INFO] Apache UIMA uimaFIT - Collection Processing Engine support SKIPPED
[INFO] Apache UIMA uimaFIT ................................ SKIPPED
[INFO] ------------------------------------------------------------------------
[INFO] BUILD FAILURE
[INFO] ------------------------------------------------------------------------
[INFO] Total time: 03:49 min
[INFO] Finished at: 2016-10-21T17:36:00+00:00
[INFO] Final Memory: 90M/471M
[INFO] ------------------------------------------------------------------------
Waiting for Jenkins to finish collecting data
[ERROR] Failed to execute goal on project uimafit-maven-plugin: Could not resolve dependencies
for project org.apache.uima:uimafit-maven-plugin:maven-plugin:2.3.0-SNAPSHOT: Failed to collect
dependencies at com.google.guava:guava:jar:11.0.1: Failed to read artifact descriptor for
com.google.guava:guava:jar:11.0.1: Could not transfer artifact com.google.guava:guava:pom:11.0.1
from/to eclipsePlugins (http://repo1.maven.org/eclipse): repo1.maven.org: Unknown host repo1.maven.org
-> [Help 1]
[ERROR] 
[ERROR] To see the full stack trace of the errors, re-run Maven with the -e switch.
[ERROR] Re-run Maven using the -X switch to enable full debug logging.
[ERROR] 
[ERROR] For more information about the errors and possible solutions, please read the following
articles:
[ERROR] [Help 1] http://cwiki.apache.org/confluence/display/MAVEN/DependencyResolutionException
[ERROR] 
[ERROR] After correcting the problems, you can resume the build with the command
[ERROR]   mvn <goals> -rf :uimafit-maven-plugin
[JENKINS] Archiving <https://builds.apache.org/job/UIMA-uimaFIT_java8/ws/trunk/uimafit-core/pom.xml>
to org.apache.uima/uimafit-core/2.3.0-SNAPSHOT/uimafit-core-2.3.0-SNAPSHOT.pom
[JENKINS] Archiving <https://builds.apache.org/job/UIMA-uimaFIT_java8/ws/trunk/uimafit-core/target/uimafit-core-2.3.0-SNAPSHOT.jar>
to org.apache.uima/uimafit-core/2.3.0-SNAPSHOT/uimafit-core-2.3.0-SNAPSHOT.jar
[JENKINS] Archiving <https://builds.apache.org/job/UIMA-uimaFIT_java8/ws/trunk/uimafit-docbook/pom.xml>
to org.apache.uima/uimafit-docbook/2.3.0-SNAPSHOT/uimafit-docbook-2.3.0-SNAPSHOT.pom
[JENKINS] Archiving <https://builds.apache.org/job/UIMA-uimaFIT_java8/ws/trunk/pom.xml>
to org.apache.uima/uimafit/2.3.0-SNAPSHOT/uimafit-2.3.0-SNAPSHOT.pom
[JENKINS] Archiving <https://builds.apache.org/job/UIMA-uimaFIT_java8/ws/trunk/uimafit-cpe/pom.xml>
to org.apache.uima/uimafit-cpe/2.3.0-SNAPSHOT/uimafit-cpe-2.3.0-SNAPSHOT.pom
[JENKINS] Archiving <https://builds.apache.org/job/UIMA-uimaFIT_java8/ws/trunk/uimafit-maven-plugin/pom.xml>
to org.apache.uima/uimafit-maven-plugin/2.3.0-SNAPSHOT/uimafit-maven-plugin-2.3.0-SNAPSHOT.pom
[JENKINS] Archiving <https://builds.apache.org/job/UIMA-uimaFIT_java8/ws/trunk/uimafit-legacy-support/pom.xml>
to org.apache.uima/uimafit-legacy-support/2.3.0-SNAPSHOT/uimafit-legacy-support-2.3.0-SNAPSHOT.pom
[JENKINS] Archiving <https://builds.apache.org/job/UIMA-uimaFIT_java8/ws/trunk/uimafit-parent/pom.xml>
to org.apache.uima/uimafit-parent/2.3.0-SNAPSHOT/uimafit-parent-2.3.0-SNAPSHOT.pom
[JENKINS] Archiving <https://builds.apache.org/job/UIMA-uimaFIT_java8/ws/trunk/uimafit-examples/pom.xml>
to org.apache.uima/uimafit-examples/2.3.0-SNAPSHOT/uimafit-examples-2.3.0-SNAPSHOT.pom
[JENKINS] Archiving <https://builds.apache.org/job/UIMA-uimaFIT_java8/ws/trunk/uimafit-examples/target/uimafit-examples-2.3.0-SNAPSHOT.jar>
to org.apache.uima/uimafit-examples/2.3.0-SNAPSHOT/uimafit-examples-2.3.0-SNAPSHOT.jar
[JENKINS] Archiving <https://builds.apache.org/job/UIMA-uimaFIT_java8/ws/trunk/uimafit-spring/pom.xml>
to org.apache.uima/uimafit-spring/2.3.0-SNAPSHOT/uimafit-spring-2.3.0-SNAPSHOT.pom
[JENKINS] Archiving <https://builds.apache.org/job/UIMA-uimaFIT_java8/ws/trunk/uimafit-spring/target/uimafit-spring-2.3.0-SNAPSHOT.jar>
to org.apache.uima/uimafit-spring/2.3.0-SNAPSHOT/uimafit-spring-2.3.0-SNAPSHOT.jar
Sending e-mails to: dev@uima.apache.org
Sending e-mails to: dev@uima.apache.org
Sending e-mails to: dev@uima.apache.org
Sending e-mails to: dev@uima.apache.org
channel stopped
[WARNINGS] Skipping publisher since build result is FAILURE
Skipping Cobertura coverage report as build was not UNSTABLE or better ...

Mime
View raw message