uima-dev mailing list archives

Site index · List index
Message view « Date » · « Thread »
Top « Date » · « Thread »
From Apache Jenkins Server <jenk...@builds.apache.org>
Subject Build failed in Jenkins: UIMA-uimaFIT » Apache UIMA uimaFIT - Core #254
Date Thu, 20 Oct 2016 16:12:47 GMT
See <https://builds.apache.org/job/UIMA-uimaFIT/org.apache.uima$uimafit-core/254/>

------------------------------------------
[...truncated 49 lines...]
[INFO] Downloaded: http://repo1.maven.org/maven2/aopalliance/aopalliance/1.0/aopalliance-1.0.pom
(363 B at 59.1 KB/sec)
[INFO] Downloading: http://repo1.maven.org/eclipse/org/springframework/spring-beans/3.2.16.RELEASE/spring-beans-3.2.16.RELEASE.pom
[INFO] Downloading: http://repo1.maven.org/maven2/org/springframework/spring-beans/3.2.16.RELEASE/spring-beans-3.2.16.RELEASE.pom
[INFO] Downloaded: http://repo1.maven.org/maven2/org/springframework/spring-beans/3.2.16.RELEASE/spring-beans-3.2.16.RELEASE.pom
(2 KB at 211.5 KB/sec)
[INFO] Downloading: http://repo1.maven.org/eclipse/org/springframework/spring-expression/3.2.16.RELEASE/spring-expression-3.2.16.RELEASE.pom
[INFO] Downloading: http://repo1.maven.org/maven2/org/springframework/spring-expression/3.2.16.RELEASE/spring-expression-3.2.16.RELEASE.pom
[INFO] Downloaded: http://repo1.maven.org/maven2/org/springframework/spring-expression/3.2.16.RELEASE/spring-expression-3.2.16.RELEASE.pom
(2 KB at 111.2 KB/sec)
[INFO] Downloading: http://repo1.maven.org/eclipse/org/springframework/spring-test/3.2.16.RELEASE/spring-test-3.2.16.RELEASE.pom
[INFO] Downloading: http://repo1.maven.org/maven2/org/springframework/spring-test/3.2.16.RELEASE/spring-test-3.2.16.RELEASE.pom
[INFO] Downloaded: http://repo1.maven.org/maven2/org/springframework/spring-test/3.2.16.RELEASE/spring-test-3.2.16.RELEASE.pom
(7 KB at 861.6 KB/sec)
[INFO] Downloading: http://repo1.maven.org/eclipse/log4j/log4j/1.2.15/log4j-1.2.15.pom
[INFO] Downloading: http://repo1.maven.org/maven2/log4j/log4j/1.2.15/log4j-1.2.15.pom
[INFO] Downloaded: http://repo1.maven.org/maven2/log4j/log4j/1.2.15/log4j-1.2.15.pom (18 KB
at 2480.5 KB/sec)
[INFO] Downloading: http://repository.apache.org/snapshots/org/apache/uima/uimaj-core/2.9.1-SNAPSHOT/uimaj-core-2.9.1-20161020.160213-14.jar
[INFO] Downloaded: http://repository.apache.org/snapshots/org/apache/uima/uimaj-core/2.9.1-SNAPSHOT/uimaj-core-2.9.1-20161020.160213-14.jar
(1552 KB at 12617.7 KB/sec)
[INFO] Downloading: http://repo1.maven.org/eclipse/org/springframework/spring-core/3.2.16.RELEASE/spring-core-3.2.16.RELEASE.jar
[INFO] Downloading: http://repo1.maven.org/eclipse/commons-logging/commons-logging/1.1.3/commons-logging-1.1.3.jar
[INFO] Downloading: http://repo1.maven.org/eclipse/org/springframework/spring-context/3.2.16.RELEASE/spring-context-3.2.16.RELEASE.jar
[INFO] Downloading: http://repo1.maven.org/eclipse/org/springframework/spring-aop/3.2.16.RELEASE/spring-aop-3.2.16.RELEASE.jar
[INFO] Downloading: http://repo1.maven.org/eclipse/aopalliance/aopalliance/1.0/aopalliance-1.0.jar
[INFO] Downloading: http://repo1.maven.org/eclipse/org/springframework/spring-expression/3.2.16.RELEASE/spring-expression-3.2.16.RELEASE.jar
[INFO] Downloading: http://repo1.maven.org/eclipse/org/springframework/spring-beans/3.2.16.RELEASE/spring-beans-3.2.16.RELEASE.jar
[INFO] Downloading: http://repo1.maven.org/eclipse/org/springframework/spring-test/3.2.16.RELEASE/spring-test-3.2.16.RELEASE.jar
[INFO] Downloading: http://repo1.maven.org/eclipse/log4j/log4j/1.2.15/log4j-1.2.15.jar
[INFO] Downloading: http://repo1.maven.org/maven2/org/springframework/spring-core/3.2.16.RELEASE/spring-core-3.2.16.RELEASE.jar
[INFO] Downloading: http://repo1.maven.org/maven2/commons-logging/commons-logging/1.1.3/commons-logging-1.1.3.jar
[INFO] Downloading: http://repo1.maven.org/maven2/org/springframework/spring-context/3.2.16.RELEASE/spring-context-3.2.16.RELEASE.jar
[INFO] Downloading: http://repo1.maven.org/maven2/aopalliance/aopalliance/1.0/aopalliance-1.0.jar
[INFO] Downloading: http://repo1.maven.org/maven2/org/springframework/spring-aop/3.2.16.RELEASE/spring-aop-3.2.16.RELEASE.jar
[INFO] Downloaded: http://repo1.maven.org/maven2/aopalliance/aopalliance/1.0/aopalliance-1.0.jar
(5 KB at 545.3 KB/sec)
[INFO] Downloading: http://repo1.maven.org/maven2/org/springframework/spring-expression/3.2.16.RELEASE/spring-expression-3.2.16.RELEASE.jar
[INFO] Downloaded: http://repo1.maven.org/maven2/commons-logging/commons-logging/1.1.3/commons-logging-1.1.3.jar
(61 KB at 5508.7 KB/sec)
[INFO] Downloading: http://repo1.maven.org/maven2/org/springframework/spring-beans/3.2.16.RELEASE/spring-beans-3.2.16.RELEASE.jar
[INFO] Downloaded: http://repo1.maven.org/maven2/org/springframework/spring-aop/3.2.16.RELEASE/spring-aop-3.2.16.RELEASE.jar
(331 KB at 16536.0 KB/sec)
[INFO] Downloading: http://repo1.maven.org/maven2/org/springframework/spring-test/3.2.16.RELEASE/spring-test-3.2.16.RELEASE.jar
[INFO] Downloaded: http://repo1.maven.org/maven2/org/springframework/spring-expression/3.2.16.RELEASE/spring-expression-3.2.16.RELEASE.jar
(192 KB at 6619.5 KB/sec)
[INFO] Downloading: http://repo1.maven.org/maven2/log4j/log4j/1.2.15/log4j-1.2.15.jar
[INFO] Downloaded: http://repo1.maven.org/maven2/org/springframework/spring-core/3.2.16.RELEASE/spring-core-3.2.16.RELEASE.jar
(866 KB at 23384.7 KB/sec)
[INFO] Downloaded: http://repo1.maven.org/maven2/org/springframework/spring-beans/3.2.16.RELEASE/spring-beans-3.2.16.RELEASE.jar
(600 KB at 16215.0 KB/sec)
[INFO] Downloaded: http://repo1.maven.org/maven2/org/springframework/spring-test/3.2.16.RELEASE/spring-test-3.2.16.RELEASE.jar
(448 KB at 12097.8 KB/sec)
[INFO] Downloaded: http://repo1.maven.org/maven2/org/springframework/spring-context/3.2.16.RELEASE/spring-context-3.2.16.RELEASE.jar
(849 KB at 20194.1 KB/sec)
[INFO] Downloaded: http://repo1.maven.org/maven2/log4j/log4j/1.2.15/log4j-1.2.15.jar (383
KB at 8503.3 KB/sec)
[INFO] 
[INFO] --- maven-clean-plugin:2.5:clean (default-clean) @ uimafit-core ---
[TASKS] Scanning folder '<https://builds.apache.org/job/UIMA-uimaFIT/org.apache.uima$uimafit-core/ws/'>
for files matching the pattern '**/*.java' - excludes: 
[TASKS] Found 152 files to scan for tasks
Found 3 open tasks.
[TASKS] Computing warning deltas based on reference build #253
[INFO] 
[INFO] --- maven-enforcer-plugin:1.4.1:enforce (enforce-versions) @ uimafit-core ---
[INFO] Downloading: https://repo.maven.apache.org/maven2/org/semver/enforcer-rule/0.9.33/enforcer-rule-0.9.33.pom
[INFO] Downloaded: https://repo.maven.apache.org/maven2/org/semver/enforcer-rule/0.9.33/enforcer-rule-0.9.33.pom
(2 KB at 184.0 KB/sec)
[INFO] Downloading: https://repo.maven.apache.org/maven2/org/semver/parent/0.9.33/parent-0.9.33.pom
[INFO] Downloaded: https://repo.maven.apache.org/maven2/org/semver/parent/0.9.33/parent-0.9.33.pom
(2 KB at 153.4 KB/sec)
[INFO] Downloading: https://repo.maven.apache.org/maven2/com/github/jeluard/oss-parent/9/oss-parent-9.pom
[INFO] Downloaded: https://repo.maven.apache.org/maven2/com/github/jeluard/oss-parent/9/oss-parent-9.pom
(13 KB at 1217.2 KB/sec)
[INFO] Downloading: https://repo.maven.apache.org/maven2/org/semver/api/0.9.33/api-0.9.33.pom
[INFO] Downloaded: https://repo.maven.apache.org/maven2/org/semver/api/0.9.33/api-0.9.33.pom
(3 KB at 307.5 KB/sec)
[INFO] Downloading: https://repo.maven.apache.org/maven2/com/google/code/findbugs/jsr305/2.0.0/jsr305-2.0.0.pom
[INFO] Downloaded: https://repo.maven.apache.org/maven2/com/google/code/findbugs/jsr305/2.0.0/jsr305-2.0.0.pom
(965 B at 72.5 KB/sec)
[INFO] Downloading: https://repo.maven.apache.org/maven2/org/ow2/asm/asm/5.0.3/asm-5.0.3.pom
[INFO] Downloaded: https://repo.maven.apache.org/maven2/org/ow2/asm/asm/5.0.3/asm-5.0.3.pom
(2 KB at 269.9 KB/sec)
[INFO] Downloading: https://repo.maven.apache.org/maven2/org/ow2/asm/asm-parent/5.0.3/asm-parent-5.0.3.pom
[INFO] Downloaded: https://repo.maven.apache.org/maven2/org/ow2/asm/asm-parent/5.0.3/asm-parent-5.0.3.pom
(6 KB at 766.6 KB/sec)
[INFO] Downloading: https://repo.maven.apache.org/maven2/org/ow2/asm/asm-commons/5.0.3/asm-commons-5.0.3.pom
[INFO] Downloaded: https://repo.maven.apache.org/maven2/org/ow2/asm/asm-commons/5.0.3/asm-commons-5.0.3.pom
(3 KB at 292.1 KB/sec)
[INFO] Downloading: https://repo.maven.apache.org/maven2/org/ow2/asm/asm-tree/5.0.3/asm-tree-5.0.3.pom
[INFO] Downloaded: https://repo.maven.apache.org/maven2/org/ow2/asm/asm-tree/5.0.3/asm-tree-5.0.3.pom
(3 KB at 290.6 KB/sec)
[INFO] Downloading: https://repo.maven.apache.org/maven2/de/tototec/de.tototec.cmdoption/0.2.0/de.tototec.cmdoption-0.2.0.pom
[INFO] Downloaded: https://repo.maven.apache.org/maven2/de/tototec/de.tototec.cmdoption/0.2.0/de.tototec.cmdoption-0.2.0.pom
(956 B at 116.7 KB/sec)
[INFO] Downloading: https://repo.maven.apache.org/maven2/org/apache/maven/enforcer/enforcer-api/1.4.1/enforcer-api-1.4.1.pom
[INFO] Downloaded: https://repo.maven.apache.org/maven2/org/apache/maven/enforcer/enforcer-api/1.4.1/enforcer-api-1.4.1.pom
(3 KB at 393.8 KB/sec)
[INFO] Downloading: https://repo.maven.apache.org/maven2/org/codehaus/plexus/plexus-utils/3.0.22/plexus-utils-3.0.22.pom
[INFO] Downloaded: https://repo.maven.apache.org/maven2/org/codehaus/plexus/plexus-utils/3.0.22/plexus-utils-3.0.22.pom
(4 KB at 534.5 KB/sec)
[INFO] Downloading: https://repo.maven.apache.org/maven2/org/apache/maven/enforcer/enforcer-rules/1.4.1/enforcer-rules-1.4.1.pom
[INFO] Downloaded: https://repo.maven.apache.org/maven2/org/apache/maven/enforcer/enforcer-rules/1.4.1/enforcer-rules-1.4.1.pom
(4 KB at 452.6 KB/sec)
[INFO] Downloading: https://repo.maven.apache.org/maven2/org/apache/maven/shared/maven-dependency-tree/2.2/maven-dependency-tree-2.2.pom
[INFO] Downloaded: https://repo.maven.apache.org/maven2/org/apache/maven/shared/maven-dependency-tree/2.2/maven-dependency-tree-2.2.pom
(8 KB at 886.5 KB/sec)
[INFO] Downloading: https://repo.maven.apache.org/maven2/org/apache/maven/shared/maven-shared-components/20/maven-shared-components-20.pom
[INFO] Downloaded: https://repo.maven.apache.org/maven2/org/apache/maven/shared/maven-shared-components/20/maven-shared-components-20.pom
(5 KB at 831.1 KB/sec)
[INFO] Downloading: https://repo.maven.apache.org/maven2/org/apache/maven/maven-parent/24/maven-parent-24.pom
[INFO] Downloaded: https://repo.maven.apache.org/maven2/org/apache/maven/maven-parent/24/maven-parent-24.pom
(37 KB at 4003.7 KB/sec)
[INFO] Downloading: https://repo.maven.apache.org/maven2/org/apache/maven/plugin-testing/maven-plugin-testing-harness/1.3/maven-plugin-testing-harness-1.3.pom
[INFO] Downloaded: https://repo.maven.apache.org/maven2/org/apache/maven/plugin-testing/maven-plugin-testing-harness/1.3/maven-plugin-testing-harness-1.3.pom
(4 KB at 421.0 KB/sec)
[INFO] Downloading: https://repo.maven.apache.org/maven2/org/apache/maven/plugin-testing/maven-plugin-testing/1.3/maven-plugin-testing-1.3.pom
[INFO] Downloaded: https://repo.maven.apache.org/maven2/org/apache/maven/plugin-testing/maven-plugin-testing/1.3/maven-plugin-testing-1.3.pom
(10 KB at 1329.8 KB/sec)
[INFO] Downloading: https://repo.maven.apache.org/maven2/org/codehaus/plexus/plexus-archiver/2.2/plexus-archiver-2.2.pom
[INFO] Downloaded: https://repo.maven.apache.org/maven2/org/codehaus/plexus/plexus-archiver/2.2/plexus-archiver-2.2.pom
(4 KB at 392.2 KB/sec)
[INFO] Downloading: https://repo.maven.apache.org/maven2/org/codehaus/plexus/plexus-components/1.1.20/plexus-components-1.1.20.pom
[INFO] Downloaded: https://repo.maven.apache.org/maven2/org/codehaus/plexus/plexus-components/1.1.20/plexus-components-1.1.20.pom
(3 KB at 420.9 KB/sec)
[INFO] Downloading: https://repo.maven.apache.org/maven2/org/codehaus/plexus/plexus/3.1/plexus-3.1.pom
[INFO] Downloaded: https://repo.maven.apache.org/maven2/org/codehaus/plexus/plexus/3.1/plexus-3.1.pom
(19 KB at 2597.0 KB/sec)
[INFO] Downloading: https://repo.maven.apache.org/maven2/org/codehaus/plexus/plexus-io/2.0.4/plexus-io-2.0.4.pom
[INFO] Downloaded: https://repo.maven.apache.org/maven2/org/codehaus/plexus/plexus-io/2.0.4/plexus-io-2.0.4.pom
(2 KB at 241.8 KB/sec)
[INFO] Downloading: https://repo.maven.apache.org/maven2/org/semver/enforcer-rule/0.9.33/enforcer-rule-0.9.33.jar
[INFO] Downloading: https://repo.maven.apache.org/maven2/org/semver/api/0.9.33/api-0.9.33.jar
[INFO] Downloading: https://repo.maven.apache.org/maven2/com/google/code/findbugs/jsr305/2.0.0/jsr305-2.0.0.jar
[INFO] Downloading: https://repo.maven.apache.org/maven2/org/ow2/asm/asm/5.0.3/asm-5.0.3.jar
[INFO] Downloading: https://repo.maven.apache.org/maven2/org/ow2/asm/asm-commons/5.0.3/asm-commons-5.0.3.jar
[INFO] Downloaded: https://repo.maven.apache.org/maven2/org/semver/enforcer-rule/0.9.33/enforcer-rule-0.9.33.jar
(14 KB at 937.5 KB/sec)
[INFO] Downloading: https://repo.maven.apache.org/maven2/org/ow2/asm/asm-tree/5.0.3/asm-tree-5.0.3.jar
[INFO] Downloaded: https://repo.maven.apache.org/maven2/org/ow2/asm/asm/5.0.3/asm-5.0.3.jar
(52 KB at 3998.7 KB/sec)
[INFO] Downloading: https://repo.maven.apache.org/maven2/de/tototec/de.tototec.cmdoption/0.2.0/de.tototec.cmdoption-0.2.0.jar
[INFO] Downloaded: https://repo.maven.apache.org/maven2/org/ow2/asm/asm-commons/5.0.3/asm-commons-5.0.3.jar
(41 KB at 3133.8 KB/sec)
[INFO] Downloading: https://repo.maven.apache.org/maven2/org/codehaus/plexus/plexus-utils/3.0.22/plexus-utils-3.0.22.jar
[INFO] Downloaded: https://repo.maven.apache.org/maven2/com/google/code/findbugs/jsr305/2.0.0/jsr305-2.0.0.jar
(32 KB at 1944.9 KB/sec)
[INFO] Downloading: https://repo.maven.apache.org/maven2/org/apache/maven/enforcer/enforcer-api/1.4.1/enforcer-api-1.4.1.jar
[INFO] Downloaded: https://repo.maven.apache.org/maven2/org/semver/api/0.9.33/api-0.9.33.jar
(63 KB at 3682.8 KB/sec)
[INFO] Downloading: https://repo.maven.apache.org/maven2/org/apache/maven/enforcer/enforcer-rules/1.4.1/enforcer-rules-1.4.1.jar
[INFO] Downloaded: https://repo.maven.apache.org/maven2/org/ow2/asm/asm-tree/5.0.3/asm-tree-5.0.3.jar
(29 KB at 1232.8 KB/sec)
[INFO] Downloading: https://repo.maven.apache.org/maven2/org/apache/maven/shared/maven-dependency-tree/2.2/maven-dependency-tree-2.2.jar
[INFO] Downloaded: https://repo.maven.apache.org/maven2/de/tototec/de.tototec.cmdoption/0.2.0/de.tototec.cmdoption-0.2.0.jar
(42 KB at 1713.2 KB/sec)
[INFO] Downloading: https://repo.maven.apache.org/maven2/org/apache/maven/plugin-testing/maven-plugin-testing-harness/1.3/maven-plugin-testing-harness-1.3.jar
[INFO] Downloaded: https://repo.maven.apache.org/maven2/org/codehaus/plexus/plexus-utils/3.0.22/plexus-utils-3.0.22.jar
(240 KB at 8541.3 KB/sec)
[INFO] Downloading: https://repo.maven.apache.org/maven2/org/codehaus/plexus/plexus-archiver/2.2/plexus-archiver-2.2.jar
[INFO] Downloaded: https://repo.maven.apache.org/maven2/org/apache/maven/enforcer/enforcer-api/1.4.1/enforcer-api-1.4.1.jar
(12 KB at 395.5 KB/sec)
[INFO] Downloading: https://repo.maven.apache.org/maven2/org/codehaus/plexus/plexus-io/2.0.4/plexus-io-2.0.4.jar
[INFO] Downloaded: https://repo.maven.apache.org/maven2/org/apache/maven/enforcer/enforcer-rules/1.4.1/enforcer-rules-1.4.1.jar
(97 KB at 3219.3 KB/sec)
[INFO] Downloading: https://repo.maven.apache.org/maven2/junit/junit/4.11/junit-4.11.jar
[INFO] Downloaded: https://repo.maven.apache.org/maven2/org/apache/maven/shared/maven-dependency-tree/2.2/maven-dependency-tree-2.2.jar
(63 KB at 2002.5 KB/sec)
[INFO] Downloaded: https://repo.maven.apache.org/maven2/org/apache/maven/plugin-testing/maven-plugin-testing-harness/1.3/maven-plugin-testing-harness-1.3.jar
(35 KB at 1045.0 KB/sec)
[INFO] Downloaded: https://repo.maven.apache.org/maven2/org/codehaus/plexus/plexus-io/2.0.4/plexus-io-2.0.4.jar
(57 KB at 1422.8 KB/sec)
[INFO] Downloaded: https://repo.maven.apache.org/maven2/org/codehaus/plexus/plexus-archiver/2.2/plexus-archiver-2.2.jar
(181 KB at 4405.9 KB/sec)
[INFO] Downloaded: https://repo.maven.apache.org/maven2/junit/junit/4.11/junit-4.11.jar (240
KB at 5438.5 KB/sec)
[INFO] 
[INFO] --- build-helper-maven-plugin:1.8:parse-version (parse-project-version) @ uimafit-core
---
[INFO] 
[INFO] --- uima-build-helper-maven-plugin:7:parse-date-time (set buildYear and buildMonth)
@ uimafit-core ---
[INFO] 
[INFO] --- gmaven-plugin:1.5:execute (read-notice) @ uimafit-core ---
[INFO] 
[INFO] --- maven-remote-resources-plugin:1.5:process (default) @ uimafit-core ---
[INFO] Downloading: http://repository.apache.org/snapshots/org/apache/uima/uimaj-parent/2.9.1-SNAPSHOT/maven-metadata.xml
[INFO] Downloaded: http://repository.apache.org/snapshots/org/apache/uima/uimaj-parent/2.9.1-SNAPSHOT/maven-metadata.xml
(606 B at 13.2 KB/sec)
[INFO] Downloading: http://repository.apache.org/snapshots/org/apache/uima/uimaj-parent/2.9.1-SNAPSHOT/uimaj-parent-2.9.1-20161020.160413-14.pom
[INFO] Downloaded: http://repository.apache.org/snapshots/org/apache/uima/uimaj-parent/2.9.1-SNAPSHOT/uimaj-parent-2.9.1-20161020.160413-14.pom
(0 B at 0.0 KB/sec)
[INFO] 
[INFO] --- maven-resources-plugin:2.6:resources (default-resources) @ uimafit-core ---
[INFO] Downloading: https://repo.maven.apache.org/maven2/org/codehaus/plexus/plexus-interpolation/1.13/plexus-interpolation-1.13.jar
[INFO] Downloaded: https://repo.maven.apache.org/maven2/org/codehaus/plexus/plexus-interpolation/1.13/plexus-interpolation-1.13.jar
(60 KB at 5962.6 KB/sec)
[INFO] Using 'UTF-8' encoding to copy filtered resources.
[INFO] Copying 1 resource
[INFO] Copying 3 resources
[INFO] 
[INFO] --- maven-compiler-plugin:3.5.1:compile (default-compile) @ uimafit-core ---
[INFO] Downloading: https://repo.maven.apache.org/maven2/org/apache/maven/maven-toolchain/2.2.1/maven-toolchain-2.2.1.pom
[INFO] Downloaded: https://repo.maven.apache.org/maven2/org/apache/maven/maven-toolchain/2.2.1/maven-toolchain-2.2.1.pom
(4 KB at 163.3 KB/sec)
[INFO] Downloading: https://repo.maven.apache.org/maven2/org/apache/maven/shared/maven-shared-utils/3.0.0/maven-shared-utils-3.0.0.pom
[INFO] Downloaded: https://repo.maven.apache.org/maven2/org/apache/maven/shared/maven-shared-utils/3.0.0/maven-shared-utils-3.0.0.pom
(6 KB at 247.9 KB/sec)
[INFO] Downloading: https://repo.maven.apache.org/maven2/org/apache/maven/shared/maven-shared-components/21/maven-shared-components-21.pom
[INFO] Downloaded: https://repo.maven.apache.org/maven2/org/apache/maven/shared/maven-shared-components/21/maven-shared-components-21.pom
(5 KB at 554.1 KB/sec)
[INFO] Downloading: https://repo.maven.apache.org/maven2/org/apache/maven/maven-parent/25/maven-parent-25.pom
[INFO] Downloaded: https://repo.maven.apache.org/maven2/org/apache/maven/maven-parent/25/maven-parent-25.pom
(37 KB at 3656.2 KB/sec)
[INFO] Downloading: https://repo.maven.apache.org/maven2/org/apache/apache/15/apache-15.pom
[INFO] Downloaded: https://repo.maven.apache.org/maven2/org/apache/apache/15/apache-15.pom
(15 KB at 1653.2 KB/sec)
[INFO] Downloading: https://repo.maven.apache.org/maven2/commons-io/commons-io/2.4/commons-io-2.4.pom
[INFO] Downloaded: https://repo.maven.apache.org/maven2/commons-io/commons-io/2.4/commons-io-2.4.pom
(10 KB at 1241.0 KB/sec)
[INFO] Downloading: https://repo.maven.apache.org/maven2/org/apache/commons/commons-parent/25/commons-parent-25.pom
[INFO] Downloaded: https://repo.maven.apache.org/maven2/org/apache/commons/commons-parent/25/commons-parent-25.pom
(48 KB at 3628.6 KB/sec)
[INFO] Downloading: https://repo.maven.apache.org/maven2/org/apache/maven/shared/maven-shared-incremental/1.1/maven-shared-incremental-1.1.pom
[INFO] Downloaded: https://repo.maven.apache.org/maven2/org/apache/maven/shared/maven-shared-incremental/1.1/maven-shared-incremental-1.1.pom
(5 KB at 514.5 KB/sec)
[INFO] Downloading: https://repo.maven.apache.org/maven2/org/apache/maven/shared/maven-shared-utils/0.1/maven-shared-utils-0.1.pom
[INFO] Downloaded: https://repo.maven.apache.org/maven2/org/apache/maven/shared/maven-shared-utils/0.1/maven-shared-utils-0.1.pom
(4 KB at 494.0 KB/sec)
[INFO] Downloading: https://repo.maven.apache.org/maven2/org/codehaus/plexus/plexus-compiler-api/2.7/plexus-compiler-api-2.7.pom
[INFO] Downloaded: https://repo.maven.apache.org/maven2/org/codehaus/plexus/plexus-compiler-api/2.7/plexus-compiler-api-2.7.pom
(891 B at 79.1 KB/sec)
[INFO] Downloading: https://repo.maven.apache.org/maven2/org/codehaus/plexus/plexus-compiler/2.7/plexus-compiler-2.7.pom
[INFO] Downloaded: https://repo.maven.apache.org/maven2/org/codehaus/plexus/plexus-compiler/2.7/plexus-compiler-2.7.pom
(5 KB at 602.3 KB/sec)
[INFO] Downloading: https://repo.maven.apache.org/maven2/org/codehaus/plexus/plexus-components/4.0/plexus-components-4.0.pom
[INFO] Downloaded: https://repo.maven.apache.org/maven2/org/codehaus/plexus/plexus-components/4.0/plexus-components-4.0.pom
(3 KB at 259.5 KB/sec)
[INFO] Downloading: https://repo.maven.apache.org/maven2/org/codehaus/plexus/plexus/4.0/plexus-4.0.pom
[INFO] Downloaded: https://repo.maven.apache.org/maven2/org/codehaus/plexus/plexus/4.0/plexus-4.0.pom
(21 KB at 2624.5 KB/sec)
[INFO] Downloading: https://repo.maven.apache.org/maven2/org/codehaus/plexus/plexus-compiler-manager/2.7/plexus-compiler-manager-2.7.pom
[INFO] Downloaded: https://repo.maven.apache.org/maven2/org/codehaus/plexus/plexus-compiler-manager/2.7/plexus-compiler-manager-2.7.pom
(711 B at 57.9 KB/sec)
[INFO] Downloading: https://repo.maven.apache.org/maven2/org/codehaus/plexus/plexus-compiler-javac/2.7/plexus-compiler-javac-2.7.pom
[INFO] Downloaded: https://repo.maven.apache.org/maven2/org/codehaus/plexus/plexus-compiler-javac/2.7/plexus-compiler-javac-2.7.pom
(792 B at 77.3 KB/sec)
[INFO] Downloading: https://repo.maven.apache.org/maven2/org/codehaus/plexus/plexus-compilers/2.7/plexus-compilers-2.7.pom
[INFO] Downloaded: https://repo.maven.apache.org/maven2/org/codehaus/plexus/plexus-compilers/2.7/plexus-compilers-2.7.pom
(2 KB at 150.0 KB/sec)
[INFO] Downloading: https://repo.maven.apache.org/maven2/org/codehaus/plexus/plexus-utils/2.0.4/plexus-utils-2.0.4.jar
[INFO] Downloading: https://repo.maven.apache.org/maven2/org/apache/maven/maven-toolchain/2.2.1/maven-toolchain-2.2.1.jar
[INFO] Downloading: https://repo.maven.apache.org/maven2/commons-io/commons-io/2.4/commons-io-2.4.jar
[INFO] Downloading: https://repo.maven.apache.org/maven2/org/apache/maven/shared/maven-shared-utils/3.0.0/maven-shared-utils-3.0.0.jar
[INFO] Downloading: https://repo.maven.apache.org/maven2/org/apache/maven/shared/maven-shared-incremental/1.1/maven-shared-incremental-1.1.jar
[INFO] Downloaded: https://repo.maven.apache.org/maven2/org/apache/maven/maven-toolchain/2.2.1/maven-toolchain-2.2.1.jar
(37 KB at 2449.4 KB/sec)
[INFO] Downloading: https://repo.maven.apache.org/maven2/org/codehaus/plexus/plexus-compiler-api/2.7/plexus-compiler-api-2.7.jar
[INFO] Downloaded: https://repo.maven.apache.org/maven2/org/apache/maven/shared/maven-shared-incremental/1.1/maven-shared-incremental-1.1.jar
(14 KB at 661.0 KB/sec)
[INFO] Downloading: https://repo.maven.apache.org/maven2/org/codehaus/plexus/plexus-compiler-manager/2.7/plexus-compiler-manager-2.7.jar
[INFO] Downloaded: https://repo.maven.apache.org/maven2/org/apache/maven/shared/maven-shared-utils/3.0.0/maven-shared-utils-3.0.0.jar
(152 KB at 6568.6 KB/sec)
[INFO] Downloading: https://repo.maven.apache.org/maven2/org/codehaus/plexus/plexus-compiler-javac/2.7/plexus-compiler-javac-2.7.jar
[INFO] Downloaded: https://repo.maven.apache.org/maven2/org/codehaus/plexus/plexus-utils/2.0.4/plexus-utils-2.0.4.jar
(217 KB at 8343.5 KB/sec)
[INFO] Downloaded: https://repo.maven.apache.org/maven2/commons-io/commons-io/2.4/commons-io-2.4.jar
(181 KB at 6953.9 KB/sec)
[INFO] Downloaded: https://repo.maven.apache.org/maven2/org/codehaus/plexus/plexus-compiler-api/2.7/plexus-compiler-api-2.7.jar
(26 KB at 1140.7 KB/sec)
[INFO] Downloaded: https://repo.maven.apache.org/maven2/org/codehaus/plexus/plexus-compiler-manager/2.7/plexus-compiler-manager-2.7.jar
(5 KB at 163.3 KB/sec)
[INFO] Downloaded: https://repo.maven.apache.org/maven2/org/codehaus/plexus/plexus-compiler-javac/2.7/plexus-compiler-javac-2.7.jar
(20 KB at 656.2 KB/sec)
[INFO] Changes detected - recompiling the module!
[INFO] Compiling 87 source files to <https://builds.apache.org/job/UIMA-uimaFIT/org.apache.uima$uimafit-core/ws/target/classes>
[INFO] <https://builds.apache.org/job/UIMA-uimaFIT/org.apache.uima$uimafit-core/ws/src/main/java/org/apache/uima/fit/factory/JCasFactory.java>:
<https://builds.apache.org/job/UIMA-uimaFIT/org.apache.uima$uimafit-core/ws/src/main/java/org/apache/uima/fit/factory/JCasFactory.java>
uses or overrides a deprecated API.
[INFO] <https://builds.apache.org/job/UIMA-uimaFIT/org.apache.uima$uimafit-core/ws/src/main/java/org/apache/uima/fit/factory/JCasFactory.java>:
Recompile with -Xlint:deprecation for details.
[INFO] <https://builds.apache.org/job/UIMA-uimaFIT/org.apache.uima$uimafit-core/ws/src/main/java/org/apache/uima/fit/util/FSCollectionFactory.java>:
Some input files use unchecked or unsafe operations.
[INFO] <https://builds.apache.org/job/UIMA-uimaFIT/org.apache.uima$uimafit-core/ws/src/main/java/org/apache/uima/fit/util/FSCollectionFactory.java>:
Recompile with -Xlint:unchecked for details.
[INFO] -------------------------------------------------------------
[ERROR] COMPILATION ERROR : 
[INFO] -------------------------------------------------------------
[ERROR] <https://builds.apache.org/job/UIMA-uimaFIT/org.apache.uima$uimafit-core/ws/src/main/java/org/apache/uima/fit/util/SimpleNamedResourceManager.java>:[116,38]
constructor ResourceRegistration in class org.apache.uima.resource.impl.ResourceManager_impl.ResourceRegistration
cannot be applied to given types;
  required: org.apache.uima.resource.Resource,org.apache.uima.resource.ExternalResourceDescription,java.lang.String
  found: java.lang.Object,<nulltype>,java.lang.String
  reason: actual argument java.lang.Object cannot be converted to org.apache.uima.resource.Resource
by method invocation conversion
[INFO] 1 error
[INFO] -------------------------------------------------------------
[INFO]                                                                         
[INFO] ------------------------------------------------------------------------
[INFO] Skipping Apache UIMA uimaFIT
[INFO] This project has been banned from the build due to previous failures.
[INFO] ------------------------------------------------------------------------
[INFO] ------------------------------------------------------------------------
[INFO] Reactor Summary:
[INFO] 
[INFO] Apache UIMA uimaFIT - Parent ....................... SUCCESS [01:11 min]
[INFO] Apache UIMA uimaFIT - Core ......................... FAILURE [ 13.853 s]
[INFO] Apache UIMA uimaFIT - Examples ..................... SKIPPED
[INFO] Apache UIMA uimaFIT - Spring integration ........... SKIPPED
[INFO] Apache UIMA uimaFIT - Maven Plugin ................. SKIPPED
[INFO] Apache UIMA uimaFIT - Legacy uimaFIT support ....... SKIPPED
[INFO] Apache UIMA uimaFIT - Documentation ................ SKIPPED
[INFO] Apache UIMA uimaFIT - Collection Processing Engine support SKIPPED
[INFO] Apache UIMA uimaFIT ................................ SKIPPED
[INFO] ------------------------------------------------------------------------
[INFO] BUILD FAILURE
[INFO] ------------------------------------------------------------------------
[INFO] Total time: 01:39 min
[INFO] Finished at: 2016-10-20T16:12:32+00:00
[INFO] Final Memory: 50M/134M
[INFO] ------------------------------------------------------------------------
[WARNING] The requested profile "jacoco" could not be activated because it does not exist.
Waiting for Jenkins to finish collecting data
[ERROR] Failed to execute goal org.apache.maven.plugins:maven-compiler-plugin:3.5.1:compile
(default-compile) on project uimafit-core: Compilation failure
[ERROR] <https://builds.apache.org/job/UIMA-uimaFIT/org.apache.uima$uimafit-core/ws/src/main/java/org/apache/uima/fit/util/SimpleNamedResourceManager.java>:[116,38]
constructor ResourceRegistration in class org.apache.uima.resource.impl.ResourceManager_impl.ResourceRegistration
cannot be applied to given types;
[ERROR] required: org.apache.uima.resource.Resource,org.apache.uima.resource.ExternalResourceDescription,java.lang.String
[ERROR] found: java.lang.Object,<nulltype>,java.lang.String
[ERROR] reason: actual argument java.lang.Object cannot be converted to org.apache.uima.resource.Resource
by method invocation conversion
[ERROR] -> [Help 1]
[ERROR] 
[ERROR] To see the full stack trace of the errors, re-run Maven with the -e switch.
[ERROR] Re-run Maven using the -X switch to enable full debug logging.
[ERROR] 
[ERROR] For more information about the errors and possible solutions, please read the following
articles:
[ERROR] [Help 1] http://cwiki.apache.org/confluence/display/MAVEN/MojoFailureException
[ERROR] 
[ERROR] After correcting the problems, you can resume the build with the command
[ERROR]   mvn <goals> -rf :uimafit-core

Mime
View raw message