uima-dev mailing list archives

Site index · List index
Message view « Date » · « Thread »
Top « Date » · « Thread »
From Apache Jenkins Server <jenk...@builds.apache.org>
Subject Build failed in Jenkins: UIMAJ-SDK_java9 #13
Date Fri, 14 Apr 2017 20:00:37 GMT
See <https://builds.apache.org/job/UIMAJ-SDK_java9/13/display/redirect?page=changes>

Changes:

[schor] [UIMA-5369] Java 9 enablement, plus upgrade versions of 2 maven plugins to match what
uv3 is using

------------------------------------------
[...truncated 295.15 KB...]
[INFO] Apache UIMA Eclipse: uimaj-ep-configurator: Descriptor Editor
[INFO] Apache UIMA Eclipse: uimaj-ep-pear-packager
[INFO] Apache UIMA Eclipse: uimaj-ep-launcher
[INFO] Apache UIMA Eclipse: uimaj-ep-cas-editor
[INFO] Apache UIMA Eclipse: uimaj-ep-cas-editor-ide
[INFO] Apache UIMA Eclipse: uimaj-ep-runtime
[INFO] Apache UIMA Eclipse: uimaj-eclipse-feature-tools
[INFO] Apache UIMA Eclipse: uimaj-eclipse-feature-runtime
[INFO] Apache UIMA Aggregate: aggregate-uimaj-eclipse-plugins
[INFO] Apache UIMA SDK Documentation - overview and setup
[INFO] Apache UIMA SDK Documentation - references
[INFO] Apache UIMA SDK Documentation - tools
[INFO] Apache UIMA SDK Documentation - tutorials and user's guides
[INFO] Apache UIMA Aggregate: aggregate-uimaj-docbooks
[INFO] Apache UIMA Maven: PearPackagingMavenPlugin
[INFO] Apache UIMA Maven: jcasgen-maven-plugin
[INFO] Apache UIMA Base: uimaj-bootstrap
[INFO] Apache UIMA Aggregate: aggregate-uimaj
[INFO] Apache UIMA Base: uimaj-json: JSON
[INFO] Apache UIMA Java SDK: uimaj
[INFO]                                                                         
[INFO] ------------------------------------------------------------------------
[INFO] Building Apache UIMA Java SDK: uimaj-parent 2.10.1-SNAPSHOT
[INFO] ------------------------------------------------------------------------
[INFO] 
[INFO] --- maven-clean-plugin:2.5:clean (default-clean) @ uimaj-parent ---
[INFO] 
[INFO] --- maven-enforcer-plugin:1.3.1:enforce (enforce-versions) @ uimaj-parent ---
[INFO] 
[INFO] --- build-helper-maven-plugin:1.8:parse-version (parse-project-version) @ uimaj-parent
---
[INFO] 
[INFO] --- uima-build-helper-maven-plugin:7:parse-date-time (set buildYear and buildMonth)
@ uimaj-parent ---
[INFO] 
[INFO] --- maven-remote-resources-plugin:1.5:process (default) @ uimaj-parent ---
[INFO] 
[INFO] --- maven-antrun-plugin:1.7:run (dup-meta-jar-cleanup) @ uimaj-parent ---
[INFO] Executing tasks

main:
[INFO] Executed tasks
[INFO] 
[INFO] --- maven-site-plugin:3.3:attach-descriptor (attach-descriptor) @ uimaj-parent ---
[INFO] 
[INFO] --- maven-pmd-plugin:3.6:cpd (default) @ uimaj-parent ---
[INFO] 
[INFO] --- maven-pmd-plugin:3.6:pmd (default) @ uimaj-parent ---
[INFO] 
[INFO] --- maven-install-plugin:2.5.1:install (default-install) @ uimaj-parent ---
[INFO] Installing <https://builds.apache.org/job/UIMAJ-SDK_java9/ws/uimaj-parent/pom.xml>
to /home/jenkins/jenkins-slave/maven-repositories/1/org/apache/uima/uimaj-parent/2.10.1-SNAPSHOT/uimaj-parent-2.10.1-SNAPSHOT.pom
[INFO] 
[INFO] >>> maven-dependency-plugin:2.9:analyze (default-cli) > test-compile @
uimaj-parent >>>
[INFO] 
[INFO] --- maven-enforcer-plugin:1.3.1:enforce (enforce-versions) @ uimaj-parent ---
[INFO] 
[INFO] --- build-helper-maven-plugin:1.8:parse-version (parse-project-version) @ uimaj-parent
---
[INFO] 
[INFO] --- uima-build-helper-maven-plugin:7:parse-date-time (set buildYear and buildMonth)
@ uimaj-parent ---
[INFO] 
[INFO] --- maven-remote-resources-plugin:1.5:process (default) @ uimaj-parent ---
[WARNING] Failed to getClass for org.apache.maven.plugin.dependency.analyze.AnalyzeMojo
[INFO] 
[INFO] <<< maven-dependency-plugin:2.9:analyze (default-cli) < test-compile @
uimaj-parent <<<
[INFO] 
[INFO] --- maven-dependency-plugin:2.9:analyze (default-cli) @ uimaj-parent ---
[INFO] Skipping pom project
[INFO]                                                                         
[INFO] ------------------------------------------------------------------------
[INFO] Building Apache UIMA Base: uimaj-test-util: JUnit utilities 2.10.1-SNAPSHOT
[INFO] ------------------------------------------------------------------------
[INFO] 
[INFO] --- maven-clean-plugin:2.5:clean (default-clean) @ uimaj-test-util ---
[INFO] 
[INFO] --- maven-enforcer-plugin:1.3.1:enforce (enforce-versions) @ uimaj-test-util ---
[INFO] 
[INFO] --- build-helper-maven-plugin:1.8:parse-version (parse-project-version) @ uimaj-test-util
---
[INFO] 
[INFO] --- uima-build-helper-maven-plugin:7:parse-date-time (set buildYear and buildMonth)
@ uimaj-test-util ---
[INFO] 
[INFO] --- maven-remote-resources-plugin:1.5:process (default) @ uimaj-test-util ---
[INFO] 
[INFO] --- maven-resources-plugin:2.6:resources (default-resources) @ uimaj-test-util ---
[INFO] Using 'UTF-8' encoding to copy filtered resources.
[INFO] Copying 0 resource
[INFO] Copying 3 resources
[INFO] 
[INFO] --- maven-compiler-plugin:3.1:compile (default-compile) @ uimaj-test-util ---
[INFO] Changes detected - recompiling the module!
[INFO] Compiling 7 source files to <https://builds.apache.org/job/UIMAJ-SDK_java9/ws/uimaj-test-util/target/classes>
[WARNING] <https://builds.apache.org/job/UIMAJ-SDK_java9/ws/uimaj-test-util/src/main/java/org/apache/uima/test/junit_extension/JUnitTestRunner.java>:
<https://builds.apache.org/job/UIMAJ-SDK_java9/ws/uimaj-test-util/src/main/java/org/apache/uima/test/junit_extension/JUnitTestRunner.java>
uses unchecked or unsafe operations.
[WARNING] <https://builds.apache.org/job/UIMAJ-SDK_java9/ws/uimaj-test-util/src/main/java/org/apache/uima/test/junit_extension/JUnitTestRunner.java>:
Recompile with -Xlint:unchecked for details.
[INFO] 
[INFO] --- maven-resources-plugin:2.6:testResources (default-testResources) @ uimaj-test-util
---
[INFO] Using 'UTF-8' encoding to copy filtered resources.
[INFO] skip non existing resourceDirectory <https://builds.apache.org/job/UIMAJ-SDK_java9/ws/uimaj-test-util/src/test/resources>
[INFO] Copying 3 resources
[INFO] 
[INFO] --- maven-compiler-plugin:3.1:testCompile (default-testCompile) @ uimaj-test-util ---
[INFO] Nothing to compile - all classes are up to date
[INFO] 
[INFO] --- maven-surefire-plugin:2.19.1:test (default-test) @ uimaj-test-util ---
[JENKINS] Recording test results[INFO] 
[INFO] --- maven-antrun-plugin:1.7:run (dup-meta-jar-cleanup) @ uimaj-test-util ---

[INFO] Executing tasks

main:
[INFO] Executed tasks
[INFO] 
[INFO] --- maven-jar-plugin:2.3.2:jar (default-jar) @ uimaj-test-util ---
[INFO] Building jar: <https://builds.apache.org/job/UIMAJ-SDK_java9/ws/uimaj-test-util/target/uimaj-test-util-2.10.1-SNAPSHOT.jar>
[INFO] 
[INFO] --- maven-site-plugin:3.3:attach-descriptor (attach-descriptor) @ uimaj-test-util ---
[INFO] 
[INFO] --- maven-pmd-plugin:3.6:cpd (default) @ uimaj-test-util ---
[INFO] 
[INFO] --- maven-pmd-plugin:3.6:pmd (default) @ uimaj-test-util ---
[INFO] 
[INFO] --- maven-install-plugin:2.5.1:install (default-install) @ uimaj-test-util ---
[INFO] Installing <https://builds.apache.org/job/UIMAJ-SDK_java9/ws/uimaj-test-util/target/uimaj-test-util-2.10.1-SNAPSHOT.jar>
to /home/jenkins/jenkins-slave/maven-repositories/1/org/apache/uima/uimaj-test-util/2.10.1-SNAPSHOT/uimaj-test-util-2.10.1-SNAPSHOT.jar
[INFO] Installing <https://builds.apache.org/job/UIMAJ-SDK_java9/ws/uimaj-test-util/pom.xml>
to /home/jenkins/jenkins-slave/maven-repositories/1/org/apache/uima/uimaj-test-util/2.10.1-SNAPSHOT/uimaj-test-util-2.10.1-SNAPSHOT.pom
[INFO] 
[INFO] >>> maven-dependency-plugin:2.9:analyze (default-cli) > test-compile @
uimaj-test-util >>>
[INFO] 
[INFO] --- maven-enforcer-plugin:1.3.1:enforce (enforce-versions) @ uimaj-test-util ---
[INFO] 
[INFO] --- build-helper-maven-plugin:1.8:parse-version (parse-project-version) @ uimaj-test-util
---
[INFO] 
[INFO] --- uima-build-helper-maven-plugin:7:parse-date-time (set buildYear and buildMonth)
@ uimaj-test-util ---
[INFO] 
[INFO] --- maven-remote-resources-plugin:1.5:process (default) @ uimaj-test-util ---
[INFO] 
[INFO] --- maven-resources-plugin:2.6:resources (default-resources) @ uimaj-test-util ---
[INFO] Using 'UTF-8' encoding to copy filtered resources.
[INFO] Copying 0 resource
[INFO] Copying 3 resources
[INFO] Copying 3 resources
[INFO] 
[INFO] --- maven-compiler-plugin:3.1:compile (default-compile) @ uimaj-test-util ---
[INFO] Nothing to compile - all classes are up to date
[INFO] 
[INFO] --- maven-resources-plugin:2.6:testResources (default-testResources) @ uimaj-test-util
---
[INFO] Using 'UTF-8' encoding to copy filtered resources.
[INFO] skip non existing resourceDirectory <https://builds.apache.org/job/UIMAJ-SDK_java9/ws/uimaj-test-util/src/test/resources>
[INFO] Copying 3 resources
[INFO] Copying 3 resources
[INFO] 
[INFO] --- maven-compiler-plugin:3.1:testCompile (default-testCompile) @ uimaj-test-util ---
[INFO] Nothing to compile - all classes are up to date
[WARNING] Failed to getClass for org.apache.maven.plugin.dependency.analyze.AnalyzeMojo
[INFO] 
[INFO] <<< maven-dependency-plugin:2.9:analyze (default-cli) < test-compile @
uimaj-test-util <<<
[INFO] 
[INFO] --- maven-dependency-plugin:2.9:analyze (default-cli) @ uimaj-test-util ---
[INFO]                                                                         
[INFO] ------------------------------------------------------------------------
[INFO] Skipping Apache UIMA Java SDK: uimaj
[INFO] This project has been banned from the build due to previous failures.
[INFO] ------------------------------------------------------------------------
[INFO] ------------------------------------------------------------------------
[INFO] Reactor Summary:
[INFO] 
[INFO] Apache UIMA Java SDK: uimaj-parent ................. SUCCESS [  9.298 s]
[INFO] Apache UIMA Base: uimaj-test-util: JUnit utilities . FAILURE [  6.597 s]
[INFO] Apache UIMA Base: uimaj-core ....................... SKIPPED
[INFO] Apache UIMA Base: jVinci: Vinci Transport Library .. SKIPPED
[INFO] Apache UIMA Base: uimaj-adapter-vinci: Vinci Adapter SKIPPED
[INFO] Apache UIMA Base: uimaj-cpe: Collection Processing Engine SKIPPED
[INFO] Apache UIMA Base: uimaj-document-annotation ........ SKIPPED
[INFO] Apache UIMA Base: uimaj-tools: Tools ............... SKIPPED
[INFO] Apache UIMA Base: uimaj-examples: SDK Examples ..... SKIPPED
[INFO] Apache UIMA Base: uimaj-adapter-soap: SOAP Adapter . SKIPPED
[INFO] Apache UIMA Base: uimaj-component-test-util: for JUnit SKIPPED
[INFO] Apache UIMA Eclipse: uimaj-ep-debug ................ SKIPPED
[INFO] Apache UIMA Eclipse: uimaj-ep-jcasgen .............. SKIPPED
[INFO] Apache UIMA Eclipse: uimaj-ep-configurator: Descriptor Editor SKIPPED
[INFO] Apache UIMA Eclipse: uimaj-ep-pear-packager ........ SKIPPED
[INFO] Apache UIMA Eclipse: uimaj-ep-launcher ............. SKIPPED
[INFO] Apache UIMA Eclipse: uimaj-ep-cas-editor ........... SKIPPED
[INFO] Apache UIMA Eclipse: uimaj-ep-cas-editor-ide ....... SKIPPED
[INFO] Apache UIMA Eclipse: uimaj-ep-runtime .............. SKIPPED
[INFO] Apache UIMA Eclipse: uimaj-eclipse-feature-tools ... SKIPPED
[INFO] Apache UIMA Eclipse: uimaj-eclipse-feature-runtime . SKIPPED
[INFO] Apache UIMA Aggregate: aggregate-uimaj-eclipse-plugins SKIPPED
[INFO] Apache UIMA SDK Documentation - overview and setup . SKIPPED
[INFO] Apache UIMA SDK Documentation - references ......... SKIPPED
[INFO] Apache UIMA SDK Documentation - tools .............. SKIPPED
[INFO] Apache UIMA SDK Documentation - tutorials and user's guides SKIPPED
[INFO] Apache UIMA Aggregate: aggregate-uimaj-docbooks .... SKIPPED
[INFO] Apache UIMA Maven: PearPackagingMavenPlugin ........ SKIPPED
[INFO] Apache UIMA Maven: jcasgen-maven-plugin ............ SKIPPED
[INFO] Apache UIMA Base: uimaj-bootstrap .................. SKIPPED
[INFO] Apache UIMA Aggregate: aggregate-uimaj ............. SKIPPED
[INFO] Apache UIMA Base: uimaj-json: JSON ................. SKIPPED
[INFO] Apache UIMA Java SDK: uimaj ........................ SKIPPED
[INFO] ------------------------------------------------------------------------
[INFO] BUILD FAILURE
[INFO] ------------------------------------------------------------------------
[INFO] Total time: 25.755 s
[INFO] Finished at: 2017-04-14T19:59:47+00:00
[INFO] Final Memory: 49M/256M
[INFO] ------------------------------------------------------------------------
Waiting for Jenkins to finish collecting data
[ERROR] Failed to execute goal org.apache.maven.plugins:maven-dependency-plugin:2.9:analyze
(default-cli) on project uimaj-test-util: Execution default-cli of goal org.apache.maven.plugins:maven-dependency-plugin:2.9:analyze
failed. IllegalArgumentException -> [Help 1]
[ERROR] 
[ERROR] To see the full stack trace of the errors, re-run Maven with the -e switch.
[ERROR] Re-run Maven using the -X switch to enable full debug logging.
[ERROR] 
[ERROR] For more information about the errors and possible solutions, please read the following
articles:
[ERROR] [Help 1] http://cwiki.apache.org/confluence/display/MAVEN/PluginExecutionException
[ERROR] 
[ERROR] After correcting the problems, you can resume the build with the command
[ERROR]   mvn <goals> -rf :uimaj-test-util
[JENKINS] Archiving <https://builds.apache.org/job/UIMAJ-SDK_java9/ws/uimaj-eclipse-feature-runtime/pom.xml>
to org.apache.uima/uimaj-eclipse-feature-runtime/2.10.1-SNAPSHOT/uimaj-eclipse-feature-runtime-2.10.1-SNAPSHOT.pom
[JENKINS] Archiving <https://builds.apache.org/job/UIMAJ-SDK_java9/ws/uimaj-ep-launcher/pom.xml>
to org.apache.uima/uimaj-ep-launcher/2.10.1-SNAPSHOT/uimaj-ep-launcher-2.10.1-SNAPSHOT.pom
[JENKINS] Archiving <https://builds.apache.org/job/UIMAJ-SDK_java9/ws/uimaj-eclipse-feature-tools/pom.xml>
to org.apache.uima/uimaj-eclipse-feature-tools/2.10.1-SNAPSHOT/uimaj-eclipse-feature-tools-2.10.1-SNAPSHOT.pom
[JENKINS] Archiving <https://builds.apache.org/job/UIMAJ-SDK_java9/ws/uimaj-bootstrap/pom.xml>
to org.apache.uima/uimaj-bootstrap/2.10.1-SNAPSHOT/uimaj-bootstrap-2.10.1-SNAPSHOT.pom
[JENKINS] Archiving <https://builds.apache.org/job/UIMAJ-SDK_java9/ws/aggregate-uimaj-eclipse-plugins/pom.xml>
to org.apache.uima/aggregate-uimaj-eclipse-plugins/2.10.1-SNAPSHOT/aggregate-uimaj-eclipse-plugins-2.10.1-SNAPSHOT.pom
[JENKINS] Archiving <https://builds.apache.org/job/UIMAJ-SDK_java9/ws/uimaj-core/pom.xml>
to org.apache.uima/uimaj-core/2.10.1-SNAPSHOT/uimaj-core-2.10.1-SNAPSHOT.pom
[JENKINS] Archiving <https://builds.apache.org/job/UIMAJ-SDK_java9/ws/uimaj-component-test-util/pom.xml>
to org.apache.uima/uimaj-component-test-util/2.10.1-SNAPSHOT/uimaj-component-test-util-2.10.1-SNAPSHOT.pom
[JENKINS] Archiving <https://builds.apache.org/job/UIMAJ-SDK_java9/ws/aggregate-uimaj-docbooks/pom.xml>
to org.apache.uima/aggregate-uimaj-docbooks/2.10.1-SNAPSHOT/aggregate-uimaj-docbooks-2.10.1-SNAPSHOT.pom
[JENKINS] Archiving <https://builds.apache.org/job/UIMAJ-SDK_java9/ws/uima-docbook-tools/pom.xml>
to org.apache.uima/uima-docbook-tools/2.10.1-SNAPSHOT/uima-docbook-tools-2.10.1-SNAPSHOT.pom
[JENKINS] Archiving <https://builds.apache.org/job/UIMAJ-SDK_java9/ws/uimaj-document-annotation/pom.xml>
to org.apache.uima/uimaj-document-annotation/2.10.1-SNAPSHOT/uimaj-document-annotation-2.10.1-SNAPSHOT.pom
[JENKINS] Archiving <https://builds.apache.org/job/UIMAJ-SDK_java9/ws/jVinci/pom.xml>
to org.apache.uima/jVinci/2.10.1-SNAPSHOT/jVinci-2.10.1-SNAPSHOT.pom
[JENKINS] Archiving <https://builds.apache.org/job/UIMAJ-SDK_java9/ws/uimaj-ep-configurator/pom.xml>
to org.apache.uima/uimaj-ep-configurator/2.10.1-SNAPSHOT/uimaj-ep-configurator-2.10.1-SNAPSHOT.pom
[JENKINS] Archiving <https://builds.apache.org/job/UIMAJ-SDK_java9/ws/uimaj-examples/pom.xml>
to org.apache.uima/uimaj-examples/2.10.1-SNAPSHOT/uimaj-examples-2.10.1-SNAPSHOT.pom
[JENKINS] Archiving <https://builds.apache.org/job/UIMAJ-SDK_java9/ws/uimaj-adapter-vinci/pom.xml>
to org.apache.uima/uimaj-adapter-vinci/2.10.1-SNAPSHOT/uimaj-adapter-vinci-2.10.1-SNAPSHOT.pom
[JENKINS] Archiving <https://builds.apache.org/job/UIMAJ-SDK_java9/ws/PearPackagingMavenPlugin/pom.xml>
to org.apache.uima/PearPackagingMavenPlugin/2.10.1-SNAPSHOT/PearPackagingMavenPlugin-2.10.1-SNAPSHOT.pom
[JENKINS] Archiving <https://builds.apache.org/job/UIMAJ-SDK_java9/ws/uimaj-ep-cas-editor-ide/pom.xml>
to org.apache.uima/uimaj-ep-cas-editor-ide/2.10.1-SNAPSHOT/uimaj-ep-cas-editor-ide-2.10.1-SNAPSHOT.pom
[JENKINS] Archiving <https://builds.apache.org/job/UIMAJ-SDK_java9/ws/uimaj-test-util/pom.xml>
to org.apache.uima/uimaj-test-util/2.10.1-SNAPSHOT/uimaj-test-util-2.10.1-SNAPSHOT.pom
[JENKINS] Archiving <https://builds.apache.org/job/UIMAJ-SDK_java9/ws/uimaj-test-util/target/uimaj-test-util-2.10.1-SNAPSHOT.jar>
to org.apache.uima/uimaj-test-util/2.10.1-SNAPSHOT/uimaj-test-util-2.10.1-SNAPSHOT.jar
[JENKINS] Archiving <https://builds.apache.org/job/UIMAJ-SDK_java9/ws/uimaj-ep-runtime/pom.xml>
to org.apache.uima/uimaj-ep-runtime/2.10.1-SNAPSHOT/uimaj-ep-runtime-2.10.1-SNAPSHOT.pom
[JENKINS] Archiving <https://builds.apache.org/job/UIMAJ-SDK_java9/ws/uimaj-ep-debug/pom.xml>
to org.apache.uima/uimaj-ep-debug/2.10.1-SNAPSHOT/uimaj-ep-debug-2.10.1-SNAPSHOT.pom
[JENKINS] Archiving <https://builds.apache.org/job/UIMAJ-SDK_java9/ws/uimaj-ep-cas-editor/pom.xml>
to org.apache.uima/uimaj-ep-cas-editor/2.10.1-SNAPSHOT/uimaj-ep-cas-editor-2.10.1-SNAPSHOT.pom
[JENKINS] Archiving <https://builds.apache.org/job/UIMAJ-SDK_java9/ws/aggregate-uimaj/pom.xml>
to org.apache.uima/aggregate-uimaj/2.10.1-SNAPSHOT/aggregate-uimaj-2.10.1-SNAPSHOT.pom
[JENKINS] Archiving <https://builds.apache.org/job/UIMAJ-SDK_java9/ws/uimaj-parent/pom.xml>
to org.apache.uima/uimaj-parent/2.10.1-SNAPSHOT/uimaj-parent-2.10.1-SNAPSHOT.pom
[JENKINS] Archiving <https://builds.apache.org/job/UIMAJ-SDK_java9/ws/jcasgen-maven-plugin/pom.xml>
to org.apache.uima/jcasgen-maven-plugin/2.10.1-SNAPSHOT/jcasgen-maven-plugin-2.10.1-SNAPSHOT.pom
[JENKINS] Archiving <https://builds.apache.org/job/UIMAJ-SDK_java9/ws/pom.xml> to org.apache.uima/uimaj/2.10.1-SNAPSHOT/uimaj-2.10.1-SNAPSHOT.pom
No prior successful build to compare, so performing full copy of artifacts
[JENKINS] Archiving <https://builds.apache.org/job/UIMAJ-SDK_java9/ws/uimaj-ep-jcasgen/pom.xml>
to org.apache.uima/uimaj-ep-jcasgen/2.10.1-SNAPSHOT/uimaj-ep-jcasgen-2.10.1-SNAPSHOT.pom
[JENKINS] Archiving <https://builds.apache.org/job/UIMAJ-SDK_java9/ws/uimaj-json/pom.xml>
to org.apache.uima/uimaj-json/2.10.1-SNAPSHOT/uimaj-json-2.10.1-SNAPSHOT.pom
[JENKINS] Archiving <https://builds.apache.org/job/UIMAJ-SDK_java9/ws/uimaj-tools/pom.xml>
to org.apache.uima/uimaj-tools/2.10.1-SNAPSHOT/uimaj-tools-2.10.1-SNAPSHOT.pom
[JENKINS] Archiving <https://builds.apache.org/job/UIMAJ-SDK_java9/ws/uima-docbook-tutorials-and-users-guides/pom.xml>
to org.apache.uima/uima-docbook-tutorials-and-users-guides/2.10.1-SNAPSHOT/uima-docbook-tutorials-and-users-guides-2.10.1-SNAPSHOT.pom
[JENKINS] Archiving <https://builds.apache.org/job/UIMAJ-SDK_java9/ws/uimaj-adapter-soap/pom.xml>
to org.apache.uima/uimaj-adapter-soap/2.10.1-SNAPSHOT/uimaj-adapter-soap-2.10.1-SNAPSHOT.pom
[JENKINS] Archiving <https://builds.apache.org/job/UIMAJ-SDK_java9/ws/uimaj-ep-pear-packager/pom.xml>
to org.apache.uima/uimaj-ep-pear-packager/2.10.1-SNAPSHOT/uimaj-ep-pear-packager-2.10.1-SNAPSHOT.pom
[JENKINS] Archiving <https://builds.apache.org/job/UIMAJ-SDK_java9/ws/uima-docbook-overview-and-setup/pom.xml>
to org.apache.uima/uima-docbook-overview-and-setup/2.10.1-SNAPSHOT/uima-docbook-overview-and-setup-2.10.1-SNAPSHOT.pom
[JENKINS] Archiving <https://builds.apache.org/job/UIMAJ-SDK_java9/ws/uima-docbook-references/pom.xml>
to org.apache.uima/uima-docbook-references/2.10.1-SNAPSHOT/uima-docbook-references-2.10.1-SNAPSHOT.pom
[JENKINS] Archiving <https://builds.apache.org/job/UIMAJ-SDK_java9/ws/uimaj-cpe/pom.xml>
to org.apache.uima/uimaj-cpe/2.10.1-SNAPSHOT/uimaj-cpe-2.10.1-SNAPSHOT.pom
Sending e-mails to: dev@uima.apache.org
channel stopped

Mime
View raw message