uima-dev mailing list archives

Site index · List index
Message view « Date » · « Thread »
Top « Date » · « Thread »
From Apache Jenkins Server <jenk...@builds.apache.org>
Subject Build failed in Jenkins: UIMA-SDK #959
Date Fri, 18 Aug 2017 20:06:00 GMT
See <https://builds.apache.org/job/UIMA-SDK/959/display/redirect?page=changes>

Changes:

[schor] no Jira prepare for 2.10.1 release

[schor] no jira -spelling and comments

------------------------------------------
[...truncated 1.34 MB...]
[INFO] 
[INFO] >>> maven-dependency-plugin:2.9:analyze (default-cli) > test-compile @
uima-docbook-overview-and-setup >>>
[INFO] 
[INFO] --- maven-enforcer-plugin:1.3.1:enforce (enforce-versions) @ uima-docbook-overview-and-setup
---
[INFO] 
[INFO] --- build-helper-maven-plugin:1.8:parse-version (parse-project-version) @ uima-docbook-overview-and-setup
---
[INFO] 
[INFO] --- uima-build-helper-maven-plugin:7:parse-date-time (set buildYear and buildMonth)
@ uima-docbook-overview-and-setup ---
[INFO] 
[INFO] --- jacoco-maven-plugin:0.7.6.201602180812:prepare-agent (default-prepare-agent) @
uima-docbook-overview-and-setup ---
[INFO] jacoco.argLine set to -javaagent:/home/jenkins/jenkins-slave/maven-repositories/1/org/jacoco/org.jacoco.agent/0.7.6.201602180812/org.jacoco.agent-0.7.6.201602180812-runtime.jar=destfile=<https://builds.apache.org/job/UIMA-SDK/ws/trunk/uima-docbook-overview-and-setup/target/jacoco.exec,excludes=**/org/apache/uima/examples/SourceDocumentInformation*>:**/org/apache/uima/examples/SourceDocumentInformation_Type*
[INFO] 
[INFO] --- maven-remote-resources-plugin:1.5:process (default) @ uima-docbook-overview-and-setup
---
[WARNING] Failed to getClass for org.apache.maven.plugin.dependency.analyze.AnalyzeMojo
[INFO] 
[INFO] <<< maven-dependency-plugin:2.9:analyze (default-cli) < test-compile @
uima-docbook-overview-and-setup <<<
[INFO] 
[INFO] --- maven-dependency-plugin:2.9:analyze (default-cli) @ uima-docbook-overview-and-setup
---
[INFO] Skipping pom project
[INFO]                                                                         
[INFO] ------------------------------------------------------------------------
[INFO] Building Apache UIMA SDK Documentation - references 2.10.1-SNAPSHOT
[INFO] ------------------------------------------------------------------------
[INFO] 
[INFO] --- maven-clean-plugin:2.5:clean (default-clean) @ uima-docbook-references ---
[TASKS] Scanning folder '<https://builds.apache.org/job/UIMA-SDK/ws/trunk/uima-docbook-references'>
for files matching the pattern '**/*.java' - excludes: 
[TASKS] Found 0 files to scan for tasks
Found 0 open tasks.
[TASKS] Computing warning deltas based on reference build #958
[INFO] 
[INFO] --- maven-enforcer-plugin:1.3.1:enforce (enforce-versions) @ uima-docbook-references
---
[INFO] 
[INFO] --- build-helper-maven-plugin:1.8:parse-version (parse-project-version) @ uima-docbook-references
---
[INFO] 
[INFO] --- uima-build-helper-maven-plugin:7:parse-date-time (set buildYear and buildMonth)
@ uima-docbook-references ---
[INFO] 
[INFO] --- jacoco-maven-plugin:0.7.6.201602180812:prepare-agent (default-prepare-agent) @
uima-docbook-references ---
[INFO] jacoco.argLine set to -javaagent:/home/jenkins/jenkins-slave/maven-repositories/1/org/jacoco/org.jacoco.agent/0.7.6.201602180812/org.jacoco.agent-0.7.6.201602180812-runtime.jar=destfile=<https://builds.apache.org/job/UIMA-SDK/ws/trunk/uima-docbook-references/target/jacoco.exec,excludes=**/org/apache/uima/examples/SourceDocumentInformation*>:**/org/apache/uima/examples/SourceDocumentInformation_Type*
[INFO] 
[INFO] --- maven-remote-resources-plugin:1.5:process (default) @ uima-docbook-references ---
[INFO] 
[INFO] --- maven-antrun-plugin:1.7:run (dup-meta-jar-cleanup) @ uima-docbook-references ---
[INFO] Executing tasks

main:
[INFO] Executed tasks
[INFO] 
[INFO] --- maven-dependency-plugin:2.9:unpack (copyDocbookInfo) @ uima-docbook-references
---
[INFO] Configured Artifact: org.apache.uima:uima-build-resources:5:jar
[INFO] Unpacking /home/jenkins/jenkins-slave/maven-repositories/1/org/apache/uima/uima-build-resources/5/uima-build-resources-5.jar
to <https://builds.apache.org/job/UIMA-SDK/ws/trunk/uima-docbook-references/target>
with includes "docbook-shared/**" and excludes ""
[INFO] 
[INFO] --- maven-dependency-plugin:2.9:unpack (copyDocbookInfoNextToOlink) @ uima-docbook-references
---
[INFO] Configured Artifact: org.apache.uima:uima-build-resources:5:jar
[INFO] uima-build-resources-5.jar already unpacked.
[INFO] 
[INFO] --- maven-dependency-plugin:2.9:unpack (getOlink) @ uima-docbook-references ---
[INFO] Configured Artifact: org.apache.uima:uima-docbook-olink:olink:1-SNAPSHOT:zip
[INFO] uima-docbook-olink-1-SNAPSHOT-olink.zip already unpacked.
[INFO] 
[INFO] --- jacoco-maven-plugin:0.7.6.201602180812:report (default-report) @ uima-docbook-references
---
[INFO] Skipping JaCoCo execution due to missing execution data <https://builds.apache.org/job/UIMA-SDK/ws/trunk/uima-docbook-references/target/jacoco.exec>
[PMD] No report found for mojo report
[INFO] 
[INFO] --- maven-site-plugin:3.3:attach-descriptor (attach-descriptor) @ uima-docbook-references
---
[INFO] 
[INFO] --- docbkx-maven-plugin:2.0.14:generate-html (html) @ uima-docbook-references ---
[INFO] Processing input file: references.xml
[INFO] Applying customization parameters
[INFO] <https://builds.apache.org/job/UIMA-SDK/ws/trunk/uima-docbook-references/target/site/d/references.html>
has been generated.
[INFO] 
[INFO] --- docbkx-maven-plugin:2.0.14:generate-pdf (pdf) @ uima-docbook-references ---
[INFO] Processing input file: references.xml
[INFO] Applying customization parameters
[INFO]                                                                         
[INFO] ------------------------------------------------------------------------
[INFO] Skipping Apache UIMA Java SDK: uimaj
[INFO] This project has been banned from the build due to previous failures.
[INFO] ------------------------------------------------------------------------
[INFO] ------------------------------------------------------------------------
[INFO] Reactor Summary:
[INFO] 
[INFO] Apache UIMA Java SDK: uimaj-parent ................. SUCCESS [ 19.003 s]
[INFO] Apache UIMA Base: uimaj-test-util: JUnit utilities . SUCCESS [ 32.404 s]
[INFO] Apache UIMA Base: uimaj-core ....................... SUCCESS [02:47 min]
[INFO] Apache UIMA Base: jVinci: Vinci Transport Library .. SUCCESS [ 20.861 s]
[INFO] Apache UIMA Base: uimaj-adapter-vinci: Vinci Adapter SUCCESS [ 18.600 s]
[INFO] Apache UIMA Base: uimaj-cpe: Collection Processing Engine SUCCESS [ 51.260 s]
[INFO] Apache UIMA Base: uimaj-document-annotation ........ SUCCESS [ 15.212 s]
[INFO] Apache UIMA Base: uimaj-tools: Tools ............... SUCCESS [ 54.048 s]
[INFO] Apache UIMA Base: uimaj-examples: SDK Examples ..... SUCCESS [ 20.911 s]
[INFO] Apache UIMA Base: uimaj-adapter-soap: SOAP Adapter . SUCCESS [ 17.023 s]
[INFO] Apache UIMA Base: uimaj-component-test-util: for JUnit SUCCESS [ 15.502 s]
[INFO] Apache UIMA Eclipse: uimaj-ep-debug ................ SUCCESS [01:06 min]
[INFO] Apache UIMA Eclipse: uimaj-ep-jcasgen .............. SUCCESS [ 17.121 s]
[INFO] Apache UIMA Eclipse: uimaj-ep-configurator: Descriptor Editor SUCCESS [ 57.064 s]
[INFO] Apache UIMA Eclipse: uimaj-ep-pear-packager ........ SUCCESS [ 21.239 s]
[INFO] Apache UIMA Eclipse: uimaj-ep-launcher ............. SUCCESS [ 28.761 s]
[INFO] Apache UIMA Eclipse: uimaj-ep-cas-editor ........... SUCCESS [ 37.661 s]
[INFO] Apache UIMA Eclipse: uimaj-ep-cas-editor-ide ....... SUCCESS [ 19.102 s]
[INFO] Apache UIMA Eclipse: uimaj-ep-runtime .............. SUCCESS [ 11.385 s]
[INFO] Apache UIMA Eclipse: uimaj-eclipse-feature-tools ... SUCCESS [  9.519 s]
[INFO] Apache UIMA Eclipse: uimaj-eclipse-feature-runtime . SUCCESS [  9.765 s]
[INFO] Apache UIMA Aggregate: aggregate-uimaj-eclipse-plugins SUCCESS [  6.146 s]
[INFO] Apache UIMA SDK Documentation - overview and setup . SUCCESS [ 19.027 s]
[INFO] Apache UIMA SDK Documentation - references ......... FAILURE [  8.784 s]
[INFO] Apache UIMA SDK Documentation - tools .............. SKIPPED
[INFO] Apache UIMA SDK Documentation - tutorials and user's guides SKIPPED
[INFO] Apache UIMA Aggregate: aggregate-uimaj-docbooks .... SKIPPED
[INFO] Apache UIMA Maven: PearPackagingMavenPlugin ........ SKIPPED
[INFO] Apache UIMA Maven: jcasgen-maven-plugin ............ SKIPPED
[INFO] Apache UIMA Base: uimaj-bootstrap .................. SKIPPED
[INFO] Apache UIMA Aggregate: aggregate-uimaj ............. SKIPPED
[INFO] Apache UIMA Base: uimaj-json: JSON ................. SKIPPED
[INFO] Apache UIMA Java SDK: uimaj ........................ SKIPPED
[INFO] ------------------------------------------------------------------------
[INFO] BUILD FAILURE
[INFO] ------------------------------------------------------------------------
[INFO] Total time: 13:27 min
[INFO] Finished at: 2017-08-18T20:05:13+00:00
[INFO] Final Memory: 118M/517M
[INFO] ------------------------------------------------------------------------
[ERROR] Failed to execute goal com.agilejava.docbkx:docbkx-maven-plugin:2.0.14:generate-pdf
(pdf) on project uima-docbook-references: Execution pdf of goal com.agilejava.docbkx:docbkx-maven-plugin:2.0.14:generate-pdf
failed: An API incompatibility was encountered while executing com.agilejava.docbkx:docbkx-maven-plugin:2.0.14:generate-pdf:
java.lang.IncompatibleClassChangeError: vtable stub
[ERROR] -----------------------------------------------------
[ERROR] realm =    plugin>com.agilejava.docbkx:docbkx-maven-plugin:2.0.14
[ERROR] strategy = org.codehaus.plexus.classworlds.strategy.SelfFirstStrategy
[ERROR] urls[0] = file:/home/jenkins/jenkins-slave/maven-repositories/1/com/agilejava/docbkx/docbkx-maven-plugin/2.0.14/docbkx-maven-plugin-2.0.14.jar
[ERROR] urls[1] = file:/home/jenkins/jenkins-slave/maven-repositories/1/org/docbook/docbook-xml/4.4/docbook-xml-4.4.jar
[ERROR] urls[2] = file:/home/jenkins/jenkins-slave/maven-repositories/1/antlr/stringtemplate/2.2/stringtemplate-2.2.jar
[ERROR] urls[3] = file:/home/jenkins/jenkins-slave/maven-repositories/1/antlr/antlr/2.7.2/antlr-2.7.2.jar
[ERROR] urls[4] = file:/home/jenkins/jenkins-slave/maven-repositories/1/xerces/xercesImpl/2.8.0/xercesImpl-2.8.0.jar
[ERROR] urls[5] = file:/home/jenkins/jenkins-slave/maven-repositories/1/xml-apis/xml-apis/1.3.03/xml-apis-1.3.03.jar
[ERROR] urls[6] = file:/home/jenkins/jenkins-slave/maven-repositories/1/xerces/xmlParserAPIs/2.6.2/xmlParserAPIs-2.6.2.jar
[ERROR] urls[7] = file:/home/jenkins/jenkins-slave/maven-repositories/1/org/apache/xmlgraphics/fop/1.0/fop-1.0.jar
[ERROR] urls[8] = file:/home/jenkins/jenkins-slave/maven-repositories/1/org/apache/xmlgraphics/xmlgraphics-commons/1.4/xmlgraphics-commons-1.4.jar
[ERROR] urls[9] = file:/home/jenkins/jenkins-slave/maven-repositories/1/org/apache/xmlgraphics/batik-svg-dom/1.7/batik-svg-dom-1.7.jar
[ERROR] urls[10] = file:/home/jenkins/jenkins-slave/maven-repositories/1/org/apache/xmlgraphics/batik-anim/1.7/batik-anim-1.7.jar
[ERROR] urls[11] = file:/home/jenkins/jenkins-slave/maven-repositories/1/org/apache/xmlgraphics/batik-css/1.7/batik-css-1.7.jar
[ERROR] urls[12] = file:/home/jenkins/jenkins-slave/maven-repositories/1/org/apache/xmlgraphics/batik-dom/1.7/batik-dom-1.7.jar
[ERROR] urls[13] = file:/home/jenkins/jenkins-slave/maven-repositories/1/org/apache/xmlgraphics/batik-parser/1.7/batik-parser-1.7.jar
[ERROR] urls[14] = file:/home/jenkins/jenkins-slave/maven-repositories/1/org/apache/xmlgraphics/batik-util/1.7/batik-util-1.7.jar
[ERROR] urls[15] = file:/home/jenkins/jenkins-slave/maven-repositories/1/xml-apis/xml-apis-ext/1.3.04/xml-apis-ext-1.3.04.jar
[ERROR] urls[16] = file:/home/jenkins/jenkins-slave/maven-repositories/1/org/apache/xmlgraphics/batik-bridge/1.7/batik-bridge-1.7.jar
[ERROR] urls[17] = file:/home/jenkins/jenkins-slave/maven-repositories/1/org/apache/xmlgraphics/batik-script/1.7/batik-script-1.7.jar
[ERROR] urls[18] = file:/home/jenkins/jenkins-slave/maven-repositories/1/org/apache/xmlgraphics/batik-js/1.7/batik-js-1.7.jar
[ERROR] urls[19] = file:/home/jenkins/jenkins-slave/maven-repositories/1/org/apache/xmlgraphics/batik-xml/1.7/batik-xml-1.7.jar
[ERROR] urls[20] = file:/home/jenkins/jenkins-slave/maven-repositories/1/org/apache/xmlgraphics/batik-awt-util/1.7/batik-awt-util-1.7.jar
[ERROR] urls[21] = file:/home/jenkins/jenkins-slave/maven-repositories/1/org/apache/xmlgraphics/batik-gvt/1.7/batik-gvt-1.7.jar
[ERROR] urls[22] = file:/home/jenkins/jenkins-slave/maven-repositories/1/org/apache/xmlgraphics/batik-transcoder/1.7/batik-transcoder-1.7.jar
[ERROR] urls[23] = file:/home/jenkins/jenkins-slave/maven-repositories/1/org/apache/xmlgraphics/batik-svggen/1.7/batik-svggen-1.7.jar
[ERROR] urls[24] = file:/home/jenkins/jenkins-slave/maven-repositories/1/org/apache/xmlgraphics/batik-extension/1.7/batik-extension-1.7.jar
[ERROR] urls[25] = file:/home/jenkins/jenkins-slave/maven-repositories/1/org/apache/xmlgraphics/batik-ext/1.7/batik-ext-1.7.jar
[ERROR] urls[26] = file:/home/jenkins/jenkins-slave/maven-repositories/1/commons-logging/commons-logging/1.0.4/commons-logging-1.0.4.jar
[ERROR] urls[27] = file:/home/jenkins/jenkins-slave/maven-repositories/1/commons-io/commons-io/1.3.1/commons-io-1.3.1.jar
[ERROR] urls[28] = file:/home/jenkins/jenkins-slave/maven-repositories/1/org/apache/avalon/framework/avalon-framework-api/4.3.1/avalon-framework-api-4.3.1.jar
[ERROR] urls[29] = file:/home/jenkins/jenkins-slave/maven-repositories/1/org/apache/avalon/framework/avalon-framework-impl/4.3.1/avalon-framework-impl-4.3.1.jar
[ERROR] urls[30] = file:/home/jenkins/jenkins-slave/maven-repositories/1/xalan/xalan/2.7.0/xalan-2.7.0.jar
[ERROR] urls[31] = file:/home/jenkins/jenkins-slave/maven-repositories/1/org/codehaus/plexus/plexus-utils/1.1/plexus-utils-1.1.jar
[ERROR] urls[32] = file:/home/jenkins/jenkins-slave/maven-repositories/1/junit/junit/3.8.1/junit-3.8.1.jar
[ERROR] urls[33] = file:/home/jenkins/jenkins-slave/maven-repositories/1/com/agilejava/docbkx/docbkx-maven-base/2.0.14/docbkx-maven-base-2.0.14.jar
[ERROR] urls[34] = file:/home/jenkins/jenkins-slave/maven-repositories/1/commons-el/commons-el/1.0/commons-el-1.0.jar
[ERROR] urls[35] = file:/home/jenkins/jenkins-slave/maven-repositories/1/javax/servlet/jsp/jsp-api/2.0/jsp-api-2.0.jar
[ERROR] urls[36] = file:/home/jenkins/jenkins-slave/maven-repositories/1/jaxen/jaxen/1.0-FCS/jaxen-1.0-FCS.jar
[ERROR] urls[37] = file:/home/jenkins/jenkins-slave/maven-repositories/1/saxpath/saxpath/1.0-FCS/saxpath-1.0-FCS.jar
[ERROR] urls[38] = file:/home/jenkins/jenkins-slave/maven-repositories/1/xom/xom/1.1/xom-1.1.jar
[ERROR] urls[39] = file:/home/jenkins/jenkins-slave/maven-repositories/1/saxon/saxon/6.5.3/saxon-6.5.3.jar
[ERROR] urls[40] = file:/home/jenkins/jenkins-slave/maven-repositories/1/xml-resolver/xml-resolver/1.1/xml-resolver-1.1.jar
[ERROR] urls[41] = file:/home/jenkins/jenkins-slave/maven-repositories/1/plexus/plexus-utils/1.0.1/plexus-utils-1.0.1.jar
[ERROR] urls[42] = file:/home/jenkins/jenkins-slave/maven-repositories/1/org/codehaus/plexus/plexus-archiver/1.0-alpha-5/plexus-archiver-1.0-alpha-5.jar
[ERROR] urls[43] = file:/home/jenkins/jenkins-slave/maven-repositories/1/org/apache/maven/plugins/maven-antrun-plugin/1.1/maven-antrun-plugin-1.1.jar
[ERROR] urls[44] = file:/home/jenkins/jenkins-slave/maven-repositories/1/ant/ant-launcher/1.6.5/ant-launcher-1.6.5.jar
[ERROR] urls[45] = file:/home/jenkins/jenkins-slave/maven-repositories/1/ant/ant/1.6.5/ant-1.6.5.jar
[ERROR] urls[46] = file:/home/jenkins/jenkins-slave/maven-repositories/1/net/sf/xslthl/xslthl/2.0.1/xslthl-2.0.1.jar
[ERROR] urls[47] = file:/home/jenkins/jenkins-slave/maven-repositories/1/net/sf/docbook/docbook-xsl/1.76.1/docbook-xsl-1.76.1-ns-resources.zip
[ERROR] urls[48] = file:/home/jenkins/jenkins-slave/maven-repositories/1/net/sf/docbook/docbook-xsl-saxon/1.0.0/docbook-xsl-saxon-1.0.0.jar
[ERROR] urls[49] = file:/home/jenkins/jenkins-slave/maven-repositories/1/net/sf/docbook/docbook-xsl-webhelpindexer/1.0.0/docbook-xsl-webhelpindexer-1.0.0.jar
[ERROR] urls[50] = file:/home/jenkins/jenkins-slave/maven-repositories/1/org/apache/lucene/lucene-core/3.0.0/lucene-core-3.0.0.jar
[ERROR] urls[51] = file:/home/jenkins/jenkins-slave/maven-repositories/1/org/apache/lucene/lucene-analyzers/3.0.0/lucene-analyzers-3.0.0.jar
[ERROR] urls[52] = file:/home/jenkins/jenkins-slave/maven-repositories/1/org/apache/ant/ant/1.7.0/ant-1.7.0.jar
[ERROR] urls[53] = file:/home/jenkins/jenkins-slave/maven-repositories/1/org/apache/ant/ant-launcher/1.7.0/ant-launcher-1.7.0.jar
[ERROR] Number of foreign imports: 1
[ERROR] import: Entry[import  from realm ClassRealm[maven.api, parent: null]]
[ERROR] 
[ERROR] -----------------------------------------------------
[ERROR] -> [Help 1]
[ERROR] 
[ERROR] To see the full stack trace of the errors, re-run Maven with the -e switch.
[ERROR] Re-run Maven using the -X switch to enable full debug logging.
[ERROR] 
[ERROR] For more information about the errors and possible solutions, please read the following
articles:
[ERROR] [Help 1] http://cwiki.apache.org/confluence/display/MAVEN/PluginContainerException
[ERROR] 
[ERROR] After correcting the problems, you can resume the build with the command
[ERROR]   mvn <goals> -rf :uima-docbook-references
[JENKINS] Archiving <https://builds.apache.org/job/UIMA-SDK/ws/trunk/uimaj-eclipse-feature-runtime/pom.xml>
to org.apache.uima/uimaj-eclipse-feature-runtime/2.10.1-SNAPSHOT/uimaj-eclipse-feature-runtime-2.10.1-SNAPSHOT.pom
[JENKINS] Archiving <https://builds.apache.org/job/UIMA-SDK/ws/trunk/uimaj-eclipse-feature-runtime/target/uimaj-eclipse-feature-runtime_2.10.1.SNAPSHOT.jar>
to org.apache.uima/uimaj-eclipse-feature-runtime/2.10.1-SNAPSHOT/uimaj-eclipse-feature-runtime-2.10.1-SNAPSHOT.jar
[JENKINS] Archiving <https://builds.apache.org/job/UIMA-SDK/ws/trunk/uimaj-ep-launcher/pom.xml>
to org.apache.uima/uimaj-ep-launcher/2.10.1-SNAPSHOT/uimaj-ep-launcher-2.10.1-SNAPSHOT.pom
[JENKINS] Archiving <https://builds.apache.org/job/UIMA-SDK/ws/trunk/uimaj-ep-launcher/target/org.apache.uima.launcher_2.10.1.SNAPSHOT.jar>
to org.apache.uima/uimaj-ep-launcher/2.10.1-SNAPSHOT/uimaj-ep-launcher-2.10.1-SNAPSHOT.jar
[JENKINS] Archiving <https://builds.apache.org/job/UIMA-SDK/ws/trunk/uimaj-eclipse-feature-tools/pom.xml>
to org.apache.uima/uimaj-eclipse-feature-tools/2.10.1-SNAPSHOT/uimaj-eclipse-feature-tools-2.10.1-SNAPSHOT.pom
[JENKINS] Archiving <https://builds.apache.org/job/UIMA-SDK/ws/trunk/uimaj-eclipse-feature-tools/target/uimaj-eclipse-feature-tools_2.10.1.SNAPSHOT.jar>
to org.apache.uima/uimaj-eclipse-feature-tools/2.10.1-SNAPSHOT/uimaj-eclipse-feature-tools-2.10.1-SNAPSHOT.jar
[JENKINS] Archiving <https://builds.apache.org/job/UIMA-SDK/ws/trunk/uimaj-bootstrap/pom.xml>
to org.apache.uima/uimaj-bootstrap/2.10.1-SNAPSHOT/uimaj-bootstrap-2.10.1-SNAPSHOT.pom
[JENKINS] Archiving <https://builds.apache.org/job/UIMA-SDK/ws/trunk/aggregate-uimaj-eclipse-plugins/pom.xml>
to org.apache.uima/aggregate-uimaj-eclipse-plugins/2.10.1-SNAPSHOT/aggregate-uimaj-eclipse-plugins-2.10.1-SNAPSHOT.pom
[JENKINS] Archiving <https://builds.apache.org/job/UIMA-SDK/ws/trunk/uimaj-core/pom.xml>
to org.apache.uima/uimaj-core/2.10.1-SNAPSHOT/uimaj-core-2.10.1-SNAPSHOT.pom
[JENKINS] Archiving <https://builds.apache.org/job/UIMA-SDK/ws/trunk/uimaj-core/target/uima-core.jar>
to org.apache.uima/uimaj-core/2.10.1-SNAPSHOT/uimaj-core-2.10.1-SNAPSHOT.jar
[JENKINS] Archiving <https://builds.apache.org/job/UIMA-SDK/ws/trunk/uimaj-component-test-util/pom.xml>
to org.apache.uima/uimaj-component-test-util/2.10.1-SNAPSHOT/uimaj-component-test-util-2.10.1-SNAPSHOT.pom
[JENKINS] Archiving <https://builds.apache.org/job/UIMA-SDK/ws/trunk/uimaj-component-test-util/target/uimaj-component-test-util-2.10.1-SNAPSHOT.jar>
to org.apache.uima/uimaj-component-test-util/2.10.1-SNAPSHOT/uimaj-component-test-util-2.10.1-SNAPSHOT.jar
[JENKINS] Archiving <https://builds.apache.org/job/UIMA-SDK/ws/trunk/aggregate-uimaj-docbooks/pom.xml>
to org.apache.uima/aggregate-uimaj-docbooks/2.10.1-SNAPSHOT/aggregate-uimaj-docbooks-2.10.1-SNAPSHOT.pom
[JENKINS] Archiving <https://builds.apache.org/job/UIMA-SDK/ws/trunk/uima-docbook-tools/pom.xml>
to org.apache.uima/uima-docbook-tools/2.10.1-SNAPSHOT/uima-docbook-tools-2.10.1-SNAPSHOT.pom
[JENKINS] Archiving <https://builds.apache.org/job/UIMA-SDK/ws/trunk/uimaj-document-annotation/pom.xml>
to org.apache.uima/uimaj-document-annotation/2.10.1-SNAPSHOT/uimaj-document-annotation-2.10.1-SNAPSHOT.pom
[JENKINS] Archiving <https://builds.apache.org/job/UIMA-SDK/ws/trunk/uimaj-document-annotation/target/uima-document-annotation.jar>
to org.apache.uima/uimaj-document-annotation/2.10.1-SNAPSHOT/uimaj-document-annotation-2.10.1-SNAPSHOT.jar
[JENKINS] Archiving <https://builds.apache.org/job/UIMA-SDK/ws/trunk/jVinci/pom.xml>
to org.apache.uima/jVinci/2.10.1-SNAPSHOT/jVinci-2.10.1-SNAPSHOT.pom
[JENKINS] Archiving <https://builds.apache.org/job/UIMA-SDK/ws/trunk/jVinci/target/jVinci.jar>
to org.apache.uima/jVinci/2.10.1-SNAPSHOT/jVinci-2.10.1-SNAPSHOT.jar
[JENKINS] Archiving <https://builds.apache.org/job/UIMA-SDK/ws/trunk/uimaj-ep-configurator/pom.xml>
to org.apache.uima/uimaj-ep-configurator/2.10.1-SNAPSHOT/uimaj-ep-configurator-2.10.1-SNAPSHOT.pom
[JENKINS] Archiving <https://builds.apache.org/job/UIMA-SDK/ws/trunk/uimaj-ep-configurator/target/org.apache.uima.desceditor_2.10.1.SNAPSHOT.jar>
to org.apache.uima/uimaj-ep-configurator/2.10.1-SNAPSHOT/uimaj-ep-configurator-2.10.1-SNAPSHOT.jar
[JENKINS] Archiving <https://builds.apache.org/job/UIMA-SDK/ws/trunk/uimaj-examples/pom.xml>
to org.apache.uima/uimaj-examples/2.10.1-SNAPSHOT/uimaj-examples-2.10.1-SNAPSHOT.pom
[JENKINS] Archiving <https://builds.apache.org/job/UIMA-SDK/ws/trunk/uimaj-examples/target/uima-examples.jar>
to org.apache.uima/uimaj-examples/2.10.1-SNAPSHOT/uimaj-examples-2.10.1-SNAPSHOT.jar
[JENKINS] Archiving <https://builds.apache.org/job/UIMA-SDK/ws/trunk/uimaj-adapter-vinci/pom.xml>
to org.apache.uima/uimaj-adapter-vinci/2.10.1-SNAPSHOT/uimaj-adapter-vinci-2.10.1-SNAPSHOT.pom
[JENKINS] Archiving <https://builds.apache.org/job/UIMA-SDK/ws/trunk/uimaj-adapter-vinci/target/uima-adapter-vinci.jar>
to org.apache.uima/uimaj-adapter-vinci/2.10.1-SNAPSHOT/uimaj-adapter-vinci-2.10.1-SNAPSHOT.jar
[JENKINS] Archiving <https://builds.apache.org/job/UIMA-SDK/ws/trunk/PearPackagingMavenPlugin/pom.xml>
to org.apache.uima/PearPackagingMavenPlugin/2.10.1-SNAPSHOT/PearPackagingMavenPlugin-2.10.1-SNAPSHOT.pom
[JENKINS] Archiving <https://builds.apache.org/job/UIMA-SDK/ws/trunk/uimaj-ep-cas-editor-ide/pom.xml>
to org.apache.uima/uimaj-ep-cas-editor-ide/2.10.1-SNAPSHOT/uimaj-ep-cas-editor-ide-2.10.1-SNAPSHOT.pom
[JENKINS] Archiving <https://builds.apache.org/job/UIMA-SDK/ws/trunk/uimaj-ep-cas-editor-ide/target/org.apache.uima.caseditor.ide_2.10.1.SNAPSHOT.jar>
to org.apache.uima/uimaj-ep-cas-editor-ide/2.10.1-SNAPSHOT/uimaj-ep-cas-editor-ide-2.10.1-SNAPSHOT.jar
[JENKINS] Archiving <https://builds.apache.org/job/UIMA-SDK/ws/trunk/uimaj-test-util/pom.xml>
to org.apache.uima/uimaj-test-util/2.10.1-SNAPSHOT/uimaj-test-util-2.10.1-SNAPSHOT.pom
[JENKINS] Archiving <https://builds.apache.org/job/UIMA-SDK/ws/trunk/uimaj-test-util/target/uimaj-test-util-2.10.1-SNAPSHOT.jar>
to org.apache.uima/uimaj-test-util/2.10.1-SNAPSHOT/uimaj-test-util-2.10.1-SNAPSHOT.jar
[JENKINS] Archiving <https://builds.apache.org/job/UIMA-SDK/ws/trunk/uimaj-ep-runtime/pom.xml>
to org.apache.uima/uimaj-ep-runtime/2.10.1-SNAPSHOT/uimaj-ep-runtime-2.10.1-SNAPSHOT.pom
[JENKINS] Archiving <https://builds.apache.org/job/UIMA-SDK/ws/trunk/uimaj-ep-runtime/target/org.apache.uima.runtime_2.10.1.SNAPSHOT.jar>
to org.apache.uima/uimaj-ep-runtime/2.10.1-SNAPSHOT/uimaj-ep-runtime-2.10.1-SNAPSHOT.jar
[JENKINS] Archiving <https://builds.apache.org/job/UIMA-SDK/ws/trunk/uimaj-ep-debug/pom.xml>
to org.apache.uima/uimaj-ep-debug/2.10.1-SNAPSHOT/uimaj-ep-debug-2.10.1-SNAPSHOT.pom
[JENKINS] Archiving <https://builds.apache.org/job/UIMA-SDK/ws/trunk/uimaj-ep-debug/target/org.apache.uima.debug_2.10.1.SNAPSHOT.jar>
to org.apache.uima/uimaj-ep-debug/2.10.1-SNAPSHOT/uimaj-ep-debug-2.10.1-SNAPSHOT.jar
[JENKINS] Archiving <https://builds.apache.org/job/UIMA-SDK/ws/trunk/uimaj-ep-cas-editor/pom.xml>
to org.apache.uima/uimaj-ep-cas-editor/2.10.1-SNAPSHOT/uimaj-ep-cas-editor-2.10.1-SNAPSHOT.pom
[JENKINS] Archiving <https://builds.apache.org/job/UIMA-SDK/ws/trunk/uimaj-ep-cas-editor/target/org.apache.uima.caseditor_2.10.1.SNAPSHOT.jar>
to org.apache.uima/uimaj-ep-cas-editor/2.10.1-SNAPSHOT/uimaj-ep-cas-editor-2.10.1-SNAPSHOT.jar
[JENKINS] Archiving <https://builds.apache.org/job/UIMA-SDK/ws/trunk/aggregate-uimaj/pom.xml>
to org.apache.uima/aggregate-uimaj/2.10.1-SNAPSHOT/aggregate-uimaj-2.10.1-SNAPSHOT.pom
[JENKINS] Archiving <https://builds.apache.org/job/UIMA-SDK/ws/trunk/uimaj-parent/pom.xml>
to org.apache.uima/uimaj-parent/2.10.1-SNAPSHOT/uimaj-parent-2.10.1-SNAPSHOT.pom
[JENKINS] Archiving <https://builds.apache.org/job/UIMA-SDK/ws/trunk/jcasgen-maven-plugin/pom.xml>
to org.apache.uima/jcasgen-maven-plugin/2.10.1-SNAPSHOT/jcasgen-maven-plugin-2.10.1-SNAPSHOT.pom
[JENKINS] Archiving <https://builds.apache.org/job/UIMA-SDK/ws/trunk/pom.xml> to org.apache.uima/uimaj/2.10.1-SNAPSHOT/uimaj-2.10.1-SNAPSHOT.pom
[JENKINS] Archiving <https://builds.apache.org/job/UIMA-SDK/ws/trunk/uimaj-ep-jcasgen/pom.xml>
to org.apache.uima/uimaj-ep-jcasgen/2.10.1-SNAPSHOT/uimaj-ep-jcasgen-2.10.1-SNAPSHOT.pom
[JENKINS] Archiving <https://builds.apache.org/job/UIMA-SDK/ws/trunk/uimaj-ep-jcasgen/target/org.apache.uima.jcas.jcasgenp_2.10.1.SNAPSHOT.jar>
to org.apache.uima/uimaj-ep-jcasgen/2.10.1-SNAPSHOT/uimaj-ep-jcasgen-2.10.1-SNAPSHOT.jar
[JENKINS] Archiving <https://builds.apache.org/job/UIMA-SDK/ws/trunk/uimaj-json/pom.xml>
to org.apache.uima/uimaj-json/2.10.1-SNAPSHOT/uimaj-json-2.10.1-SNAPSHOT.pom
[JENKINS] Archiving <https://builds.apache.org/job/UIMA-SDK/ws/trunk/uimaj-tools/pom.xml>
to org.apache.uima/uimaj-tools/2.10.1-SNAPSHOT/uimaj-tools-2.10.1-SNAPSHOT.pom
[JENKINS] Archiving <https://builds.apache.org/job/UIMA-SDK/ws/trunk/uimaj-tools/target/uima-tools.jar>
to org.apache.uima/uimaj-tools/2.10.1-SNAPSHOT/uimaj-tools-2.10.1-SNAPSHOT.jar
[JENKINS] Archiving <https://builds.apache.org/job/UIMA-SDK/ws/trunk/uima-docbook-tutorials-and-users-guides/pom.xml>
to org.apache.uima/uima-docbook-tutorials-and-users-guides/2.10.1-SNAPSHOT/uima-docbook-tutorials-and-users-guides-2.10.1-SNAPSHOT.pom
[JENKINS] Archiving <https://builds.apache.org/job/UIMA-SDK/ws/trunk/uimaj-adapter-soap/pom.xml>
to org.apache.uima/uimaj-adapter-soap/2.10.1-SNAPSHOT/uimaj-adapter-soap-2.10.1-SNAPSHOT.pom
[JENKINS] Archiving <https://builds.apache.org/job/UIMA-SDK/ws/trunk/uimaj-adapter-soap/target/uima-adapter-soap.jar>
to org.apache.uima/uimaj-adapter-soap/2.10.1-SNAPSHOT/uimaj-adapter-soap-2.10.1-SNAPSHOT.jar
[JENKINS] Archiving <https://builds.apache.org/job/UIMA-SDK/ws/trunk/uimaj-ep-pear-packager/pom.xml>
to org.apache.uima/uimaj-ep-pear-packager/2.10.1-SNAPSHOT/uimaj-ep-pear-packager-2.10.1-SNAPSHOT.pom
[JENKINS] Archiving <https://builds.apache.org/job/UIMA-SDK/ws/trunk/uimaj-ep-pear-packager/target/org.apache.uima.pear_2.10.1.SNAPSHOT.jar>
to org.apache.uima/uimaj-ep-pear-packager/2.10.1-SNAPSHOT/uimaj-ep-pear-packager-2.10.1-SNAPSHOT.jar
[JENKINS] Archiving <https://builds.apache.org/job/UIMA-SDK/ws/trunk/uima-docbook-overview-and-setup/pom.xml>
to org.apache.uima/uima-docbook-overview-and-setup/2.10.1-SNAPSHOT/uima-docbook-overview-and-setup-2.10.1-SNAPSHOT.pom
[JENKINS] Archiving <https://builds.apache.org/job/UIMA-SDK/ws/trunk/uima-docbook-references/pom.xml>
to org.apache.uima/uima-docbook-references/2.10.1-SNAPSHOT/uima-docbook-references-2.10.1-SNAPSHOT.pom
[JENKINS] Archiving <https://builds.apache.org/job/UIMA-SDK/ws/trunk/uimaj-cpe/pom.xml>
to org.apache.uima/uimaj-cpe/2.10.1-SNAPSHOT/uimaj-cpe-2.10.1-SNAPSHOT.pom
[JENKINS] Archiving <https://builds.apache.org/job/UIMA-SDK/ws/trunk/uimaj-cpe/target/uima-cpe.jar>
to org.apache.uima/uimaj-cpe/2.10.1-SNAPSHOT/uimaj-cpe-2.10.1-SNAPSHOT.jar
Sending e-mails to: dev@uima.apache.org
channel stopped
[WARNINGS] Skipping publisher since build result is FAILURE

Mime
View raw message